{"text_format":"1","workbook":"xlsx","n_sheets":3,"sheets":["BdD","EDIT","MONO"],"not_rendered":{"charts":0,"images":0,"macros":0,"external_links":0,"defined_names":1,"comments":0,"pivot_tables":0},"unopened":[],"bounds":{"document_bytes":16777216,"sheet_cells":100000,"rows_first":2000,"rows_last":500,"rows_between":2000,"halvings":0,"cell_chars":16384,"cell_head_chars":4096},"cells_cut":0,"cells_raw":0,"read":"whole","date_system":"1900"}

{"sheet":"BdD","index":0,"n_rows":65,"n_cols":12,"rows_kept":65,"cut":false,"hidden":false,"merged":[]}
["Nom","Info_1","Info_2","Info_3","Info_4","Info_5","Info_6","Info_7","Info_8",null,"Codage","Liste ref"]
["Marcel","Limoges","Blanc","Charente","Juillet","Q","Séquoïa","AA_43",43,null,{"$f":"A2&\"_\"&COUNTIF($A$2:A2,A2)","v":"Marcel_1"},"Roger"]
["Paul","Montpellier","Marron","Calvados","Mai","O","Tremble","AA_47",63,null,{"$f":"A3&\"_\"&COUNTIF($A$2:A3,A3)","v":"Paul_1"},"Paul"]
["Paul","Marseille","Azur","Aube","Août","l","Peuplier","AA_34",1,null,{"$f":"A4&\"_\"&COUNTIF($A$2:A4,A4)","v":"Paul_2"},"Marcel"]
["Gilles","Bézier","Indigo","Aube","Mai","G","Pin","AA_64",42,null,{"$f":"A5&\"_\"&COUNTIF($A$2:A5,A5)","v":"Gilles_1"},"André"]
["Lucas","Nice","Chrome","Ain","Décembre","W","If","AA_06",4,null,{"$f":"A6&\"_\"&COUNTIF($A$2:A6,A6)","v":"Lucas_1"},"Kevin"]
["Roger","Paris","Beige","Alpes De Haute Provence","Avril","D","Frêne","AA_10",56,null,{"$f":"A7&\"_\"&COUNTIF($A$2:A7,A7)","v":"Roger_1"},"Simone"]
["Marcel","Perpignan","Noir","Cantal","Février","X","Sycomore","AA_56",62,null,{"$f":"A8&\"_\"&COUNTIF($A$2:A8,A8)","v":"Marcel_2"},"Léa"]
["André","Rennes","Bleu Ciel","Dordogne","Février","A","Chêne","AA_54",47,null,{"$f":"A9&\"_\"&COUNTIF($A$2:A9,A9)","v":"André_1"},"Lucas"]
["Paul","Angoulème","Brun","Ain","Mars","Y","Tuyas","AA_45",12,null,{"$f":"A10&\"_\"&COUNTIF($A$2:A10,A10)","v":"Paul_3"},"Eric"]
["Simone","Narbonne","Jaune","Charente Maritime","Août","P","Baobab","AA_39",52,null,{"$f":"A11&\"_\"&COUNTIF($A$2:A11,A11)","v":"Simone_1"},"Gilles"]
["Eric","Pau","Beige","Ardennes","Juillet","M","Erable","AA_53",36,null,{"$f":"A12&\"_\"&COUNTIF($A$2:A12,A12)","v":"Eric_1"}]
["Lucas","Soisson","Bleu Roi","Ariege","Janvier","H","Mélèze","AA_55",9,null,{"$f":"A13&\"_\"&COUNTIF($A$2:A13,A13)","v":"Lucas_2"}]
["Eric","Paris","Indigo","Corse","Octobre","F","Sorbier","AA_48",30,null,{"$f":"A14&\"_\"&COUNTIF($A$2:A14,A14)","v":"Eric_2"}]
["Simone","Bézier","Cyan","Charente Maritime","Janvier","S","Palmier","AA_36",50,null,{"$f":"A15&\"_\"&COUNTIF($A$2:A15,A15)","v":"Simone_2"}]
["Kevin","Marseille","Noir","Aisne","Octobre","K","Olivier","AA_35",26,null,{"$f":"A16&\"_\"&COUNTIF($A$2:A16,A16)","v":"Kevin_1"}]
["André","Lyon","Bleu Roi","Aude","Janvier","l","Peuplier","AA_11",34,null,{"$f":"A17&\"_\"&COUNTIF($A$2:A17,A17)","v":"André_2"}]
["Lucas","Chaumont","Bleu Ciel","Cher","Novembre","H","Mélèze","AA_07",54,null,{"$f":"A18&\"_\"&COUNTIF($A$2:A18,A18)","v":"Lucas_3"}]
["Eric","Toulouse","Turquoise","Alpes Maritimes","Septembre","Y","Tuyas","AA_31",57,null,{"$f":"A19&\"_\"&COUNTIF($A$2:A19,A19)","v":"Eric_3"}]
["Lucas","Biarritz","Isabelle","Cantal","Octobre","O","Tremble","AA_27",23,null,{"$f":"A20&\"_\"&COUNTIF($A$2:A20,A20)","v":"Lucas_4"}]
["André","Angoulème","Beige","Ardeche","Juin","R","Saule","AA_52",14,null,{"$f":"A21&\"_\"&COUNTIF($A$2:A21,A21)","v":"André_3"}]
["Kevin","Grasse","Vert","Cote D'Or","Octobre","I","Epicéa","AA_14",6,null,{"$f":"A22&\"_\"&COUNTIF($A$2:A22,A22)","v":"Kevin_2"}]
["Paul","Briançon","Magenta","Ain","Septembre","T","Cornouiller","AA_33",17,null,{"$f":"A23&\"_\"&COUNTIF($A$2:A23,A23)","v":"Paul_4"}]
["Simone","Paris","Gris","Bas Rhin","Août","Q","Séquoïa","AA_49",44,null,{"$f":"A24&\"_\"&COUNTIF($A$2:A24,A24)","v":"Simone_3"}]
["Léa","Bordeaux","Rouge","Creuse","Juin","Z","Noyer","AA_15",7,null,{"$f":"A25&\"_\"&COUNTIF($A$2:A25,A25)","v":"Léa_1"}]
["Marcel","Lyon","Chrome","Dordogne","Novembre","M","Erable","AA_03",46,null,{"$f":"A26&\"_\"&COUNTIF($A$2:A26,A26)","v":"Marcel_3"}]
["Eric","Calais","Vert","Cotes D'Armor","Août","T","Cornouiller","AA_12",22,null,{"$f":"A27&\"_\"&COUNTIF($A$2:A27,A27)","v":"Eric_4"}]
["Léa","Compiègne","Violet","Ariege","Avril","l","Peuplier","AA_40",11,null,{"$f":"A28&\"_\"&COUNTIF($A$2:A28,A28)","v":"Léa_2"}]
["Léa","Vannes","Vermillon","Correze","Mars","S","Palmier","AA_63",29,null,{"$f":"A29&\"_\"&COUNTIF($A$2:A29,A29)","v":"Léa_3"}]
["Paul","Chaumont","Rouge","Alpes Maritimes","Mai","C","Bouleau","AA_21",41,null,{"$f":"A30&\"_\"&COUNTIF($A$2:A30,A30)","v":"Paul_5"}]
["Lucas","Calais","Bistre","Aube","Janvier","X","Sycomore","AA_44",2,null,{"$f":"A31&\"_\"&COUNTIF($A$2:A31,A31)","v":"Lucas_5"}]
["Gilles","Caen","Carmin","Alpes Maritimes","Mars","J","Murier","AA_61",20,null,{"$f":"A32&\"_\"&COUNTIF($A$2:A32,A32)","v":"Gilles_2"}]
["Léa","Limoges","Turquoise","Cotes D'Armor","Juillet","A","Chêne","AA_20",25,null,{"$f":"A33&\"_\"&COUNTIF($A$2:A33,A33)","v":"Léa_4"}]
["Paul","Montpellier","Cyan","Aisne","Juillet","W","If","AA_60",61,null,{"$f":"A34&\"_\"&COUNTIF($A$2:A34,A34)","v":"Paul_6"}]
["Marcel","Vannes","Bleu Roi","Drome","Avril","K","Olivier","AA_23",38,null,{"$f":"A35&\"_\"&COUNTIF($A$2:A35,A35)","v":"Marcel_4"}]
["Marcel","Clermont-Ferrand","Bleu","Aude","Janvier","B","Orme","AA_19",45,null,{"$f":"A36&\"_\"&COUNTIF($A$2:A36,A36)","v":"Marcel_5"}]
["André","Rennes","Marine","Cote D'Or","Septembre","E","Platane","AA_09",58,null,{"$f":"A37&\"_\"&COUNTIF($A$2:A37,A37)","v":"André_4"}]
["Kevin","Biarritz","Saumon","Charente","Juin","V","Cyprés","AA_24",48,null,{"$f":"A38&\"_\"&COUNTIF($A$2:A38,A38)","v":"Kevin_3"}]
["Roger","Pau","Jaune","Bouches Du Rhone","Février","C","Bouleau","AA_58",24,null,{"$f":"A39&\"_\"&COUNTIF($A$2:A39,A39)","v":"Roger_2"}]
["Roger","Nantes","Argent","Corse","Décembre","I","Epicéa","AA_62",39,null,{"$f":"A40&\"_\"&COUNTIF($A$2:A40,A40)","v":"Roger_3"}]
["Eric","Biarritz","Bistre","Bas Rhin","Décembre","V","Cyprés","AA_28",32,null,{"$f":"A41&\"_\"&COUNTIF($A$2:A41,A41)","v":"Eric_5"}]
["Simone","Clermont-Ferrand","Gris","Bouches Du Rhone","Mars","Z","Noyer","AA_42",28,null,{"$f":"A42&\"_\"&COUNTIF($A$2:A42,A42)","v":"Simone_4"}]
["Marcel","Narbonne","Brun","Correze","Décembre","U","Charme","AA_18",64,null,{"$f":"A43&\"_\"&COUNTIF($A$2:A43,A43)","v":"Marcel_6"}]
["Gilles","Marseille","Bleu","Allier","Juin","D","Frêne","AA_37",40,null,{"$f":"A44&\"_\"&COUNTIF($A$2:A44,A44)","v":"Gilles_3"}]
["Gilles","Briançon","Gris","Deux Sevres","Novembre","B","Orme","AA_22",27,null,{"$f":"A45&\"_\"&COUNTIF($A$2:A45,A45)","v":"Gilles_4"}]
["Léa","Bordeaux","Magenta","Aveyron","Novembre","N","Hêtre","AA_13",60,null,{"$f":"A46&\"_\"&COUNTIF($A$2:A46,A46)","v":"Léa_5"}]
["Léa","Nice","Vermillon","Doubs","Décembre","G","Pin","AA_29",49,null,{"$f":"A47&\"_\"&COUNTIF($A$2:A47,A47)","v":"Léa_6"}]
["Eric","Soisson","Carmin","Ardeche","Février","P","Baobab","AA_38",51,null,{"$f":"A48&\"_\"&COUNTIF($A$2:A48,A48)","v":"Eric_6"}]
["Simone","Perpignan","Marron","Ardennes","Novembre","E","Platane","AA_41",19,null,{"$f":"A49&\"_\"&COUNTIF($A$2:A49,A49)","v":"Simone_5"}]
["Roger","Toulouse","Saumon","Ardeche","Mars","A","Chêne","AA_51",21,null,{"$f":"A50&\"_\"&COUNTIF($A$2:A50,A50)","v":"Roger_4"}]
["André","Compiègne","Bleu Ciel","Ariege","Janvier","J","Murier","AA_08",35,null,{"$f":"A51&\"_\"&COUNTIF($A$2:A51,A51)","v":"André_5"}]
["André","Caen","Argent","Allier","Septembre","H","Mélèze","AA_50",5,null,{"$f":"A52&\"_\"&COUNTIF($A$2:A52,A52)","v":"André_6"}]
["Marcel","Nantes","Bleu","Doubs","Juin","F","Sorbier","AA_17",59,null,{"$f":"A53&\"_\"&COUNTIF($A$2:A53,A53)","v":"Marcel_7"}]
["Roger","Nantes","Magenta","Aisne","Avril","I","Epicéa","AA_26",33,null,{"$f":"A54&\"_\"&COUNTIF($A$2:A54,A54)","v":"Roger_5"}]
["Kevin","Bordeaux","Carmin","Aude","Mars","D","Frêne","AA_05",55,null,{"$f":"A55&\"_\"&COUNTIF($A$2:A55,A55)","v":"Kevin_4"}]
["Paul","Rennes","Blanc","Alpes De Haute Provence","Octobre","N","Hêtre","AA_02",53,null,{"$f":"A56&\"_\"&COUNTIF($A$2:A56,A56)","v":"Paul_7"}]
["Roger","Grasse","Noir","Cher","Avril","C","Bouleau","AA_16",8,null,{"$f":"A57&\"_\"&COUNTIF($A$2:A57,A57)","v":"Roger_6"}]
["Gilles","Briançon","Azur","Creuse","Juillet","J","Murier","AA_46",37,null,{"$f":"A58&\"_\"&COUNTIF($A$2:A58,A58)","v":"Gilles_5"}]
["Kevin","Poitier","Vert","Drome","Février","G","Pin","AA_30",15,null,{"$f":"A59&\"_\"&COUNTIF($A$2:A59,A59)","v":"Kevin_5"}]
["Simone","Vannes","Marron","Calvados","Avril","B","Orme","AA_01",10,null,{"$f":"A60&\"_\"&COUNTIF($A$2:A60,A60)","v":"Simone_6"}]
["Lucas","Lyon","Violet","Deux Sevres","Mai","U","Charme","AA_25",3,null,{"$f":"A61&\"_\"&COUNTIF($A$2:A61,A61)","v":"Lucas_6"}]
["Kevin","Calais","Jaune","Ardennes","Février","R","Saule","AA_32",31,null,{"$f":"A62&\"_\"&COUNTIF($A$2:A62,A62)","v":"Kevin_6"}]
["Gilles","Nice","Marine","Aveyron","Mai","K","Olivier","AA_04",16,null,{"$f":"A63&\"_\"&COUNTIF($A$2:A63,A63)","v":"Gilles_6"}]
["Roger","Toulouse","Isabelle","Alpes De Haute Provence","Août","F","Sorbier","AA_59",13,null,{"$f":"A64&\"_\"&COUNTIF($A$2:A64,A64)","v":"Roger_7"}]
["André","Poitier","Vermillon","Allier","Septembre","E","Platane","AA_57",18,null,{"$f":"A65&\"_\"&COUNTIF($A$2:A65,A65)","v":"André_7"}]

{"sheet":"EDIT","index":1,"n_rows":151,"n_cols":9,"rows_kept":151,"cut":false,"hidden":false,"merged":[]}
["Roger","<<< Sélectionner le nom"]
["INFO_1","INFO_2","INFO_3","INFO_4","INFO_5","INFO_6","INFO_7","INFO_8"]
[{"$f":"IF(COUNTIF(BdD!$A:$A,$A$1)>=ROW()-2,INDEX(BdD!B:B,MATCH($A$1&\"_\"&ROW()-2,BdD!$K:$K,0)),\"\")","v":"Paris"},{"$f":"IF(COUNTIF(BdD!$A:$A,$A$1)>=ROW()-2,INDEX(BdD!C:C,MATCH($A$1&\"_\"&ROW()-2,BdD!$K:$K,0)),\"\")","v":"Beige"},{"$f":"IF(COUNTIF(BdD!$A:$A,$A$1)>=ROW()-2,INDEX(BdD!D:D,MATCH($A$1&\"_\"&ROW()-2,BdD!$K:$K,0)),\"\")","v":"Alpes De Haute Provence"},{"$f":"IF(COUNTIF(BdD!$A:$A,$A$1)>=ROW()-2,INDEX(BdD!E:E,MATCH($A$1&\"_\"&ROW()-2,BdD!$K:$K,0)),\"\")","v":"Avril"},{"$f":"IF(COUNTIF(BdD!$A:$A,$A$1)>=ROW()-2,INDEX(BdD!F:F,MATCH($A$1&\"_\"&ROW()-2,BdD!$K:$K,0)),\"\")","v":"D"},{"$f":"IF(COUNTIF(BdD!$A:$A,$A$1)>=ROW()-2,INDEX(BdD!G:G,MATCH($A$1&\"_\"&ROW()-2,BdD!$K:$K,0)),\"\")","v":"Frêne"},{"$f":"IF(COUNTIF(BdD!$A:$A,$A$1)>=ROW()-2,INDEX(BdD!H:H,MATCH($A$1&\"_\"&ROW()-2,BdD!$K:$K,0)),\"\")","v":"AA_10"},{"$f":"IF(COUNTIF(BdD!$A:$A,$A$1)>=ROW()-2,INDEX(BdD!I:I,MATCH($A$1&\"_\"&ROW()-2,BdD!$K:$K,0)),\"\")","v":56}]
[{"$f":"IF(COUNTIF(BdD!$A:$A,$A$1)>=ROW()-2,INDEX(BdD!B:B,MATCH($A$1&\"_\"&ROW()-2,BdD!$K:$K,0)),\"\")","v":"Pau"},{"$f":"IF(COUNTIF(BdD!$A:$A,$A$1)>=ROW()-2,INDEX(BdD!C:C,MATCH($A$1&\"_\"&ROW()-2,BdD!$K:$K,0)),\"\")","v":"Jaune"},{"$f":"IF(COUNTIF(BdD!$A:$A,$A$1)>=ROW()-2,INDEX(BdD!D:D,MATCH($A$1&\"_\"&ROW()-2,BdD!$K:$K,0)),\"\")","v":"Bouches Du Rhone"},{"$f":"IF(COUNTIF(BdD!$A:$A,$A$1)>=ROW()-2,INDEX(BdD!E:E,MATCH($A$1&\"_\"&ROW()-2,BdD!$K:$K,0)),\"\")","v":"Février"},{"$f":"IF(COUNTIF(BdD!$A:$A,$A$1)>=ROW()-2,INDEX(BdD!F:F,MATCH($A$1&\"_\"&ROW()-2,BdD!$K:$K,0)),\"\")","v":"C"},{"$f":"IF(COUNTIF(BdD!$A:$A,$A$1)>=ROW()-2,INDEX(BdD!G:G,MATCH($A$1&\"_\"&ROW()-2,BdD!$K:$K,0)),\"\")","v":"Bouleau"},{"$f":"IF(COUNTIF(BdD!$A:$A,$A$1)>=ROW()-2,INDEX(BdD!H:H,MATCH($A$1&\"_\"&ROW()-2,BdD!$K:$K,0)),\"\")","v":"AA_58"},{"$f":"IF(COUNTIF(BdD!$A:$A,$A$1)>=ROW()-2,INDEX(BdD!I:I,MATCH($A$1&\"_\"&ROW()-2,BdD!$K:$K,0)),\"\")","v":24}]
[{"$f":"IF(COUNTIF(BdD!$A:$A,$A$1)>=ROW()-2,INDEX(BdD!B:B,MATCH($A$1&\"_\"&ROW()-2,BdD!$K:$K,0)),\"\")","v":"Nantes"},{"$f":"IF(COUNTIF(BdD!$A:$A,$A$1)>=ROW()-2,INDEX(BdD!C:C,MATCH($A$1&\"_\"&ROW()-2,BdD!$K:$K,0)),\"\")","v":"Argent"},{"$f":"IF(COUNTIF(BdD!$A:$A,$A$1)>=ROW()-2,INDEX(BdD!D:D,MATCH($A$1&\"_\"&ROW()-2,BdD!$K:$K,0)),\"\")","v":"Corse"},{"$f":"IF(COUNTIF(BdD!$A:$A,$A$1)>=ROW()-2,INDEX(BdD!E:E,MATCH($A$1&\"_\"&ROW()-2,BdD!$K:$K,0)),\"\")","v":"Décembre"},{"$f":"IF(COUNTIF(BdD!$A:$A,$A$1)>=ROW()-2,INDEX(BdD!F:F,MATCH($A$1&\"_\"&ROW()-2,BdD!$K:$K,0)),\"\")","v":"I"},{"$f":"IF(COUNTIF(BdD!$A:$A,$A$1)>=ROW()-2,INDEX(BdD!G:G,MATCH($A$1&\"_\"&ROW()-2,BdD!$K:$K,0)),\"\")","v":"Epicéa"},{"$f":"IF(COUNTIF(BdD!$A:$A,$A$1)>=ROW()-2,INDEX(BdD!H:H,MATCH($A$1&\"_\"&ROW()-2,BdD!$K:$K,0)),\"\")","v":"AA_62"},{"$f":"IF(COUNTIF(BdD!$A:$A,$A$1)>=ROW()-2,INDEX(BdD!I:I,MATCH($A$1&\"_\"&ROW()-2,BdD!$K:$K,0)),\"\")","v":39}]
[{"$f":"IF(COUNTIF(BdD!$A:$A,$A$1)>=ROW()-2,INDEX(BdD!B:B,MATCH($A$1&\"_\"&ROW()-2,BdD!$K:$K,0)),\"\")","v":"Toulouse"},{"$f":"IF(COUNTIF(BdD!$A:$A,$A$1)>=ROW()-2,INDEX(BdD!C:C,MATCH($A$1&\"_\"&ROW()-2,BdD!$K:$K,0)),\"\")","v":"Saumon"},{"$f":"IF(COUNTIF(BdD!$A:$A,$A$1)>=ROW()-2,INDEX(BdD!D:D,MATCH($A$1&\"_\"&ROW()-2,BdD!$K:$K,0)),\"\")","v":"Ardeche"},{"$f":"IF(COUNTIF(BdD!$A:$A,$A$1)>=ROW()-2,INDEX(BdD!E:E,MATCH($A$1&\"_\"&ROW()-2,BdD!$K:$K,0)),\"\")","v":"Mars"},{"$f":"IF(COUNTIF(BdD!$A:$A,$A$1)>=ROW()-2,INDEX(BdD!F:F,MATCH($A$1&\"_\"&ROW()-2,BdD!$K:$K,0)),\"\")","v":"A"},{"$f":"IF(COUNTIF(BdD!$A:$A,$A$1)>=ROW()-2,INDEX(BdD!G:G,MATCH($A$1&\"_\"&ROW()-2,BdD!$K:$K,0)),\"\")","v":"Chêne"},{"$f":"IF(COUNTIF(BdD!$A:$A,$A$1)>=ROW()-2,INDEX(BdD!H:H,MATCH($A$1&\"_\"&ROW()-2,BdD!$K:$K,0)),\"\")","v":"AA_51"},{"$f":"IF(COUNTIF(BdD!$A:$A,$A$1)>=ROW()-2,INDEX(BdD!I:I,MATCH($A$1&\"_\"&ROW()-2,BdD!$K:$K,0)),\"\")","v":21},"Voir le codage en colonne K de BdD"]
[{"$f":"IF(COUNTIF(BdD!$A:$A,$A$1)>=ROW()-2,INDEX(BdD!B:B,MATCH($A$1&\"_\"&ROW()-2,BdD!$K:$K,0)),\"\")","v":"Nantes"},{"$f":"IF(COUNTIF(BdD!$A:$A,$A$1)>=ROW()-2,INDEX(BdD!C:C,MATCH($A$1&\"_\"&ROW()-2,BdD!$K:$K,0)),\"\")","v":"Magenta"},{"$f":"IF(COUNTIF(BdD!$A:$A,$A$1)>=ROW()-2,INDEX(BdD!D:D,MATCH($A$1&\"_\"&ROW()-2,BdD!$K:$K,0)),\"\")","v":"Aisne"},{"$f":"IF(COUNTIF(BdD!$A:$A,$A$1)>=ROW()-2,INDEX(BdD!E:E,MATCH($A$1&\"_\"&ROW()-2,BdD!$K:$K,0)),\"\")","v":"Avril"},{"$f":"IF(COUNTIF(BdD!$A:$A,$A$1)>=ROW()-2,INDEX(BdD!F:F,MATCH($A$1&\"_\"&ROW()-2,BdD!$K:$K,0)),\"\")","v":"I"},{"$f":"IF(COUNTIF(BdD!$A:$A,$A$1)>=ROW()-2,INDEX(BdD!G:G,MATCH($A$1&\"_\"&ROW()-2,BdD!$K:$K,0)),\"\")","v":"Epicéa"},{"$f":"IF(COUNTIF(BdD!$A:$A,$A$1)>=ROW()-2,INDEX(BdD!H:H,MATCH($A$1&\"_\"&ROW()-2,BdD!$K:$K,0)),\"\")","v":"AA_26"},{"$f":"IF(COUNTIF(BdD!$A:$A,$A$1)>=ROW()-2,INDEX(BdD!I:I,MATCH($A$1&\"_\"&ROW()-2,BdD!$K:$K,0)),\"\")","v":33},"La liste de ref est nommée Ref pour validation en A1"]
[{"$f":"IF(COUNTIF(BdD!$A:$A,$A$1)>=ROW()-2,INDEX(BdD!B:B,MATCH($A$1&\"_\"&ROW()-2,BdD!$K:$K,0)),\"\")","v":"Grasse"},{"$f":"IF(COUNTIF(BdD!$A:$A,$A$1)>=ROW()-2,INDEX(BdD!C:C,MATCH($A$1&\"_\"&ROW()-2,BdD!$K:$K,0)),\"\")","v":"Noir"},{"$f":"IF(COUNTIF(BdD!$A:$A,$A$1)>=ROW()-2,INDEX(BdD!D:D,MATCH($A$1&\"_\"&ROW()-2,BdD!$K:$K,0)),\"\")","v":"Cher"},{"$f":"IF(COUNTIF(BdD!$A:$A,$A$1)>=ROW()-2,INDEX(BdD!E:E,MATCH($A$1&\"_\"&ROW()-2,BdD!$K:$K,0)),\"\")","v":"Avril"},{"$f":"IF(COUNTIF(BdD!$A:$A,$A$1)>=ROW()-2,INDEX(BdD!F:F,MATCH($A$1&\"_\"&ROW()-2,BdD!$K:$K,0)),\"\")","v":"C"},{"$f":"IF(COUNTIF(BdD!$A:$A,$A$1)>=ROW()-2,INDEX(BdD!G:G,MATCH($A$1&\"_\"&ROW()-2,BdD!$K:$K,0)),\"\")","v":"Bouleau"},{"$f":"IF(COUNTIF(BdD!$A:$A,$A$1)>=ROW()-2,INDEX(BdD!H:H,MATCH($A$1&\"_\"&ROW()-2,BdD!$K:$K,0)),\"\")","v":"AA_16"},{"$f":"IF(COUNTIF(BdD!$A:$A,$A$1)>=ROW()-2,INDEX(BdD!I:I,MATCH($A$1&\"_\"&ROW()-2,BdD!$K:$K,0)),\"\")","v":8}]
[{"$f":"IF(COUNTIF(BdD!$A:$A,$A$1)>=ROW()-2,INDEX(BdD!B:B,MATCH($A$1&\"_\"&ROW()-2,BdD!$K:$K,0)),\"\")","v":"Toulouse"},{"$f":"IF(COUNTIF(BdD!$A:$A,$A$1)>=ROW()-2,INDEX(BdD!C:C,MATCH($A$1&\"_\"&ROW()-2,BdD!$K:$K,0)),\"\")","v":"Isabelle"},{"$f":"IF(COUNTIF(BdD!$A:$A,$A$1)>=ROW()-2,INDEX(BdD!D:D,MATCH($A$1&\"_\"&ROW()-2,BdD!$K:$K,0)),\"\")","v":"Alpes De Haute Provence"},{"$f":"IF(COUNTIF(BdD!$A:$A,$A$1)>=ROW()-2,INDEX(BdD!E:E,MATCH($A$1&\"_\"&ROW()-2,BdD!$K:$K,0)),\"\")","v":"Août"},{"$f":"IF(COUNTIF(BdD!$A:$A,$A$1)>=ROW()-2,INDEX(BdD!F:F,MATCH($A$1&\"_\"&ROW()-2,BdD!$K:$K,0)),\"\")","v":"F"},{"$f":"IF(COUNTIF(BdD!$A:$A,$A$1)>=ROW()-2,INDEX(BdD!G:G,MATCH($A$1&\"_\"&ROW()-2,BdD!$K:$K,0)),\"\")","v":"Sorbier"},{"$f":"IF(COUNTIF(BdD!$A:$A,$A$1)>=ROW()-2,INDEX(BdD!H:H,MATCH($A$1&\"_\"&ROW()-2,BdD!$K:$K,0)),\"\")","v":"AA_59"},{"$f":"IF(COUNTIF(BdD!$A:$A,$A$1)>=ROW()-2,INDEX(BdD!I:I,MATCH($A$1&\"_\"&ROW()-2,BdD!$K:$K,0)),\"\")","v":13},"Pour créer un tableau par référence"]
[{"$f":"IF(COUNTIF(BdD!$A:$A,$A$1)>=ROW()-2,INDEX(BdD!B:B,MATCH($A$1&\"_\"&ROW()-2,BdD!$K:$K,0)),\"\")","v":""},{"$f":"IF(COUNTIF(BdD!$A:$A,$A$1)>=ROW()-2,INDEX(BdD!C:C,MATCH($A$1&\"_\"&ROW()-2,BdD!$K:$K,0)),\"\")","v":""},{"$f":"IF(COUNTIF(BdD!$A:$A,$A$1)>=ROW()-2,INDEX(BdD!D:D,MATCH($A$1&\"_\"&ROW()-2,BdD!$K:$K,0)),\"\")","v":""},{"$f":"IF(COUNTIF(BdD!$A:$A,$A$1)>=ROW()-2,INDEX(BdD!E:E,MATCH($A$1&\"_\"&ROW()-2,BdD!$K:$K,0)),\"\")","v":""},{"$f":"IF(COUNTIF(BdD!$A:$A,$A$1)>=ROW()-2,INDEX(BdD!F:F,MATCH($A$1&\"_\"&ROW()-2,BdD!$K:$K,0)),\"\")","v":""},{"$f":"IF(COUNTIF(BdD!$A:$A,$A$1)>=ROW()-2,INDEX(BdD!G:G,MATCH($A$1&\"_\"&ROW()-2,BdD!$K:$K,0)),\"\")","v":""},{"$f":"IF(COUNTIF(BdD!$A:$A,$A$1)>=ROW()-2,INDEX(BdD!H:H,MATCH($A$1&\"_\"&ROW()-2,BdD!$K:$K,0)),\"\")","v":""},{"$f":"IF(COUNTIF(BdD!$A:$A,$A$1)>=ROW()-2,INDEX(BdD!I:I,MATCH($A$1&\"_\"&ROW()-2,BdD!$K:$K,0)),\"\")","v":""},"il suffit de copier cette feuille et de modifier le nom en A1"]
[{"$f":"IF(COUNTIF(BdD!$A:$A,$A$1)>=ROW()-2,INDEX(BdD!B:B,MATCH($A$1&\"_\"&ROW()-2,BdD!$K:$K,0)),\"\")","v":""},{"$f":"IF(COUNTIF(BdD!$A:$A,$A$1)>=ROW()-2,INDEX(BdD!C:C,MATCH($A$1&\"_\"&ROW()-2,BdD!$K:$K,0)),\"\")","v":""},{"$f":"IF(COUNTIF(BdD!$A:$A,$A$1)>=ROW()-2,INDEX(BdD!D:D,MATCH($A$1&\"_\"&ROW()-2,BdD!$K:$K,0)),\"\")","v":""},{"$f":"IF(COUNTIF(BdD!$A:$A,$A$1)>=ROW()-2,INDEX(BdD!E:E,MATCH($A$1&\"_\"&ROW()-2,BdD!$K:$K,0)),\"\")","v":""},{"$f":"IF(COUNTIF(BdD!$A:$A,$A$1)>=ROW()-2,INDEX(BdD!F:F,MATCH($A$1&\"_\"&ROW()-2,BdD!$K:$K,0)),\"\")","v":""},{"$f":"IF(COUNTIF(BdD!$A:$A,$A$1)>=ROW()-2,INDEX(BdD!G:G,MATCH($A$1&\"_\"&ROW()-2,BdD!$K:$K,0)),\"\")","v":""},{"$f":"IF(COUNTIF(BdD!$A:$A,$A$1)>=ROW()-2,INDEX(BdD!H:H,MATCH($A$1&\"_\"&ROW()-2,BdD!$K:$K,0)),\"\")","v":""},{"$f":"IF(COUNTIF(BdD!$A:$A,$A$1)>=ROW()-2,INDEX(BdD!I:I,MATCH($A$1&\"_\"&ROW()-2,BdD!$K:$K,0)),\"\")","v":""}]
[{"$f":"IF(COUNTIF(BdD!$A:$A,$A$1)>=ROW()-2,INDEX(BdD!B:B,MATCH($A$1&\"_\"&ROW()-2,BdD!$K:$K,0)),\"\")","v":""},{"$f":"IF(COUNTIF(BdD!$A:$A,$A$1)>=ROW()-2,INDEX(BdD!C:C,MATCH($A$1&\"_\"&ROW()-2,BdD!$K:$K,0)),\"\")","v":""},{"$f":"IF(COUNTIF(BdD!$A:$A,$A$1)>=ROW()-2,INDEX(BdD!D:D,MATCH($A$1&\"_\"&ROW()-2,BdD!$K:$K,0)),\"\")","v":""},{"$f":"IF(COUNTIF(BdD!$A:$A,$A$1)>=ROW()-2,INDEX(BdD!E:E,MATCH($A$1&\"_\"&ROW()-2,BdD!$K:$K,0)),\"\")","v":""},{"$f":"IF(COUNTIF(BdD!$A:$A,$A$1)>=ROW()-2,INDEX(BdD!F:F,MATCH($A$1&\"_\"&ROW()-2,BdD!$K:$K,0)),\"\")","v":""},{"$f":"IF(COUNTIF(BdD!$A:$A,$A$1)>=ROW()-2,INDEX(BdD!G:G,MATCH($A$1&\"_\"&ROW()-2,BdD!$K:$K,0)),\"\")","v":""},{"$f":"IF(COUNTIF(BdD!$A:$A,$A$1)>=ROW()-2,INDEX(BdD!H:H,MATCH($A$1&\"_\"&ROW()-2,BdD!$K:$K,0)),\"\")","v":""},{"$f":"IF(COUNTIF(BdD!$A:$A,$A$1)>=ROW()-2,INDEX(BdD!I:I,MATCH($A$1&\"_\"&ROW()-2,BdD!$K:$K,0)),\"\")","v":""}]
[{"$f":"IF(COUNTIF(BdD!$A:$A,$A$1)>=ROW()-2,INDEX(BdD!B:B,MATCH($A$1&\"_\"&ROW()-2,BdD!$K:$K,0)),\"\")","v":""},{"$f":"IF(COUNTIF(BdD!$A:$A,$A$1)>=ROW()-2,INDEX(BdD!C:C,MATCH($A$1&\"_\"&ROW()-2,BdD!$K:$K,0)),\"\")","v":""},{"$f":"IF(COUNTIF(BdD!$A:$A,$A$1)>=ROW()-2,INDEX(BdD!D:D,MATCH($A$1&\"_\"&ROW()-2,BdD!$K:$K,0)),\"\")","v":""},{"$f":"IF(COUNTIF(BdD!$A:$A,$A$1)>=ROW()-2,INDEX(BdD!E:E,MATCH($A$1&\"_\"&ROW()-2,BdD!$K:$K,0)),\"\")","v":""},{"$f":"IF(COUNTIF(BdD!$A:$A,$A$1)>=ROW()-2,INDEX(BdD!F:F,MATCH($A$1&\"_\"&ROW()-2,BdD!$K:$K,0)),\"\")","v":""},{"$f":"IF(COUNTIF(BdD!$A:$A,$A$1)>=ROW()-2,INDEX(BdD!G:G,MATCH($A$1&\"_\"&ROW()-2,BdD!$K:$K,0)),\"\")","v":""},{"$f":"IF(COUNTIF(BdD!$A:$A,$A$1)>=ROW()-2,INDEX(BdD!H:H,MATCH($A$1&\"_\"&ROW()-2,BdD!$K:$K,0)),\"\")","v":""},{"$f":"IF(COUNTIF(BdD!$A:$A,$A$1)>=ROW()-2,INDEX(BdD!I:I,MATCH($A$1&\"_\"&ROW()-2,BdD!$K:$K,0)),\"\")","v":""}]
[{"$f":"IF(COUNTIF(BdD!$A:$A,$A$1)>=ROW()-2,INDEX(BdD!B:B,MATCH($A$1&\"_\"&ROW()-2,BdD!$K:$K,0)),\"\")","v":""},{"$f":"IF(COUNTIF(BdD!$A:$A,$A$1)>=ROW()-2,INDEX(BdD!C:C,MATCH($A$1&\"_\"&ROW()-2,BdD!$K:$K,0)),\"\")","v":""},{"$f":"IF(COUNTIF(BdD!$A:$A,$A$1)>=ROW()-2,INDEX(BdD!D:D,MATCH($A$1&\"_\"&ROW()-2,BdD!$K:$K,0)),\"\")","v":""},{"$f":"IF(COUNTIF(BdD!$A:$A,$A$1)>=ROW()-2,INDEX(BdD!E:E,MATCH($A$1&\"_\"&ROW()-2,BdD!$K:$K,0)),\"\")","v":""},{"$f":"IF(COUNTIF(BdD!$A:$A,$A$1)>=ROW()-2,INDEX(BdD!F:F,MATCH($A$1&\"_\"&ROW()-2,BdD!$K:$K,0)),\"\")","v":""},{"$f":"IF(COUNTIF(BdD!$A:$A,$A$1)>=ROW()-2,INDEX(BdD!G:G,MATCH($A$1&\"_\"&ROW()-2,BdD!$K:$K,0)),\"\")","v":""},{"$f":"IF(COUNTIF(BdD!$A:$A,$A$1)>=ROW()-2,INDEX(BdD!H:H,MATCH($A$1&\"_\"&ROW()-2,BdD!$K:$K,0)),\"\")","v":""},{"$f":"IF(COUNTIF(BdD!$A:$A,$A$1)>=ROW()-2,INDEX(BdD!I:I,MATCH($A$1&\"_\"&ROW()-2,BdD!$K:$K,0)),\"\")","v":""}]
[{"$f":"IF(COUNTIF(BdD!$A:$A,$A$1)>=ROW()-2,INDEX(BdD!B:B,MATCH($A$1&\"_\"&ROW()-2,BdD!$K:$K,0)),\"\")","v":""},{"$f":"IF(COUNTIF(BdD!$A:$A,$A$1)>=ROW()-2,INDEX(BdD!C:C,MATCH($A$1&\"_\"&ROW()-2,BdD!$K:$K,0)),\"\")","v":""},{"$f":"IF(COUNTIF(BdD!$A:$A,$A$1)>=ROW()-2,INDEX(BdD!D:D,MATCH($A$1&\"_\"&ROW()-2,BdD!$K:$K,0)),\"\")","v":""},{"$f":"IF(COUNTIF(BdD!$A:$A,$A$1)>=ROW()-2,INDEX(BdD!E:E,MATCH($A$1&\"_\"&ROW()-2,BdD!$K:$K,0)),\"\")","v":""},{"$f":"IF(COUNTIF(BdD!$A:$A,$A$1)>=ROW()-2,INDEX(BdD!F:F,MATCH($A$1&\"_\"&ROW()-2,BdD!$K:$K,0)),\"\")","v":""},{"$f":"IF(COUNTIF(BdD!$A:$A,$A$1)>=ROW()-2,INDEX(BdD!G:G,MATCH($A$1&\"_\"&ROW()-2,BdD!$K:$K,0)),\"\")","v":""},{"$f":"IF(COUNTIF(BdD!$A:$A,$A$1)>=ROW()-2,INDEX(BdD!H:H,MATCH($A$1&\"_\"&ROW()-2,BdD!$K:$K,0)),\"\")","v":""},{"$f":"IF(COUNTIF(BdD!$A:$A,$A$1)>=ROW()-2,INDEX(BdD!I:I,MATCH($A$1&\"_\"&ROW()-2,BdD!$K:$K,0)),\"\")","v":""}]
[{"$f":"IF(COUNTIF(BdD!$A:$A,$A$1)>=ROW()-2,INDEX(BdD!B:B,MATCH($A$1&\"_\"&ROW()-2,BdD!$K:$K,0)),\"\")","v":""},{"$f":"IF(COUNTIF(BdD!$A:$A,$A$1)>=ROW()-2,INDEX(BdD!C:C,MATCH($A$1&\"_\"&ROW()-2,BdD!$K:$K,0)),\"\")","v":""},{"$f":"IF(COUNTIF(BdD!$A:$A,$A$1)>=ROW()-2,INDEX(BdD!D:D,MATCH($A$1&\"_\"&ROW()-2,BdD!$K:$K,0)),\"\")","v":""},{"$f":"IF(COUNTIF(BdD!$A:$A,$A$1)>=ROW()-2,INDEX(BdD!E:E,MATCH($A$1&\"_\"&ROW()-2,BdD!$K:$K,0)),\"\")","v":""},{"$f":"IF(COUNTIF(BdD!$A:$A,$A$1)>=ROW()-2,INDEX(BdD!F:F,MATCH($A$1&\"_\"&ROW()-2,BdD!$K:$K,0)),\"\")","v":""},{"$f":"IF(COUNTIF(BdD!$A:$A,$A$1)>=ROW()-2,INDEX(BdD!G:G,MATCH($A$1&\"_\"&ROW()-2,BdD!$K:$K,0)),\"\")","v":""},{"$f":"IF(COUNTIF(BdD!$A:$A,$A$1)>=ROW()-2,INDEX(BdD!H:H,MATCH($A$1&\"_\"&ROW()-2,BdD!$K:$K,0)),\"\")","v":""},{"$f":"IF(COUNTIF(BdD!$A:$A,$A$1)>=ROW()-2,INDEX(BdD!I:I,MATCH($A$1&\"_\"&ROW()-2,BdD!$K:$K,0)),\"\")","v":""}]
[{"$f":"IF(COUNTIF(BdD!$A:$A,$A$1)>=ROW()-2,INDEX(BdD!B:B,MATCH($A$1&\"_\"&ROW()-2,BdD!$K:$K,0)),\"\")","v":""},{"$f":"IF(COUNTIF(BdD!$A:$A,$A$1)>=ROW()-2,INDEX(BdD!C:C,MATCH($A$1&\"_\"&ROW()-2,BdD!$K:$K,0)),\"\")","v":""},{"$f":"IF(COUNTIF(BdD!$A:$A,$A$1)>=ROW()-2,INDEX(BdD!D:D,MATCH($A$1&\"_\"&ROW()-2,BdD!$K:$K,0)),\"\")","v":""},{"$f":"IF(COUNTIF(BdD!$A:$A,$A$1)>=ROW()-2,INDEX(BdD!E:E,MATCH($A$1&\"_\"&ROW()-2,BdD!$K:$K,0)),\"\")","v":""},{"$f":"IF(COUNTIF(BdD!$A:$A,$A$1)>=ROW()-2,INDEX(BdD!F:F,MATCH($A$1&\"_\"&ROW()-2,BdD!$K:$K,0)),\"\")","v":""},{"$f":"IF(COUNTIF(BdD!$A:$A,$A$1)>=ROW()-2,INDEX(BdD!G:G,MATCH($A$1&\"_\"&ROW()-2,BdD!$K:$K,0)),\"\")","v":""},{"$f":"IF(COUNTIF(BdD!$A:$A,$A$1)>=ROW()-2,INDEX(BdD!H:H,MATCH($A$1&\"_\"&ROW()-2,BdD!$K:$K,0)),\"\")","v":""},{"$f":"IF(COUNTIF(BdD!$A:$A,$A$1)>=ROW()-2,INDEX(BdD!I:I,MATCH($A$1&\"_\"&ROW()-2,BdD!$K:$K,0)),\"\")","v":""}]
[{"$f":"IF(COUNTIF(BdD!$A:$A,$A$1)>=ROW()-2,INDEX(BdD!B:B,MATCH($A$1&\"_\"&ROW()-2,BdD!$K:$K,0)),\"\")","v":""},{"$f":"IF(COUNTIF(BdD!$A:$A,$A$1)>=ROW()-2,INDEX(BdD!C:C,MATCH($A$1&\"_\"&ROW()-2,BdD!$K:$K,0)),\"\")","v":""},{"$f":"IF(COUNTIF(BdD!$A:$A,$A$1)>=ROW()-2,INDEX(BdD!D:D,MATCH($A$1&\"_\"&ROW()-2,BdD!$K:$K,0)),\"\")","v":""},{"$f":"IF(COUNTIF(BdD!$A:$A,$A$1)>=ROW()-2,INDEX(BdD!E:E,MATCH($A$1&\"_\"&ROW()-2,BdD!$K:$K,0)),\"\")","v":""},{"$f":"IF(COUNTIF(BdD!$A:$A,$A$1)>=ROW()-2,INDEX(BdD!F:F,MATCH($A$1&\"_\"&ROW()-2,BdD!$K:$K,0)),\"\")","v":""},{"$f":"IF(COUNTIF(BdD!$A:$A,$A$1)>=ROW()-2,INDEX(BdD!G:G,MATCH($A$1&\"_\"&ROW()-2,BdD!$K:$K,0)),\"\")","v":""},{"$f":"IF(COUNTIF(BdD!$A:$A,$A$1)>=ROW()-2,INDEX(BdD!H:H,MATCH($A$1&\"_\"&ROW()-2,BdD!$K:$K,0)),\"\")","v":""},{"$f":"IF(COUNTIF(BdD!$A:$A,$A$1)>=ROW()-2,INDEX(BdD!I:I,MATCH($A$1&\"_\"&ROW()-2,BdD!$K:$K,0)),\"\")","v":""}]
[{"$f":"IF(COUNTIF(BdD!$A:$A,$A$1)>=ROW()-2,INDEX(BdD!B:B,MATCH($A$1&\"_\"&ROW()-2,BdD!$K:$K,0)),\"\")","v":""},{"$f":"IF(COUNTIF(BdD!$A:$A,$A$1)>=ROW()-2,INDEX(BdD!C:C,MATCH($A$1&\"_\"&ROW()-2,BdD!$K:$K,0)),\"\")","v":""},{"$f":"IF(COUNTIF(BdD!$A:$A,$A$1)>=ROW()-2,INDEX(BdD!D:D,MATCH($A$1&\"_\"&ROW()-2,BdD!$K:$K,0)),\"\")","v":""},{"$f":"IF(COUNTIF(BdD!$A:$A,$A$1)>=ROW()-2,INDEX(BdD!E:E,MATCH($A$1&\"_\"&ROW()-2,BdD!$K:$K,0)),\"\")","v":""},{"$f":"IF(COUNTIF(BdD!$A:$A,$A$1)>=ROW()-2,INDEX(BdD!F:F,MATCH($A$1&\"_\"&ROW()-2,BdD!$K:$K,0)),\"\")","v":""},{"$f":"IF(COUNTIF(BdD!$A:$A,$A$1)>=ROW()-2,INDEX(BdD!G:G,MATCH($A$1&\"_\"&ROW()-2,BdD!$K:$K,0)),\"\")","v":""},{"$f":"IF(COUNTIF(BdD!$A:$A,$A$1)>=ROW()-2,INDEX(BdD!H:H,MATCH($A$1&\"_\"&ROW()-2,BdD!$K:$K,0)),\"\")","v":""},{"$f":"IF(COUNTIF(BdD!$A:$A,$A$1)>=ROW()-2,INDEX(BdD!I:I,MATCH($A$1&\"_\"&ROW()-2,BdD!$K:$K,0)),\"\")","v":""}]
[{"$f":"IF(COUNTIF(BdD!$A:$A,$A$1)>=ROW()-2,INDEX(BdD!B:B,MATCH($A$1&\"_\"&ROW()-2,BdD!$K:$K,0)),\"\")","v":""},{"$f":"IF(COUNTIF(BdD!$A:$A,$A$1)>=ROW()-2,INDEX(BdD!C:C,MATCH($A$1&\"_\"&ROW()-2,BdD!$K:$K,0)),\"\")","v":""},{"$f":"IF(COUNTIF(BdD!$A:$A,$A$1)>=ROW()-2,INDEX(BdD!D:D,MATCH($A$1&\"_\"&ROW()-2,BdD!$K:$K,0)),\"\")","v":""},{"$f":"IF(COUNTIF(BdD!$A:$A,$A$1)>=ROW()-2,INDEX(BdD!E:E,MATCH($A$1&\"_\"&ROW()-2,BdD!$K:$K,0)),\"\")","v":""},{"$f":"IF(COUNTIF(BdD!$A:$A,$A$1)>=ROW()-2,INDEX(BdD!F:F,MATCH($A$1&\"_\"&ROW()-2,BdD!$K:$K,0)),\"\")","v":""},{"$f":"IF(COUNTIF(BdD!$A:$A,$A$1)>=ROW()-2,INDEX(BdD!G:G,MATCH($A$1&\"_\"&ROW()-2,BdD!$K:$K,0)),\"\")","v":""},{"$f":"IF(COUNTIF(BdD!$A:$A,$A$1)>=ROW()-2,INDEX(BdD!H:H,MATCH($A$1&\"_\"&ROW()-2,BdD!$K:$K,0)),\"\")","v":""},{"$f":"IF(COUNTIF(BdD!$A:$A,$A$1)>=ROW()-2,INDEX(BdD!I:I,MATCH($A$1&\"_\"&ROW()-2,BdD!$K:$K,0)),\"\")","v":""}]
[{"$f":"IF(COUNTIF(BdD!$A:$A,$A$1)>=ROW()-2,INDEX(BdD!B:B,MATCH($A$1&\"_\"&ROW()-2,BdD!$K:$K,0)),\"\")","v":""},{"$f":"IF(COUNTIF(BdD!$A:$A,$A$1)>=ROW()-2,INDEX(BdD!C:C,MATCH($A$1&\"_\"&ROW()-2,BdD!$K:$K,0)),\"\")","v":""},{"$f":"IF(COUNTIF(BdD!$A:$A,$A$1)>=ROW()-2,INDEX(BdD!D:D,MATCH($A$1&\"_\"&ROW()-2,BdD!$K:$K,0)),\"\")","v":""},{"$f":"IF(COUNTIF(BdD!$A:$A,$A$1)>=ROW()-2,INDEX(BdD!E:E,MATCH($A$1&\"_\"&ROW()-2,BdD!$K:$K,0)),\"\")","v":""},{"$f":"IF(COUNTIF(BdD!$A:$A,$A$1)>=ROW()-2,INDEX(BdD!F:F,MATCH($A$1&\"_\"&ROW()-2,BdD!$K:$K,0)),\"\")","v":""},{"$f":"IF(COUNTIF(BdD!$A:$A,$A$1)>=ROW()-2,INDEX(BdD!G:G,MATCH($A$1&\"_\"&ROW()-2,BdD!$K:$K,0)),\"\")","v":""},{"$f":"IF(COUNTIF(BdD!$A:$A,$A$1)>=ROW()-2,INDEX(BdD!H:H,MATCH($A$1&\"_\"&ROW()-2,BdD!$K:$K,0)),\"\")","v":""},{"$f":"IF(COUNTIF(BdD!$A:$A,$A$1)>=ROW()-2,INDEX(BdD!I:I,MATCH($A$1&\"_\"&ROW()-2,BdD!$K:$K,0)),\"\")","v":""}]
[{"$f":"IF(COUNTIF(BdD!$A:$A,$A$1)>=ROW()-2,INDEX(BdD!B:B,MATCH($A$1&\"_\"&ROW()-2,BdD!$K:$K,0)),\"\")","v":""},{"$f":"IF(COUNTIF(BdD!$A:$A,$A$1)>=ROW()-2,INDEX(BdD!C:C,MATCH($A$1&\"_\"&ROW()-2,BdD!$K:$K,0)),\"\")","v":""},{"$f":"IF(COUNTIF(BdD!$A:$A,$A$1)>=ROW()-2,INDEX(BdD!D:D,MATCH($A$1&\"_\"&ROW()-2,BdD!$K:$K,0)),\"\")","v":""},{"$f":"IF(COUNTIF(BdD!$A:$A,$A$1)>=ROW()-2,INDEX(BdD!E:E,MATCH($A$1&\"_\"&ROW()-2,BdD!$K:$K,0)),\"\")","v":""},{"$f":"IF(COUNTIF(BdD!$A:$A,$A$1)>=ROW()-2,INDEX(BdD!F:F,MATCH($A$1&\"_\"&ROW()-2,BdD!$K:$K,0)),\"\")","v":""},{"$f":"IF(COUNTIF(BdD!$A:$A,$A$1)>=ROW()-2,INDEX(BdD!G:G,MATCH($A$1&\"_\"&ROW()-2,BdD!$K:$K,0)),\"\")","v":""},{"$f":"IF(COUNTIF(BdD!$A:$A,$A$1)>=ROW()-2,INDEX(BdD!H:H,MATCH($A$1&\"_\"&ROW()-2,BdD!$K:$K,0)),\"\")","v":""},{"$f":"IF(COUNTIF(BdD!$A:$A,$A$1)>=ROW()-2,INDEX(BdD!I:I,MATCH($A$1&\"_\"&ROW()-2,BdD!$K:$K,0)),\"\")","v":""}]
[{"$f":"IF(COUNTIF(BdD!$A:$A,$A$1)>=ROW()-2,INDEX(BdD!B:B,MATCH($A$1&\"_\"&ROW()-2,BdD!$K:$K,0)),\"\")","v":""},{"$f":"IF(COUNTIF(BdD!$A:$A,$A$1)>=ROW()-2,INDEX(BdD!C:C,MATCH($A$1&\"_\"&ROW()-2,BdD!$K:$K,0)),\"\")","v":""},{"$f":"IF(COUNTIF(BdD!$A:$A,$A$1)>=ROW()-2,INDEX(BdD!D:D,MATCH($A$1&\"_\"&ROW()-2,BdD!$K:$K,0)),\"\")","v":""},{"$f":"IF(COUNTIF(BdD!$A:$A,$A$1)>=ROW()-2,INDEX(BdD!E:E,MATCH($A$1&\"_\"&ROW()-2,BdD!$K:$K,0)),\"\")","v":""},{"$f":"IF(COUNTIF(BdD!$A:$A,$A$1)>=ROW()-2,INDEX(BdD!F:F,MATCH($A$1&\"_\"&ROW()-2,BdD!$K:$K,0)),\"\")","v":""},{"$f":"IF(COUNTIF(BdD!$A:$A,$A$1)>=ROW()-2,INDEX(BdD!G:G,MATCH($A$1&\"_\"&ROW()-2,BdD!$K:$K,0)),\"\")","v":""},{"$f":"IF(COUNTIF(BdD!$A:$A,$A$1)>=ROW()-2,INDEX(BdD!H:H,MATCH($A$1&\"_\"&ROW()-2,BdD!$K:$K,0)),\"\")","v":""},{"$f":"IF(COUNTIF(BdD!$A:$A,$A$1)>=ROW()-2,INDEX(BdD!I:I,MATCH($A$1&\"_\"&ROW()-2,BdD!$K:$K,0)),\"\")","v":""}]
[{"$f":"IF(COUNTIF(BdD!$A:$A,$A$1)>=ROW()-2,INDEX(BdD!B:B,MATCH($A$1&\"_\"&ROW()-2,BdD!$K:$K,0)),\"\")","v":""},{"$f":"IF(COUNTIF(BdD!$A:$A,$A$1)>=ROW()-2,INDEX(BdD!C:C,MATCH($A$1&\"_\"&ROW()-2,BdD!$K:$K,0)),\"\")","v":""},{"$f":"IF(COUNTIF(BdD!$A:$A,$A$1)>=ROW()-2,INDEX(BdD!D:D,MATCH($A$1&\"_\"&ROW()-2,BdD!$K:$K,0)),\"\")","v":""},{"$f":"IF(COUNTIF(BdD!$A:$A,$A$1)>=ROW()-2,INDEX(BdD!E:E,MATCH($A$1&\"_\"&ROW()-2,BdD!$K:$K,0)),\"\")","v":""},{"$f":"IF(COUNTIF(BdD!$A:$A,$A$1)>=ROW()-2,INDEX(BdD!F:F,MATCH($A$1&\"_\"&ROW()-2,BdD!$K:$K,0)),\"\")","v":""},{"$f":"IF(COUNTIF(BdD!$A:$A,$A$1)>=ROW()-2,INDEX(BdD!G:G,MATCH($A$1&\"_\"&ROW()-2,BdD!$K:$K,0)),\"\")","v":""},{"$f":"IF(COUNTIF(BdD!$A:$A,$A$1)>=ROW()-2,INDEX(BdD!H:H,MATCH($A$1&\"_\"&ROW()-2,BdD!$K:$K,0)),\"\")","v":""},{"$f":"IF(COUNTIF(BdD!$A:$A,$A$1)>=ROW()-2,INDEX(BdD!I:I,MATCH($A$1&\"_\"&ROW()-2,BdD!$K:$K,0)),\"\")","v":""}]
[{"$f":"IF(COUNTIF(BdD!$A:$A,$A$1)>=ROW()-2,INDEX(BdD!B:B,MATCH($A$1&\"_\"&ROW()-2,BdD!$K:$K,0)),\"\")","v":""},{"$f":"IF(COUNTIF(BdD!$A:$A,$A$1)>=ROW()-2,INDEX(BdD!C:C,MATCH($A$1&\"_\"&ROW()-2,BdD!$K:$K,0)),\"\")","v":""},{"$f":"IF(COUNTIF(BdD!$A:$A,$A$1)>=ROW()-2,INDEX(BdD!D:D,MATCH($A$1&\"_\"&ROW()-2,BdD!$K:$K,0)),\"\")","v":""},{"$f":"IF(COUNTIF(BdD!$A:$A,$A$1)>=ROW()-2,INDEX(BdD!E:E,MATCH($A$1&\"_\"&ROW()-2,BdD!$K:$K,0)),\"\")","v":""},{"$f":"IF(COUNTIF(BdD!$A:$A,$A$1)>=ROW()-2,INDEX(BdD!F:F,MATCH($A$1&\"_\"&ROW()-2,BdD!$K:$K,0)),\"\")","v":""},{"$f":"IF(COUNTIF(BdD!$A:$A,$A$1)>=ROW()-2,INDEX(BdD!G:G,MATCH($A$1&\"_\"&ROW()-2,BdD!$K:$K,0)),\"\")","v":""},{"$f":"IF(COUNTIF(BdD!$A:$A,$A$1)>=ROW()-2,INDEX(BdD!H:H,MATCH($A$1&\"_\"&ROW()-2,BdD!$K:$K,0)),\"\")","v":""},{"$f":"IF(COUNTIF(BdD!$A:$A,$A$1)>=ROW()-2,INDEX(BdD!I:I,MATCH($A$1&\"_\"&ROW()-2,BdD!$K:$K,0)),\"\")","v":""}]
[{"$f":"IF(COUNTIF(BdD!$A:$A,$A$1)>=ROW()-2,INDEX(BdD!B:B,MATCH($A$1&\"_\"&ROW()-2,BdD!$K:$K,0)),\"\")","v":""},{"$f":"IF(COUNTIF(BdD!$A:$A,$A$1)>=ROW()-2,INDEX(BdD!C:C,MATCH($A$1&\"_\"&ROW()-2,BdD!$K:$K,0)),\"\")","v":""},{"$f":"IF(COUNTIF(BdD!$A:$A,$A$1)>=ROW()-2,INDEX(BdD!D:D,MATCH($A$1&\"_\"&ROW()-2,BdD!$K:$K,0)),\"\")","v":""},{"$f":"IF(COUNTIF(BdD!$A:$A,$A$1)>=ROW()-2,INDEX(BdD!E:E,MATCH($A$1&\"_\"&ROW()-2,BdD!$K:$K,0)),\"\")","v":""},{"$f":"IF(COUNTIF(BdD!$A:$A,$A$1)>=ROW()-2,INDEX(BdD!F:F,MATCH($A$1&\"_\"&ROW()-2,BdD!$K:$K,0)),\"\")","v":""},{"$f":"IF(COUNTIF(BdD!$A:$A,$A$1)>=ROW()-2,INDEX(BdD!G:G,MATCH($A$1&\"_\"&ROW()-2,BdD!$K:$K,0)),\"\")","v":""},{"$f":"IF(COUNTIF(BdD!$A:$A,$A$1)>=ROW()-2,INDEX(BdD!H:H,MATCH($A$1&\"_\"&ROW()-2,BdD!$K:$K,0)),\"\")","v":""},{"$f":"IF(COUNTIF(BdD!$A:$A,$A$1)>=ROW()-2,INDEX(BdD!I:I,MATCH($A$1&\"_\"&ROW()-2,BdD!$K:$K,0)),\"\")","v":""}]
[{"$f":"IF(COUNTIF(BdD!$A:$A,$A$1)>=ROW()-2,INDEX(BdD!B:B,MATCH($A$1&\"_\"&ROW()-2,BdD!$K:$K,0)),\"\")","v":""},{"$f":"IF(COUNTIF(BdD!$A:$A,$A$1)>=ROW()-2,INDEX(BdD!C:C,MATCH($A$1&\"_\"&ROW()-2,BdD!$K:$K,0)),\"\")","v":""},{"$f":"IF(COUNTIF(BdD!$A:$A,$A$1)>=ROW()-2,INDEX(BdD!D:D,MATCH($A$1&\"_\"&ROW()-2,BdD!$K:$K,0)),\"\")","v":""},{"$f":"IF(COUNTIF(BdD!$A:$A,$A$1)>=ROW()-2,INDEX(BdD!E:E,MATCH($A$1&\"_\"&ROW()-2,BdD!$K:$K,0)),\"\")","v":""},{"$f":"IF(COUNTIF(BdD!$A:$A,$A$1)>=ROW()-2,INDEX(BdD!F:F,MATCH($A$1&\"_\"&ROW()-2,BdD!$K:$K,0)),\"\")","v":""},{"$f":"IF(COUNTIF(BdD!$A:$A,$A$1)>=ROW()-2,INDEX(BdD!G:G,MATCH($A$1&\"_\"&ROW()-2,BdD!$K:$K,0)),\"\")","v":""},{"$f":"IF(COUNTIF(BdD!$A:$A,$A$1)>=ROW()-2,INDEX(BdD!H:H,MATCH($A$1&\"_\"&ROW()-2,BdD!$K:$K,0)),\"\")","v":""},{"$f":"IF(COUNTIF(BdD!$A:$A,$A$1)>=ROW()-2,INDEX(BdD!I:I,MATCH($A$1&\"_\"&ROW()-2,BdD!$K:$K,0)),\"\")","v":""}]
[{"$f":"IF(COUNTIF(BdD!$A:$A,$A$1)>=ROW()-2,INDEX(BdD!B:B,MATCH($A$1&\"_\"&ROW()-2,BdD!$K:$K,0)),\"\")","v":""},{"$f":"IF(COUNTIF(BdD!$A:$A,$A$1)>=ROW()-2,INDEX(BdD!C:C,MATCH($A$1&\"_\"&ROW()-2,BdD!$K:$K,0)),\"\")","v":""},{"$f":"IF(COUNTIF(BdD!$A:$A,$A$1)>=ROW()-2,INDEX(BdD!D:D,MATCH($A$1&\"_\"&ROW()-2,BdD!$K:$K,0)),\"\")","v":""},{"$f":"IF(COUNTIF(BdD!$A:$A,$A$1)>=ROW()-2,INDEX(BdD!E:E,MATCH($A$1&\"_\"&ROW()-2,BdD!$K:$K,0)),\"\")","v":""},{"$f":"IF(COUNTIF(BdD!$A:$A,$A$1)>=ROW()-2,INDEX(BdD!F:F,MATCH($A$1&\"_\"&ROW()-2,BdD!$K:$K,0)),\"\")","v":""},{"$f":"IF(COUNTIF(BdD!$A:$A,$A$1)>=ROW()-2,INDEX(BdD!G:G,MATCH($A$1&\"_\"&ROW()-2,BdD!$K:$K,0)),\"\")","v":""},{"$f":"IF(COUNTIF(BdD!$A:$A,$A$1)>=ROW()-2,INDEX(BdD!H:H,MATCH($A$1&\"_\"&ROW()-2,BdD!$K:$K,0)),\"\")","v":""},{"$f":"IF(COUNTIF(BdD!$A:$A,$A$1)>=ROW()-2,INDEX(BdD!I:I,MATCH($A$1&\"_\"&ROW()-2,BdD!$K:$K,0)),\"\")","v":""}]
[{"$f":"IF(COUNTIF(BdD!$A:$A,$A$1)>=ROW()-2,INDEX(BdD!B:B,MATCH($A$1&\"_\"&ROW()-2,BdD!$K:$K,0)),\"\")","v":""},{"$f":"IF(COUNTIF(BdD!$A:$A,$A$1)>=ROW()-2,INDEX(BdD!C:C,MATCH($A$1&\"_\"&ROW()-2,BdD!$K:$K,0)),\"\")","v":""},{"$f":"IF(COUNTIF(BdD!$A:$A,$A$1)>=ROW()-2,INDEX(BdD!D:D,MATCH($A$1&\"_\"&ROW()-2,BdD!$K:$K,0)),\"\")","v":""},{"$f":"IF(COUNTIF(BdD!$A:$A,$A$1)>=ROW()-2,INDEX(BdD!E:E,MATCH($A$1&\"_\"&ROW()-2,BdD!$K:$K,0)),\"\")","v":""},{"$f":"IF(COUNTIF(BdD!$A:$A,$A$1)>=ROW()-2,INDEX(BdD!F:F,MATCH($A$1&\"_\"&ROW()-2,BdD!$K:$K,0)),\"\")","v":""},{"$f":"IF(COUNTIF(BdD!$A:$A,$A$1)>=ROW()-2,INDEX(BdD!G:G,MATCH($A$1&\"_\"&ROW()-2,BdD!$K:$K,0)),\"\")","v":""},{"$f":"IF(COUNTIF(BdD!$A:$A,$A$1)>=ROW()-2,INDEX(BdD!H:H,MATCH($A$1&\"_\"&ROW()-2,BdD!$K:$K,0)),\"\")","v":""},{"$f":"IF(COUNTIF(BdD!$A:$A,$A$1)>=ROW()-2,INDEX(BdD!I:I,MATCH($A$1&\"_\"&ROW()-2,BdD!$K:$K,0)),\"\")","v":""}]
[{"$f":"IF(COUNTIF(BdD!$A:$A,$A$1)>=ROW()-2,INDEX(BdD!B:B,MATCH($A$1&\"_\"&ROW()-2,BdD!$K:$K,0)),\"\")","v":""},{"$f":"IF(COUNTIF(BdD!$A:$A,$A$1)>=ROW()-2,INDEX(BdD!C:C,MATCH($A$1&\"_\"&ROW()-2,BdD!$K:$K,0)),\"\")","v":""},{"$f":"IF(COUNTIF(BdD!$A:$A,$A$1)>=ROW()-2,INDEX(BdD!D:D,MATCH($A$1&\"_\"&ROW()-2,BdD!$K:$K,0)),\"\")","v":""},{"$f":"IF(COUNTIF(BdD!$A:$A,$A$1)>=ROW()-2,INDEX(BdD!E:E,MATCH($A$1&\"_\"&ROW()-2,BdD!$K:$K,0)),\"\")","v":""},{"$f":"IF(COUNTIF(BdD!$A:$A,$A$1)>=ROW()-2,INDEX(BdD!F:F,MATCH($A$1&\"_\"&ROW()-2,BdD!$K:$K,0)),\"\")","v":""},{"$f":"IF(COUNTIF(BdD!$A:$A,$A$1)>=ROW()-2,INDEX(BdD!G:G,MATCH($A$1&\"_\"&ROW()-2,BdD!$K:$K,0)),\"\")","v":""},{"$f":"IF(COUNTIF(BdD!$A:$A,$A$1)>=ROW()-2,INDEX(BdD!H:H,MATCH($A$1&\"_\"&ROW()-2,BdD!$K:$K,0)),\"\")","v":""},{"$f":"IF(COUNTIF(BdD!$A:$A,$A$1)>=ROW()-2,INDEX(BdD!I:I,MATCH($A$1&\"_\"&ROW()-2,BdD!$K:$K,0)),\"\")","v":""}]
[{"$f":"IF(COUNTIF(BdD!$A:$A,$A$1)>=ROW()-2,INDEX(BdD!B:B,MATCH($A$1&\"_\"&ROW()-2,BdD!$K:$K,0)),\"\")","v":""},{"$f":"IF(COUNTIF(BdD!$A:$A,$A$1)>=ROW()-2,INDEX(BdD!C:C,MATCH($A$1&\"_\"&ROW()-2,BdD!$K:$K,0)),\"\")","v":""},{"$f":"IF(COUNTIF(BdD!$A:$A,$A$1)>=ROW()-2,INDEX(BdD!D:D,MATCH($A$1&\"_\"&ROW()-2,BdD!$K:$K,0)),\"\")","v":""},{"$f":"IF(COUNTIF(BdD!$A:$A,$A$1)>=ROW()-2,INDEX(BdD!E:E,MATCH($A$1&\"_\"&ROW()-2,BdD!$K:$K,0)),\"\")","v":""},{"$f":"IF(COUNTIF(BdD!$A:$A,$A$1)>=ROW()-2,INDEX(BdD!F:F,MATCH($A$1&\"_\"&ROW()-2,BdD!$K:$K,0)),\"\")","v":""},{"$f":"IF(COUNTIF(BdD!$A:$A,$A$1)>=ROW()-2,INDEX(BdD!G:G,MATCH($A$1&\"_\"&ROW()-2,BdD!$K:$K,0)),\"\")","v":""},{"$f":"IF(COUNTIF(BdD!$A:$A,$A$1)>=ROW()-2,INDEX(BdD!H:H,MATCH($A$1&\"_\"&ROW()-2,BdD!$K:$K,0)),\"\")","v":""},{"$f":"IF(COUNTIF(BdD!$A:$A,$A$1)>=ROW()-2,INDEX(BdD!I:I,MATCH($A$1&\"_\"&ROW()-2,BdD!$K:$K,0)),\"\")","v":""}]
[{"$f":"IF(COUNTIF(BdD!$A:$A,$A$1)>=ROW()-2,INDEX(BdD!B:B,MATCH($A$1&\"_\"&ROW()-2,BdD!$K:$K,0)),\"\")","v":""},{"$f":"IF(COUNTIF(BdD!$A:$A,$A$1)>=ROW()-2,INDEX(BdD!C:C,MATCH($A$1&\"_\"&ROW()-2,BdD!$K:$K,0)),\"\")","v":""},{"$f":"IF(COUNTIF(BdD!$A:$A,$A$1)>=ROW()-2,INDEX(BdD!D:D,MATCH($A$1&\"_\"&ROW()-2,BdD!$K:$K,0)),\"\")","v":""},{"$f":"IF(COUNTIF(BdD!$A:$A,$A$1)>=ROW()-2,INDEX(BdD!E:E,MATCH($A$1&\"_\"&ROW()-2,BdD!$K:$K,0)),\"\")","v":""},{"$f":"IF(COUNTIF(BdD!$A:$A,$A$1)>=ROW()-2,INDEX(BdD!F:F,MATCH($A$1&\"_\"&ROW()-2,BdD!$K:$K,0)),\"\")","v":""},{"$f":"IF(COUNTIF(BdD!$A:$A,$A$1)>=ROW()-2,INDEX(BdD!G:G,MATCH($A$1&\"_\"&ROW()-2,BdD!$K:$K,0)),\"\")","v":""},{"$f":"IF(COUNTIF(BdD!$A:$A,$A$1)>=ROW()-2,INDEX(BdD!H:H,MATCH($A$1&\"_\"&ROW()-2,BdD!$K:$K,0)),\"\")","v":""},{"$f":"IF(COUNTIF(BdD!$A:$A,$A$1)>=ROW()-2,INDEX(BdD!I:I,MATCH($A$1&\"_\"&ROW()-2,BdD!$K:$K,0)),\"\")","v":""}]
[{"$f":"IF(COUNTIF(BdD!$A:$A,$A$1)>=ROW()-2,INDEX(BdD!B:B,MATCH($A$1&\"_\"&ROW()-2,BdD!$K:$K,0)),\"\")","v":""},{"$f":"IF(COUNTIF(BdD!$A:$A,$A$1)>=ROW()-2,INDEX(BdD!C:C,MATCH($A$1&\"_\"&ROW()-2,BdD!$K:$K,0)),\"\")","v":""},{"$f":"IF(COUNTIF(BdD!$A:$A,$A$1)>=ROW()-2,INDEX(BdD!D:D,MATCH($A$1&\"_\"&ROW()-2,BdD!$K:$K,0)),\"\")","v":""},{"$f":"IF(COUNTIF(BdD!$A:$A,$A$1)>=ROW()-2,INDEX(BdD!E:E,MATCH($A$1&\"_\"&ROW()-2,BdD!$K:$K,0)),\"\")","v":""},{"$f":"IF(COUNTIF(BdD!$A:$A,$A$1)>=ROW()-2,INDEX(BdD!F:F,MATCH($A$1&\"_\"&ROW()-2,BdD!$K:$K,0)),\"\")","v":""},{"$f":"IF(COUNTIF(BdD!$A:$A,$A$1)>=ROW()-2,INDEX(BdD!G:G,MATCH($A$1&\"_\"&ROW()-2,BdD!$K:$K,0)),\"\")","v":""},{"$f":"IF(COUNTIF(BdD!$A:$A,$A$1)>=ROW()-2,INDEX(BdD!H:H,MATCH($A$1&\"_\"&ROW()-2,BdD!$K:$K,0)),\"\")","v":""},{"$f":"IF(COUNTIF(BdD!$A:$A,$A$1)>=ROW()-2,INDEX(BdD!I:I,MATCH($A$1&\"_\"&ROW()-2,BdD!$K:$K,0)),\"\")","v":""}]
[{"$f":"IF(COUNTIF(BdD!$A:$A,$A$1)>=ROW()-2,INDEX(BdD!B:B,MATCH($A$1&\"_\"&ROW()-2,BdD!$K:$K,0)),\"\")","v":""},{"$f":"IF(COUNTIF(BdD!$A:$A,$A$1)>=ROW()-2,INDEX(BdD!C:C,MATCH($A$1&\"_\"&ROW()-2,BdD!$K:$K,0)),\"\")","v":""},{"$f":"IF(COUNTIF(BdD!$A:$A,$A$1)>=ROW()-2,INDEX(BdD!D:D,MATCH($A$1&\"_\"&ROW()-2,BdD!$K:$K,0)),\"\")","v":""},{"$f":"IF(COUNTIF(BdD!$A:$A,$A$1)>=ROW()-2,INDEX(BdD!E:E,MATCH($A$1&\"_\"&ROW()-2,BdD!$K:$K,0)),\"\")","v":""},{"$f":"IF(COUNTIF(BdD!$A:$A,$A$1)>=ROW()-2,INDEX(BdD!F:F,MATCH($A$1&\"_\"&ROW()-2,BdD!$K:$K,0)),\"\")","v":""},{"$f":"IF(COUNTIF(BdD!$A:$A,$A$1)>=ROW()-2,INDEX(BdD!G:G,MATCH($A$1&\"_\"&ROW()-2,BdD!$K:$K,0)),\"\")","v":""},{"$f":"IF(COUNTIF(BdD!$A:$A,$A$1)>=ROW()-2,INDEX(BdD!H:H,MATCH($A$1&\"_\"&ROW()-2,BdD!$K:$K,0)),\"\")","v":""},{"$f":"IF(COUNTIF(BdD!$A:$A,$A$1)>=ROW()-2,INDEX(BdD!I:I,MATCH($A$1&\"_\"&ROW()-2,BdD!$K:$K,0)),\"\")","v":""}]
[{"$f":"IF(COUNTIF(BdD!$A:$A,$A$1)>=ROW()-2,INDEX(BdD!B:B,MATCH($A$1&\"_\"&ROW()-2,BdD!$K:$K,0)),\"\")","v":""},{"$f":"IF(COUNTIF(BdD!$A:$A,$A$1)>=ROW()-2,INDEX(BdD!C:C,MATCH($A$1&\"_\"&ROW()-2,BdD!$K:$K,0)),\"\")","v":""},{"$f":"IF(COUNTIF(BdD!$A:$A,$A$1)>=ROW()-2,INDEX(BdD!D:D,MATCH($A$1&\"_\"&ROW()-2,BdD!$K:$K,0)),\"\")","v":""},{"$f":"IF(COUNTIF(BdD!$A:$A,$A$1)>=ROW()-2,INDEX(BdD!E:E,MATCH($A$1&\"_\"&ROW()-2,BdD!$K:$K,0)),\"\")","v":""},{"$f":"IF(COUNTIF(BdD!$A:$A,$A$1)>=ROW()-2,INDEX(BdD!F:F,MATCH($A$1&\"_\"&ROW()-2,BdD!$K:$K,0)),\"\")","v":""},{"$f":"IF(COUNTIF(BdD!$A:$A,$A$1)>=ROW()-2,INDEX(BdD!G:G,MATCH($A$1&\"_\"&ROW()-2,BdD!$K:$K,0)),\"\")","v":""},{"$f":"IF(COUNTIF(BdD!$A:$A,$A$1)>=ROW()-2,INDEX(BdD!H:H,MATCH($A$1&\"_\"&ROW()-2,BdD!$K:$K,0)),\"\")","v":""},{"$f":"IF(COUNTIF(BdD!$A:$A,$A$1)>=ROW()-2,INDEX(BdD!I:I,MATCH($A$1&\"_\"&ROW()-2,BdD!$K:$K,0)),\"\")","v":""}]
[{"$f":"IF(COUNTIF(BdD!$A:$A,$A$1)>=ROW()-2,INDEX(BdD!B:B,MATCH($A$1&\"_\"&ROW()-2,BdD!$K:$K,0)),\"\")","v":""},{"$f":"IF(COUNTIF(BdD!$A:$A,$A$1)>=ROW()-2,INDEX(BdD!C:C,MATCH($A$1&\"_\"&ROW()-2,BdD!$K:$K,0)),\"\")","v":""},{"$f":"IF(COUNTIF(BdD!$A:$A,$A$1)>=ROW()-2,INDEX(BdD!D:D,MATCH($A$1&\"_\"&ROW()-2,BdD!$K:$K,0)),\"\")","v":""},{"$f":"IF(COUNTIF(BdD!$A:$A,$A$1)>=ROW()-2,INDEX(BdD!E:E,MATCH($A$1&\"_\"&ROW()-2,BdD!$K:$K,0)),\"\")","v":""},{"$f":"IF(COUNTIF(BdD!$A:$A,$A$1)>=ROW()-2,INDEX(BdD!F:F,MATCH($A$1&\"_\"&ROW()-2,BdD!$K:$K,0)),\"\")","v":""},{"$f":"IF(COUNTIF(BdD!$A:$A,$A$1)>=ROW()-2,INDEX(BdD!G:G,MATCH($A$1&\"_\"&ROW()-2,BdD!$K:$K,0)),\"\")","v":""},{"$f":"IF(COUNTIF(BdD!$A:$A,$A$1)>=ROW()-2,INDEX(BdD!H:H,MATCH($A$1&\"_\"&ROW()-2,BdD!$K:$K,0)),\"\")","v":""},{"$f":"IF(COUNTIF(BdD!$A:$A,$A$1)>=ROW()-2,INDEX(BdD!I:I,MATCH($A$1&\"_\"&ROW()-2,BdD!$K:$K,0)),\"\")","v":""}]
[{"$f":"IF(COUNTIF(BdD!$A:$A,$A$1)>=ROW()-2,INDEX(BdD!B:B,MATCH($A$1&\"_\"&ROW()-2,BdD!$K:$K,0)),\"\")","v":""},{"$f":"IF(COUNTIF(BdD!$A:$A,$A$1)>=ROW()-2,INDEX(BdD!C:C,MATCH($A$1&\"_\"&ROW()-2,BdD!$K:$K,0)),\"\")","v":""},{"$f":"IF(COUNTIF(BdD!$A:$A,$A$1)>=ROW()-2,INDEX(BdD!D:D,MATCH($A$1&\"_\"&ROW()-2,BdD!$K:$K,0)),\"\")","v":""},{"$f":"IF(COUNTIF(BdD!$A:$A,$A$1)>=ROW()-2,INDEX(BdD!E:E,MATCH($A$1&\"_\"&ROW()-2,BdD!$K:$K,0)),\"\")","v":""},{"$f":"IF(COUNTIF(BdD!$A:$A,$A$1)>=ROW()-2,INDEX(BdD!F:F,MATCH($A$1&\"_\"&ROW()-2,BdD!$K:$K,0)),\"\")","v":""},{"$f":"IF(COUNTIF(BdD!$A:$A,$A$1)>=ROW()-2,INDEX(BdD!G:G,MATCH($A$1&\"_\"&ROW()-2,BdD!$K:$K,0)),\"\")","v":""},{"$f":"IF(COUNTIF(BdD!$A:$A,$A$1)>=ROW()-2,INDEX(BdD!H:H,MATCH($A$1&\"_\"&ROW()-2,BdD!$K:$K,0)),\"\")","v":""},{"$f":"IF(COUNTIF(BdD!$A:$A,$A$1)>=ROW()-2,INDEX(BdD!I:I,MATCH($A$1&\"_\"&ROW()-2,BdD!$K:$K,0)),\"\")","v":""}]
[{"$f":"IF(COUNTIF(BdD!$A:$A,$A$1)>=ROW()-2,INDEX(BdD!B:B,MATCH($A$1&\"_\"&ROW()-2,BdD!$K:$K,0)),\"\")","v":""},{"$f":"IF(COUNTIF(BdD!$A:$A,$A$1)>=ROW()-2,INDEX(BdD!C:C,MATCH($A$1&\"_\"&ROW()-2,BdD!$K:$K,0)),\"\")","v":""},{"$f":"IF(COUNTIF(BdD!$A:$A,$A$1)>=ROW()-2,INDEX(BdD!D:D,MATCH($A$1&\"_\"&ROW()-2,BdD!$K:$K,0)),\"\")","v":""},{"$f":"IF(COUNTIF(BdD!$A:$A,$A$1)>=ROW()-2,INDEX(BdD!E:E,MATCH($A$1&\"_\"&ROW()-2,BdD!$K:$K,0)),\"\")","v":""},{"$f":"IF(COUNTIF(BdD!$A:$A,$A$1)>=ROW()-2,INDEX(BdD!F:F,MATCH($A$1&\"_\"&ROW()-2,BdD!$K:$K,0)),\"\")","v":""},{"$f":"IF(COUNTIF(BdD!$A:$A,$A$1)>=ROW()-2,INDEX(BdD!G:G,MATCH($A$1&\"_\"&ROW()-2,BdD!$K:$K,0)),\"\")","v":""},{"$f":"IF(COUNTIF(BdD!$A:$A,$A$1)>=ROW()-2,INDEX(BdD!H:H,MATCH($A$1&\"_\"&ROW()-2,BdD!$K:$K,0)),\"\")","v":""},{"$f":"IF(COUNTIF(BdD!$A:$A,$A$1)>=ROW()-2,INDEX(BdD!I:I,MATCH($A$1&\"_\"&ROW()-2,BdD!$K:$K,0)),\"\")","v":""}]
[{"$f":"IF(COUNTIF(BdD!$A:$A,$A$1)>=ROW()-2,INDEX(BdD!B:B,MATCH($A$1&\"_\"&ROW()-2,BdD!$K:$K,0)),\"\")","v":""},{"$f":"IF(COUNTIF(BdD!$A:$A,$A$1)>=ROW()-2,INDEX(BdD!C:C,MATCH($A$1&\"_\"&ROW()-2,BdD!$K:$K,0)),\"\")","v":""},{"$f":"IF(COUNTIF(BdD!$A:$A,$A$1)>=ROW()-2,INDEX(BdD!D:D,MATCH($A$1&\"_\"&ROW()-2,BdD!$K:$K,0)),\"\")","v":""},{"$f":"IF(COUNTIF(BdD!$A:$A,$A$1)>=ROW()-2,INDEX(BdD!E:E,MATCH($A$1&\"_\"&ROW()-2,BdD!$K:$K,0)),\"\")","v":""},{"$f":"IF(COUNTIF(BdD!$A:$A,$A$1)>=ROW()-2,INDEX(BdD!F:F,MATCH($A$1&\"_\"&ROW()-2,BdD!$K:$K,0)),\"\")","v":""},{"$f":"IF(COUNTIF(BdD!$A:$A,$A$1)>=ROW()-2,INDEX(BdD!G:G,MATCH($A$1&\"_\"&ROW()-2,BdD!$K:$K,0)),\"\")","v":""},{"$f":"IF(COUNTIF(BdD!$A:$A,$A$1)>=ROW()-2,INDEX(BdD!H:H,MATCH($A$1&\"_\"&ROW()-2,BdD!$K:$K,0)),\"\")","v":""},{"$f":"IF(COUNTIF(BdD!$A:$A,$A$1)>=ROW()-2,INDEX(BdD!I:I,MATCH($A$1&\"_\"&ROW()-2,BdD!$K:$K,0)),\"\")","v":""}]
[{"$f":"IF(COUNTIF(BdD!$A:$A,$A$1)>=ROW()-2,INDEX(BdD!B:B,MATCH($A$1&\"_\"&ROW()-2,BdD!$K:$K,0)),\"\")","v":""},{"$f":"IF(COUNTIF(BdD!$A:$A,$A$1)>=ROW()-2,INDEX(BdD!C:C,MATCH($A$1&\"_\"&ROW()-2,BdD!$K:$K,0)),\"\")","v":""},{"$f":"IF(COUNTIF(BdD!$A:$A,$A$1)>=ROW()-2,INDEX(BdD!D:D,MATCH($A$1&\"_\"&ROW()-2,BdD!$K:$K,0)),\"\")","v":""},{"$f":"IF(COUNTIF(BdD!$A:$A,$A$1)>=ROW()-2,INDEX(BdD!E:E,MATCH($A$1&\"_\"&ROW()-2,BdD!$K:$K,0)),\"\")","v":""},{"$f":"IF(COUNTIF(BdD!$A:$A,$A$1)>=ROW()-2,INDEX(BdD!F:F,MATCH($A$1&\"_\"&ROW()-2,BdD!$K:$K,0)),\"\")","v":""},{"$f":"IF(COUNTIF(BdD!$A:$A,$A$1)>=ROW()-2,INDEX(BdD!G:G,MATCH($A$1&\"_\"&ROW()-2,BdD!$K:$K,0)),\"\")","v":""},{"$f":"IF(COUNTIF(BdD!$A:$A,$A$1)>=ROW()-2,INDEX(BdD!H:H,MATCH($A$1&\"_\"&ROW()-2,BdD!$K:$K,0)),\"\")","v":""},{"$f":"IF(COUNTIF(BdD!$A:$A,$A$1)>=ROW()-2,INDEX(BdD!I:I,MATCH($A$1&\"_\"&ROW()-2,BdD!$K:$K,0)),\"\")","v":""}]
[{"$f":"IF(COUNTIF(BdD!$A:$A,$A$1)>=ROW()-2,INDEX(BdD!B:B,MATCH($A$1&\"_\"&ROW()-2,BdD!$K:$K,0)),\"\")","v":""},{"$f":"IF(COUNTIF(BdD!$A:$A,$A$1)>=ROW()-2,INDEX(BdD!C:C,MATCH($A$1&\"_\"&ROW()-2,BdD!$K:$K,0)),\"\")","v":""},{"$f":"IF(COUNTIF(BdD!$A:$A,$A$1)>=ROW()-2,INDEX(BdD!D:D,MATCH($A$1&\"_\"&ROW()-2,BdD!$K:$K,0)),\"\")","v":""},{"$f":"IF(COUNTIF(BdD!$A:$A,$A$1)>=ROW()-2,INDEX(BdD!E:E,MATCH($A$1&\"_\"&ROW()-2,BdD!$K:$K,0)),\"\")","v":""},{"$f":"IF(COUNTIF(BdD!$A:$A,$A$1)>=ROW()-2,INDEX(BdD!F:F,MATCH($A$1&\"_\"&ROW()-2,BdD!$K:$K,0)),\"\")","v":""},{"$f":"IF(COUNTIF(BdD!$A:$A,$A$1)>=ROW()-2,INDEX(BdD!G:G,MATCH($A$1&\"_\"&ROW()-2,BdD!$K:$K,0)),\"\")","v":""},{"$f":"IF(COUNTIF(BdD!$A:$A,$A$1)>=ROW()-2,INDEX(BdD!H:H,MATCH($A$1&\"_\"&ROW()-2,BdD!$K:$K,0)),\"\")","v":""},{"$f":"IF(COUNTIF(BdD!$A:$A,$A$1)>=ROW()-2,INDEX(BdD!I:I,MATCH($A$1&\"_\"&ROW()-2,BdD!$K:$K,0)),\"\")","v":""}]
[{"$f":"IF(COUNTIF(BdD!$A:$A,$A$1)>=ROW()-2,INDEX(BdD!B:B,MATCH($A$1&\"_\"&ROW()-2,BdD!$K:$K,0)),\"\")","v":""},{"$f":"IF(COUNTIF(BdD!$A:$A,$A$1)>=ROW()-2,INDEX(BdD!C:C,MATCH($A$1&\"_\"&ROW()-2,BdD!$K:$K,0)),\"\")","v":""},{"$f":"IF(COUNTIF(BdD!$A:$A,$A$1)>=ROW()-2,INDEX(BdD!D:D,MATCH($A$1&\"_\"&ROW()-2,BdD!$K:$K,0)),\"\")","v":""},{"$f":"IF(COUNTIF(BdD!$A:$A,$A$1)>=ROW()-2,INDEX(BdD!E:E,MATCH($A$1&\"_\"&ROW()-2,BdD!$K:$K,0)),\"\")","v":""},{"$f":"IF(COUNTIF(BdD!$A:$A,$A$1)>=ROW()-2,INDEX(BdD!F:F,MATCH($A$1&\"_\"&ROW()-2,BdD!$K:$K,0)),\"\")","v":""},{"$f":"IF(COUNTIF(BdD!$A:$A,$A$1)>=ROW()-2,INDEX(BdD!G:G,MATCH($A$1&\"_\"&ROW()-2,BdD!$K:$K,0)),\"\")","v":""},{"$f":"IF(COUNTIF(BdD!$A:$A,$A$1)>=ROW()-2,INDEX(BdD!H:H,MATCH($A$1&\"_\"&ROW()-2,BdD!$K:$K,0)),\"\")","v":""},{"$f":"IF(COUNTIF(BdD!$A:$A,$A$1)>=ROW()-2,INDEX(BdD!I:I,MATCH($A$1&\"_\"&ROW()-2,BdD!$K:$K,0)),\"\")","v":""}]
[{"$f":"IF(COUNTIF(BdD!$A:$A,$A$1)>=ROW()-2,INDEX(BdD!B:B,MATCH($A$1&\"_\"&ROW()-2,BdD!$K:$K,0)),\"\")","v":""},{"$f":"IF(COUNTIF(BdD!$A:$A,$A$1)>=ROW()-2,INDEX(BdD!C:C,MATCH($A$1&\"_\"&ROW()-2,BdD!$K:$K,0)),\"\")","v":""},{"$f":"IF(COUNTIF(BdD!$A:$A,$A$1)>=ROW()-2,INDEX(BdD!D:D,MATCH($A$1&\"_\"&ROW()-2,BdD!$K:$K,0)),\"\")","v":""},{"$f":"IF(COUNTIF(BdD!$A:$A,$A$1)>=ROW()-2,INDEX(BdD!E:E,MATCH($A$1&\"_\"&ROW()-2,BdD!$K:$K,0)),\"\")","v":""},{"$f":"IF(COUNTIF(BdD!$A:$A,$A$1)>=ROW()-2,INDEX(BdD!F:F,MATCH($A$1&\"_\"&ROW()-2,BdD!$K:$K,0)),\"\")","v":""},{"$f":"IF(COUNTIF(BdD!$A:$A,$A$1)>=ROW()-2,INDEX(BdD!G:G,MATCH($A$1&\"_\"&ROW()-2,BdD!$K:$K,0)),\"\")","v":""},{"$f":"IF(COUNTIF(BdD!$A:$A,$A$1)>=ROW()-2,INDEX(BdD!H:H,MATCH($A$1&\"_\"&ROW()-2,BdD!$K:$K,0)),\"\")","v":""},{"$f":"IF(COUNTIF(BdD!$A:$A,$A$1)>=ROW()-2,INDEX(BdD!I:I,MATCH($A$1&\"_\"&ROW()-2,BdD!$K:$K,0)),\"\")","v":""}]
[{"$f":"IF(COUNTIF(BdD!$A:$A,$A$1)>=ROW()-2,INDEX(BdD!B:B,MATCH($A$1&\"_\"&ROW()-2,BdD!$K:$K,0)),\"\")","v":""},{"$f":"IF(COUNTIF(BdD!$A:$A,$A$1)>=ROW()-2,INDEX(BdD!C:C,MATCH($A$1&\"_\"&ROW()-2,BdD!$K:$K,0)),\"\")","v":""},{"$f":"IF(COUNTIF(BdD!$A:$A,$A$1)>=ROW()-2,INDEX(BdD!D:D,MATCH($A$1&\"_\"&ROW()-2,BdD!$K:$K,0)),\"\")","v":""},{"$f":"IF(COUNTIF(BdD!$A:$A,$A$1)>=ROW()-2,INDEX(BdD!E:E,MATCH($A$1&\"_\"&ROW()-2,BdD!$K:$K,0)),\"\")","v":""},{"$f":"IF(COUNTIF(BdD!$A:$A,$A$1)>=ROW()-2,INDEX(BdD!F:F,MATCH($A$1&\"_\"&ROW()-2,BdD!$K:$K,0)),\"\")","v":""},{"$f":"IF(COUNTIF(BdD!$A:$A,$A$1)>=ROW()-2,INDEX(BdD!G:G,MATCH($A$1&\"_\"&ROW()-2,BdD!$K:$K,0)),\"\")","v":""},{"$f":"IF(COUNTIF(BdD!$A:$A,$A$1)>=ROW()-2,INDEX(BdD!H:H,MATCH($A$1&\"_\"&ROW()-2,BdD!$K:$K,0)),\"\")","v":""},{"$f":"IF(COUNTIF(BdD!$A:$A,$A$1)>=ROW()-2,INDEX(BdD!I:I,MATCH($A$1&\"_\"&ROW()-2,BdD!$K:$K,0)),\"\")","v":""}]
[{"$f":"IF(COUNTIF(BdD!$A:$A,$A$1)>ROW()-1,INDEX(BdD!B:B,MATCH($A$1&\"_\"&ROW()-2,BdD!$K:$K,0)),\"\")","v":""},{"$f":"IF(COUNTIF(BdD!$A:$A,$A$1)>ROW()-1,INDEX(BdD!C:C,MATCH($A$1&\"_\"&ROW()-2,BdD!$K:$K,0)),\"\")","v":""},{"$f":"IF(COUNTIF(BdD!$A:$A,$A$1)>ROW()-1,INDEX(BdD!D:D,MATCH($A$1&\"_\"&ROW()-2,BdD!$K:$K,0)),\"\")","v":""},{"$f":"IF(COUNTIF(BdD!$A:$A,$A$1)>ROW()-1,INDEX(BdD!E:E,MATCH($A$1&\"_\"&ROW()-2,BdD!$K:$K,0)),\"\")","v":""},{"$f":"IF(COUNTIF(BdD!$A:$A,$A$1)>ROW()-1,INDEX(BdD!F:F,MATCH($A$1&\"_\"&ROW()-2,BdD!$K:$K,0)),\"\")","v":""},{"$f":"IF(COUNTIF(BdD!$A:$A,$A$1)>ROW()-1,INDEX(BdD!G:G,MATCH($A$1&\"_\"&ROW()-2,BdD!$K:$K,0)),\"\")","v":""},{"$f":"IF(COUNTIF(BdD!$A:$A,$A$1)>ROW()-1,INDEX(BdD!H:H,MATCH($A$1&\"_\"&ROW()-2,BdD!$K:$K,0)),\"\")","v":""},{"$f":"IF(COUNTIF(BdD!$A:$A,$A$1)>ROW()-1,INDEX(BdD!I:I,MATCH($A$1&\"_\"&ROW()-2,BdD!$K:$K,0)),\"\")","v":""}]
[{"$f":"IF(COUNTIF(BdD!$A:$A,$A$1)>ROW()-1,INDEX(BdD!B:B,MATCH($A$1&\"_\"&ROW()-2,BdD!$K:$K,0)),\"\")","v":""},{"$f":"IF(COUNTIF(BdD!$A:$A,$A$1)>ROW()-1,INDEX(BdD!C:C,MATCH($A$1&\"_\"&ROW()-2,BdD!$K:$K,0)),\"\")","v":""},{"$f":"IF(COUNTIF(BdD!$A:$A,$A$1)>ROW()-1,INDEX(BdD!D:D,MATCH($A$1&\"_\"&ROW()-2,BdD!$K:$K,0)),\"\")","v":""},{"$f":"IF(COUNTIF(BdD!$A:$A,$A$1)>ROW()-1,INDEX(BdD!E:E,MATCH($A$1&\"_\"&ROW()-2,BdD!$K:$K,0)),\"\")","v":""},{"$f":"IF(COUNTIF(BdD!$A:$A,$A$1)>ROW()-1,INDEX(BdD!F:F,MATCH($A$1&\"_\"&ROW()-2,BdD!$K:$K,0)),\"\")","v":""},{"$f":"IF(COUNTIF(BdD!$A:$A,$A$1)>ROW()-1,INDEX(BdD!G:G,MATCH($A$1&\"_\"&ROW()-2,BdD!$K:$K,0)),\"\")","v":""},{"$f":"IF(COUNTIF(BdD!$A:$A,$A$1)>ROW()-1,INDEX(BdD!H:H,MATCH($A$1&\"_\"&ROW()-2,BdD!$K:$K,0)),\"\")","v":""},{"$f":"IF(COUNTIF(BdD!$A:$A,$A$1)>ROW()-1,INDEX(BdD!I:I,MATCH($A$1&\"_\"&ROW()-2,BdD!$K:$K,0)),\"\")","v":""}]
[{"$f":"IF(COUNTIF(BdD!$A:$A,$A$1)>ROW()-1,INDEX(BdD!B:B,MATCH($A$1&\"_\"&ROW()-2,BdD!$K:$K,0)),\"\")","v":""},{"$f":"IF(COUNTIF(BdD!$A:$A,$A$1)>ROW()-1,INDEX(BdD!C:C,MATCH($A$1&\"_\"&ROW()-2,BdD!$K:$K,0)),\"\")","v":""},{"$f":"IF(COUNTIF(BdD!$A:$A,$A$1)>ROW()-1,INDEX(BdD!D:D,MATCH($A$1&\"_\"&ROW()-2,BdD!$K:$K,0)),\"\")","v":""},{"$f":"IF(COUNTIF(BdD!$A:$A,$A$1)>ROW()-1,INDEX(BdD!E:E,MATCH($A$1&\"_\"&ROW()-2,BdD!$K:$K,0)),\"\")","v":""},{"$f":"IF(COUNTIF(BdD!$A:$A,$A$1)>ROW()-1,INDEX(BdD!F:F,MATCH($A$1&\"_\"&ROW()-2,BdD!$K:$K,0)),\"\")","v":""},{"$f":"IF(COUNTIF(BdD!$A:$A,$A$1)>ROW()-1,INDEX(BdD!G:G,MATCH($A$1&\"_\"&ROW()-2,BdD!$K:$K,0)),\"\")","v":""},{"$f":"IF(COUNTIF(BdD!$A:$A,$A$1)>ROW()-1,INDEX(BdD!H:H,MATCH($A$1&\"_\"&ROW()-2,BdD!$K:$K,0)),\"\")","v":""},{"$f":"IF(COUNTIF(BdD!$A:$A,$A$1)>ROW()-1,INDEX(BdD!I:I,MATCH($A$1&\"_\"&ROW()-2,BdD!$K:$K,0)),\"\")","v":""}]
[{"$f":"IF(COUNTIF(BdD!$A:$A,$A$1)>ROW()-1,INDEX(BdD!B:B,MATCH($A$1&\"_\"&ROW()-2,BdD!$K:$K,0)),\"\")","v":""},{"$f":"IF(COUNTIF(BdD!$A:$A,$A$1)>ROW()-1,INDEX(BdD!C:C,MATCH($A$1&\"_\"&ROW()-2,BdD!$K:$K,0)),\"\")","v":""},{"$f":"IF(COUNTIF(BdD!$A:$A,$A$1)>ROW()-1,INDEX(BdD!D:D,MATCH($A$1&\"_\"&ROW()-2,BdD!$K:$K,0)),\"\")","v":""},{"$f":"IF(COUNTIF(BdD!$A:$A,$A$1)>ROW()-1,INDEX(BdD!E:E,MATCH($A$1&\"_\"&ROW()-2,BdD!$K:$K,0)),\"\")","v":""},{"$f":"IF(COUNTIF(BdD!$A:$A,$A$1)>ROW()-1,INDEX(BdD!F:F,MATCH($A$1&\"_\"&ROW()-2,BdD!$K:$K,0)),\"\")","v":""},{"$f":"IF(COUNTIF(BdD!$A:$A,$A$1)>ROW()-1,INDEX(BdD!G:G,MATCH($A$1&\"_\"&ROW()-2,BdD!$K:$K,0)),\"\")","v":""},{"$f":"IF(COUNTIF(BdD!$A:$A,$A$1)>ROW()-1,INDEX(BdD!H:H,MATCH($A$1&\"_\"&ROW()-2,BdD!$K:$K,0)),\"\")","v":""},{"$f":"IF(COUNTIF(BdD!$A:$A,$A$1)>ROW()-1,INDEX(BdD!I:I,MATCH($A$1&\"_\"&ROW()-2,BdD!$K:$K,0)),\"\")","v":""}]
[{"$f":"IF(COUNTIF(BdD!$A:$A,$A$1)>ROW()-1,INDEX(BdD!B:B,MATCH($A$1&\"_\"&ROW()-2,BdD!$K:$K,0)),\"\")","v":""},{"$f":"IF(COUNTIF(BdD!$A:$A,$A$1)>ROW()-1,INDEX(BdD!C:C,MATCH($A$1&\"_\"&ROW()-2,BdD!$K:$K,0)),\"\")","v":""},{"$f":"IF(COUNTIF(BdD!$A:$A,$A$1)>ROW()-1,INDEX(BdD!D:D,MATCH($A$1&\"_\"&ROW()-2,BdD!$K:$K,0)),\"\")","v":""},{"$f":"IF(COUNTIF(BdD!$A:$A,$A$1)>ROW()-1,INDEX(BdD!E:E,MATCH($A$1&\"_\"&ROW()-2,BdD!$K:$K,0)),\"\")","v":""},{"$f":"IF(COUNTIF(BdD!$A:$A,$A$1)>ROW()-1,INDEX(BdD!F:F,MATCH($A$1&\"_\"&ROW()-2,BdD!$K:$K,0)),\"\")","v":""},{"$f":"IF(COUNTIF(BdD!$A:$A,$A$1)>ROW()-1,INDEX(BdD!G:G,MATCH($A$1&\"_\"&ROW()-2,BdD!$K:$K,0)),\"\")","v":""},{"$f":"IF(COUNTIF(BdD!$A:$A,$A$1)>ROW()-1,INDEX(BdD!H:H,MATCH($A$1&\"_\"&ROW()-2,BdD!$K:$K,0)),\"\")","v":""},{"$f":"IF(COUNTIF(BdD!$A:$A,$A$1)>ROW()-1,INDEX(BdD!I:I,MATCH($A$1&\"_\"&ROW()-2,BdD!$K:$K,0)),\"\")","v":""}]
[{"$f":"IF(COUNTIF(BdD!$A:$A,$A$1)>ROW()-1,INDEX(BdD!B:B,MATCH($A$1&\"_\"&ROW()-2,BdD!$K:$K,0)),\"\")","v":""},{"$f":"IF(COUNTIF(BdD!$A:$A,$A$1)>ROW()-1,INDEX(BdD!C:C,MATCH($A$1&\"_\"&ROW()-2,BdD!$K:$K,0)),\"\")","v":""},{"$f":"IF(COUNTIF(BdD!$A:$A,$A$1)>ROW()-1,INDEX(BdD!D:D,MATCH($A$1&\"_\"&ROW()-2,BdD!$K:$K,0)),\"\")","v":""},{"$f":"IF(COUNTIF(BdD!$A:$A,$A$1)>ROW()-1,INDEX(BdD!E:E,MATCH($A$1&\"_\"&ROW()-2,BdD!$K:$K,0)),\"\")","v":""},{"$f":"IF(COUNTIF(BdD!$A:$A,$A$1)>ROW()-1,INDEX(BdD!F:F,MATCH($A$1&\"_\"&ROW()-2,BdD!$K:$K,0)),\"\")","v":""},{"$f":"IF(COUNTIF(BdD!$A:$A,$A$1)>ROW()-1,INDEX(BdD!G:G,MATCH($A$1&\"_\"&ROW()-2,BdD!$K:$K,0)),\"\")","v":""},{"$f":"IF(COUNTIF(BdD!$A:$A,$A$1)>ROW()-1,INDEX(BdD!H:H,MATCH($A$1&\"_\"&ROW()-2,BdD!$K:$K,0)),\"\")","v":""},{"$f":"IF(COUNTIF(BdD!$A:$A,$A$1)>ROW()-1,INDEX(BdD!I:I,MATCH($A$1&\"_\"&ROW()-2,BdD!$K:$K,0)),\"\")","v":""}]
[{"$f":"IF(COUNTIF(BdD!$A:$A,$A$1)>ROW()-1,INDEX(BdD!B:B,MATCH($A$1&\"_\"&ROW()-2,BdD!$K:$K,0)),\"\")","v":""},{"$f":"IF(COUNTIF(BdD!$A:$A,$A$1)>ROW()-1,INDEX(BdD!C:C,MATCH($A$1&\"_\"&ROW()-2,BdD!$K:$K,0)),\"\")","v":""},{"$f":"IF(COUNTIF(BdD!$A:$A,$A$1)>ROW()-1,INDEX(BdD!D:D,MATCH($A$1&\"_\"&ROW()-2,BdD!$K:$K,0)),\"\")","v":""},{"$f":"IF(COUNTIF(BdD!$A:$A,$A$1)>ROW()-1,INDEX(BdD!E:E,MATCH($A$1&\"_\"&ROW()-2,BdD!$K:$K,0)),\"\")","v":""},{"$f":"IF(COUNTIF(BdD!$A:$A,$A$1)>ROW()-1,INDEX(BdD!F:F,MATCH($A$1&\"_\"&ROW()-2,BdD!$K:$K,0)),\"\")","v":""},{"$f":"IF(COUNTIF(BdD!$A:$A,$A$1)>ROW()-1,INDEX(BdD!G:G,MATCH($A$1&\"_\"&ROW()-2,BdD!$K:$K,0)),\"\")","v":""},{"$f":"IF(COUNTIF(BdD!$A:$A,$A$1)>ROW()-1,INDEX(BdD!H:H,MATCH($A$1&\"_\"&ROW()-2,BdD!$K:$K,0)),\"\")","v":""},{"$f":"IF(COUNTIF(BdD!$A:$A,$A$1)>ROW()-1,INDEX(BdD!I:I,MATCH($A$1&\"_\"&ROW()-2,BdD!$K:$K,0)),\"\")","v":""}]
[{"$f":"IF(COUNTIF(BdD!$A:$A,$A$1)>ROW()-1,INDEX(BdD!B:B,MATCH($A$1&\"_\"&ROW()-2,BdD!$K:$K,0)),\"\")","v":""},{"$f":"IF(COUNTIF(BdD!$A:$A,$A$1)>ROW()-1,INDEX(BdD!C:C,MATCH($A$1&\"_\"&ROW()-2,BdD!$K:$K,0)),\"\")","v":""},{"$f":"IF(COUNTIF(BdD!$A:$A,$A$1)>ROW()-1,INDEX(BdD!D:D,MATCH($A$1&\"_\"&ROW()-2,BdD!$K:$K,0)),\"\")","v":""},{"$f":"IF(COUNTIF(BdD!$A:$A,$A$1)>ROW()-1,INDEX(BdD!E:E,MATCH($A$1&\"_\"&ROW()-2,BdD!$K:$K,0)),\"\")","v":""},{"$f":"IF(COUNTIF(BdD!$A:$A,$A$1)>ROW()-1,INDEX(BdD!F:F,MATCH($A$1&\"_\"&ROW()-2,BdD!$K:$K,0)),\"\")","v":""},{"$f":"IF(COUNTIF(BdD!$A:$A,$A$1)>ROW()-1,INDEX(BdD!G:G,MATCH($A$1&\"_\"&ROW()-2,BdD!$K:$K,0)),\"\")","v":""},{"$f":"IF(COUNTIF(BdD!$A:$A,$A$1)>ROW()-1,INDEX(BdD!H:H,MATCH($A$1&\"_\"&ROW()-2,BdD!$K:$K,0)),\"\")","v":""},{"$f":"IF(COUNTIF(BdD!$A:$A,$A$1)>ROW()-1,INDEX(BdD!I:I,MATCH($A$1&\"_\"&ROW()-2,BdD!$K:$K,0)),\"\")","v":""}]
[{"$f":"IF(COUNTIF(BdD!$A:$A,$A$1)>ROW()-1,INDEX(BdD!B:B,MATCH($A$1&\"_\"&ROW()-2,BdD!$K:$K,0)),\"\")","v":""},{"$f":"IF(COUNTIF(BdD!$A:$A,$A$1)>ROW()-1,INDEX(BdD!C:C,MATCH($A$1&\"_\"&ROW()-2,BdD!$K:$K,0)),\"\")","v":""},{"$f":"IF(COUNTIF(BdD!$A:$A,$A$1)>ROW()-1,INDEX(BdD!D:D,MATCH($A$1&\"_\"&ROW()-2,BdD!$K:$K,0)),\"\")","v":""},{"$f":"IF(COUNTIF(BdD!$A:$A,$A$1)>ROW()-1,INDEX(BdD!E:E,MATCH($A$1&\"_\"&ROW()-2,BdD!$K:$K,0)),\"\")","v":""},{"$f":"IF(COUNTIF(BdD!$A:$A,$A$1)>ROW()-1,INDEX(BdD!F:F,MATCH($A$1&\"_\"&ROW()-2,BdD!$K:$K,0)),\"\")","v":""},{"$f":"IF(COUNTIF(BdD!$A:$A,$A$1)>ROW()-1,INDEX(BdD!G:G,MATCH($A$1&\"_\"&ROW()-2,BdD!$K:$K,0)),\"\")","v":""},{"$f":"IF(COUNTIF(BdD!$A:$A,$A$1)>ROW()-1,INDEX(BdD!H:H,MATCH($A$1&\"_\"&ROW()-2,BdD!$K:$K,0)),\"\")","v":""},{"$f":"IF(COUNTIF(BdD!$A:$A,$A$1)>ROW()-1,INDEX(BdD!I:I,MATCH($A$1&\"_\"&ROW()-2,BdD!$K:$K,0)),\"\")","v":""}]
[{"$f":"IF(COUNTIF(BdD!$A:$A,$A$1)>ROW()-1,INDEX(BdD!B:B,MATCH($A$1&\"_\"&ROW()-2,BdD!$K:$K,0)),\"\")","v":""},{"$f":"IF(COUNTIF(BdD!$A:$A,$A$1)>ROW()-1,INDEX(BdD!C:C,MATCH($A$1&\"_\"&ROW()-2,BdD!$K:$K,0)),\"\")","v":""},{"$f":"IF(COUNTIF(BdD!$A:$A,$A$1)>ROW()-1,INDEX(BdD!D:D,MATCH($A$1&\"_\"&ROW()-2,BdD!$K:$K,0)),\"\")","v":""},{"$f":"IF(COUNTIF(BdD!$A:$A,$A$1)>ROW()-1,INDEX(BdD!E:E,MATCH($A$1&\"_\"&ROW()-2,BdD!$K:$K,0)),\"\")","v":""},{"$f":"IF(COUNTIF(BdD!$A:$A,$A$1)>ROW()-1,INDEX(BdD!F:F,MATCH($A$1&\"_\"&ROW()-2,BdD!$K:$K,0)),\"\")","v":""},{"$f":"IF(COUNTIF(BdD!$A:$A,$A$1)>ROW()-1,INDEX(BdD!G:G,MATCH($A$1&\"_\"&ROW()-2,BdD!$K:$K,0)),\"\")","v":""},{"$f":"IF(COUNTIF(BdD!$A:$A,$A$1)>ROW()-1,INDEX(BdD!H:H,MATCH($A$1&\"_\"&ROW()-2,BdD!$K:$K,0)),\"\")","v":""},{"$f":"IF(COUNTIF(BdD!$A:$A,$A$1)>ROW()-1,INDEX(BdD!I:I,MATCH($A$1&\"_\"&ROW()-2,BdD!$K:$K,0)),\"\")","v":""}]
[{"$f":"IF(COUNTIF(BdD!$A:$A,$A$1)>ROW()-1,INDEX(BdD!B:B,MATCH($A$1&\"_\"&ROW()-2,BdD!$K:$K,0)),\"\")","v":""},{"$f":"IF(COUNTIF(BdD!$A:$A,$A$1)>ROW()-1,INDEX(BdD!C:C,MATCH($A$1&\"_\"&ROW()-2,BdD!$K:$K,0)),\"\")","v":""},{"$f":"IF(COUNTIF(BdD!$A:$A,$A$1)>ROW()-1,INDEX(BdD!D:D,MATCH($A$1&\"_\"&ROW()-2,BdD!$K:$K,0)),\"\")","v":""},{"$f":"IF(COUNTIF(BdD!$A:$A,$A$1)>ROW()-1,INDEX(BdD!E:E,MATCH($A$1&\"_\"&ROW()-2,BdD!$K:$K,0)),\"\")","v":""},{"$f":"IF(COUNTIF(BdD!$A:$A,$A$1)>ROW()-1,INDEX(BdD!F:F,MATCH($A$1&\"_\"&ROW()-2,BdD!$K:$K,0)),\"\")","v":""},{"$f":"IF(COUNTIF(BdD!$A:$A,$A$1)>ROW()-1,INDEX(BdD!G:G,MATCH($A$1&\"_\"&ROW()-2,BdD!$K:$K,0)),\"\")","v":""},{"$f":"IF(COUNTIF(BdD!$A:$A,$A$1)>ROW()-1,INDEX(BdD!H:H,MATCH($A$1&\"_\"&ROW()-2,BdD!$K:$K,0)),\"\")","v":""},{"$f":"IF(COUNTIF(BdD!$A:$A,$A$1)>ROW()-1,INDEX(BdD!I:I,MATCH($A$1&\"_\"&ROW()-2,BdD!$K:$K,0)),\"\")","v":""}]
[{"$f":"IF(COUNTIF(BdD!$A:$A,$A$1)>ROW()-1,INDEX(BdD!B:B,MATCH($A$1&\"_\"&ROW()-2,BdD!$K:$K,0)),\"\")","v":""},{"$f":"IF(COUNTIF(BdD!$A:$A,$A$1)>ROW()-1,INDEX(BdD!C:C,MATCH($A$1&\"_\"&ROW()-2,BdD!$K:$K,0)),\"\")","v":""},{"$f":"IF(COUNTIF(BdD!$A:$A,$A$1)>ROW()-1,INDEX(BdD!D:D,MATCH($A$1&\"_\"&ROW()-2,BdD!$K:$K,0)),\"\")","v":""},{"$f":"IF(COUNTIF(BdD!$A:$A,$A$1)>ROW()-1,INDEX(BdD!E:E,MATCH($A$1&\"_\"&ROW()-2,BdD!$K:$K,0)),\"\")","v":""},{"$f":"IF(COUNTIF(BdD!$A:$A,$A$1)>ROW()-1,INDEX(BdD!F:F,MATCH($A$1&\"_\"&ROW()-2,BdD!$K:$K,0)),\"\")","v":""},{"$f":"IF(COUNTIF(BdD!$A:$A,$A$1)>ROW()-1,INDEX(BdD!G:G,MATCH($A$1&\"_\"&ROW()-2,BdD!$K:$K,0)),\"\")","v":""},{"$f":"IF(COUNTIF(BdD!$A:$A,$A$1)>ROW()-1,INDEX(BdD!H:H,MATCH($A$1&\"_\"&ROW()-2,BdD!$K:$K,0)),\"\")","v":""},{"$f":"IF(COUNTIF(BdD!$A:$A,$A$1)>ROW()-1,INDEX(BdD!I:I,MATCH($A$1&\"_\"&ROW()-2,BdD!$K:$K,0)),\"\")","v":""}]
[{"$f":"IF(COUNTIF(BdD!$A:$A,$A$1)>ROW()-1,INDEX(BdD!B:B,MATCH($A$1&\"_\"&ROW()-2,BdD!$K:$K,0)),\"\")","v":""},{"$f":"IF(COUNTIF(BdD!$A:$A,$A$1)>ROW()-1,INDEX(BdD!C:C,MATCH($A$1&\"_\"&ROW()-2,BdD!$K:$K,0)),\"\")","v":""},{"$f":"IF(COUNTIF(BdD!$A:$A,$A$1)>ROW()-1,INDEX(BdD!D:D,MATCH($A$1&\"_\"&ROW()-2,BdD!$K:$K,0)),\"\")","v":""},{"$f":"IF(COUNTIF(BdD!$A:$A,$A$1)>ROW()-1,INDEX(BdD!E:E,MATCH($A$1&\"_\"&ROW()-2,BdD!$K:$K,0)),\"\")","v":""},{"$f":"IF(COUNTIF(BdD!$A:$A,$A$1)>ROW()-1,INDEX(BdD!F:F,MATCH($A$1&\"_\"&ROW()-2,BdD!$K:$K,0)),\"\")","v":""},{"$f":"IF(COUNTIF(BdD!$A:$A,$A$1)>ROW()-1,INDEX(BdD!G:G,MATCH($A$1&\"_\"&ROW()-2,BdD!$K:$K,0)),\"\")","v":""},{"$f":"IF(COUNTIF(BdD!$A:$A,$A$1)>ROW()-1,INDEX(BdD!H:H,MATCH($A$1&\"_\"&ROW()-2,BdD!$K:$K,0)),\"\")","v":""},{"$f":"IF(COUNTIF(BdD!$A:$A,$A$1)>ROW()-1,INDEX(BdD!I:I,MATCH($A$1&\"_\"&ROW()-2,BdD!$K:$K,0)),\"\")","v":""}]
[{"$f":"IF(COUNTIF(BdD!$A:$A,$A$1)>ROW()-1,INDEX(BdD!B:B,MATCH($A$1&\"_\"&ROW()-2,BdD!$K:$K,0)),\"\")","v":""},{"$f":"IF(COUNTIF(BdD!$A:$A,$A$1)>ROW()-1,INDEX(BdD!C:C,MATCH($A$1&\"_\"&ROW()-2,BdD!$K:$K,0)),\"\")","v":""},{"$f":"IF(COUNTIF(BdD!$A:$A,$A$1)>ROW()-1,INDEX(BdD!D:D,MATCH($A$1&\"_\"&ROW()-2,BdD!$K:$K,0)),\"\")","v":""},{"$f":"IF(COUNTIF(BdD!$A:$A,$A$1)>ROW()-1,INDEX(BdD!E:E,MATCH($A$1&\"_\"&ROW()-2,BdD!$K:$K,0)),\"\")","v":""},{"$f":"IF(COUNTIF(BdD!$A:$A,$A$1)>ROW()-1,INDEX(BdD!F:F,MATCH($A$1&\"_\"&ROW()-2,BdD!$K:$K,0)),\"\")","v":""},{"$f":"IF(COUNTIF(BdD!$A:$A,$A$1)>ROW()-1,INDEX(BdD!G:G,MATCH($A$1&\"_\"&ROW()-2,BdD!$K:$K,0)),\"\")","v":""},{"$f":"IF(COUNTIF(BdD!$A:$A,$A$1)>ROW()-1,INDEX(BdD!H:H,MATCH($A$1&\"_\"&ROW()-2,BdD!$K:$K,0)),\"\")","v":""},{"$f":"IF(COUNTIF(BdD!$A:$A,$A$1)>ROW()-1,INDEX(BdD!I:I,MATCH($A$1&\"_\"&ROW()-2,BdD!$K:$K,0)),\"\")","v":""}]
[{"$f":"IF(COUNTIF(BdD!$A:$A,$A$1)>ROW()-1,INDEX(BdD!B:B,MATCH($A$1&\"_\"&ROW()-2,BdD!$K:$K,0)),\"\")","v":""},{"$f":"IF(COUNTIF(BdD!$A:$A,$A$1)>ROW()-1,INDEX(BdD!C:C,MATCH($A$1&\"_\"&ROW()-2,BdD!$K:$K,0)),\"\")","v":""},{"$f":"IF(COUNTIF(BdD!$A:$A,$A$1)>ROW()-1,INDEX(BdD!D:D,MATCH($A$1&\"_\"&ROW()-2,BdD!$K:$K,0)),\"\")","v":""},{"$f":"IF(COUNTIF(BdD!$A:$A,$A$1)>ROW()-1,INDEX(BdD!E:E,MATCH($A$1&\"_\"&ROW()-2,BdD!$K:$K,0)),\"\")","v":""},{"$f":"IF(COUNTIF(BdD!$A:$A,$A$1)>ROW()-1,INDEX(BdD!F:F,MATCH($A$1&\"_\"&ROW()-2,BdD!$K:$K,0)),\"\")","v":""},{"$f":"IF(COUNTIF(BdD!$A:$A,$A$1)>ROW()-1,INDEX(BdD!G:G,MATCH($A$1&\"_\"&ROW()-2,BdD!$K:$K,0)),\"\")","v":""},{"$f":"IF(COUNTIF(BdD!$A:$A,$A$1)>ROW()-1,INDEX(BdD!H:H,MATCH($A$1&\"_\"&ROW()-2,BdD!$K:$K,0)),\"\")","v":""},{"$f":"IF(COUNTIF(BdD!$A:$A,$A$1)>ROW()-1,INDEX(BdD!I:I,MATCH($A$1&\"_\"&ROW()-2,BdD!$K:$K,0)),\"\")","v":""}]
[{"$f":"IF(COUNTIF(BdD!$A:$A,$A$1)>ROW()-1,INDEX(BdD!B:B,MATCH($A$1&\"_\"&ROW()-2,BdD!$K:$K,0)),\"\")","v":""},{"$f":"IF(COUNTIF(BdD!$A:$A,$A$1)>ROW()-1,INDEX(BdD!C:C,MATCH($A$1&\"_\"&ROW()-2,BdD!$K:$K,0)),\"\")","v":""},{"$f":"IF(COUNTIF(BdD!$A:$A,$A$1)>ROW()-1,INDEX(BdD!D:D,MATCH($A$1&\"_\"&ROW()-2,BdD!$K:$K,0)),\"\")","v":""},{"$f":"IF(COUNTIF(BdD!$A:$A,$A$1)>ROW()-1,INDEX(BdD!E:E,MATCH($A$1&\"_\"&ROW()-2,BdD!$K:$K,0)),\"\")","v":""},{"$f":"IF(COUNTIF(BdD!$A:$A,$A$1)>ROW()-1,INDEX(BdD!F:F,MATCH($A$1&\"_\"&ROW()-2,BdD!$K:$K,0)),\"\")","v":""},{"$f":"IF(COUNTIF(BdD!$A:$A,$A$1)>ROW()-1,INDEX(BdD!G:G,MATCH($A$1&\"_\"&ROW()-2,BdD!$K:$K,0)),\"\")","v":""},{"$f":"IF(COUNTIF(BdD!$A:$A,$A$1)>ROW()-1,INDEX(BdD!H:H,MATCH($A$1&\"_\"&ROW()-2,BdD!$K:$K,0)),\"\")","v":""},{"$f":"IF(COUNTIF(BdD!$A:$A,$A$1)>ROW()-1,INDEX(BdD!I:I,MATCH($A$1&\"_\"&ROW()-2,BdD!$K:$K,0)),\"\")","v":""}]
[{"$f":"IF(COUNTIF(BdD!$A:$A,$A$1)>ROW()-1,INDEX(BdD!B:B,MATCH($A$1&\"_\"&ROW()-2,BdD!$K:$K,0)),\"\")","v":""},{"$f":"IF(COUNTIF(BdD!$A:$A,$A$1)>ROW()-1,INDEX(BdD!C:C,MATCH($A$1&\"_\"&ROW()-2,BdD!$K:$K,0)),\"\")","v":""},{"$f":"IF(COUNTIF(BdD!$A:$A,$A$1)>ROW()-1,INDEX(BdD!D:D,MATCH($A$1&\"_\"&ROW()-2,BdD!$K:$K,0)),\"\")","v":""},{"$f":"IF(COUNTIF(BdD!$A:$A,$A$1)>ROW()-1,INDEX(BdD!E:E,MATCH($A$1&\"_\"&ROW()-2,BdD!$K:$K,0)),\"\")","v":""},{"$f":"IF(COUNTIF(BdD!$A:$A,$A$1)>ROW()-1,INDEX(BdD!F:F,MATCH($A$1&\"_\"&ROW()-2,BdD!$K:$K,0)),\"\")","v":""},{"$f":"IF(COUNTIF(BdD!$A:$A,$A$1)>ROW()-1,INDEX(BdD!G:G,MATCH($A$1&\"_\"&ROW()-2,BdD!$K:$K,0)),\"\")","v":""},{"$f":"IF(COUNTIF(BdD!$A:$A,$A$1)>ROW()-1,INDEX(BdD!H:H,MATCH($A$1&\"_\"&ROW()-2,BdD!$K:$K,0)),\"\")","v":""},{"$f":"IF(COUNTIF(BdD!$A:$A,$A$1)>ROW()-1,INDEX(BdD!I:I,MATCH($A$1&\"_\"&ROW()-2,BdD!$K:$K,0)),\"\")","v":""}]
[{"$f":"IF(COUNTIF(BdD!$A:$A,$A$1)>ROW()-1,INDEX(BdD!B:B,MATCH($A$1&\"_\"&ROW()-2,BdD!$K:$K,0)),\"\")","v":""},{"$f":"IF(COUNTIF(BdD!$A:$A,$A$1)>ROW()-1,INDEX(BdD!C:C,MATCH($A$1&\"_\"&ROW()-2,BdD!$K:$K,0)),\"\")","v":""},{"$f":"IF(COUNTIF(BdD!$A:$A,$A$1)>ROW()-1,INDEX(BdD!D:D,MATCH($A$1&\"_\"&ROW()-2,BdD!$K:$K,0)),\"\")","v":""},{"$f":"IF(COUNTIF(BdD!$A:$A,$A$1)>ROW()-1,INDEX(BdD!E:E,MATCH($A$1&\"_\"&ROW()-2,BdD!$K:$K,0)),\"\")","v":""},{"$f":"IF(COUNTIF(BdD!$A:$A,$A$1)>ROW()-1,INDEX(BdD!F:F,MATCH($A$1&\"_\"&ROW()-2,BdD!$K:$K,0)),\"\")","v":""},{"$f":"IF(COUNTIF(BdD!$A:$A,$A$1)>ROW()-1,INDEX(BdD!G:G,MATCH($A$1&\"_\"&ROW()-2,BdD!$K:$K,0)),\"\")","v":""},{"$f":"IF(COUNTIF(BdD!$A:$A,$A$1)>ROW()-1,INDEX(BdD!H:H,MATCH($A$1&\"_\"&ROW()-2,BdD!$K:$K,0)),\"\")","v":""},{"$f":"IF(COUNTIF(BdD!$A:$A,$A$1)>ROW()-1,INDEX(BdD!I:I,MATCH($A$1&\"_\"&ROW()-2,BdD!$K:$K,0)),\"\")","v":""}]
[{"$f":"IF(COUNTIF(BdD!$A:$A,$A$1)>ROW()-1,INDEX(BdD!B:B,MATCH($A$1&\"_\"&ROW()-2,BdD!$K:$K,0)),\"\")","v":""},{"$f":"IF(COUNTIF(BdD!$A:$A,$A$1)>ROW()-1,INDEX(BdD!C:C,MATCH($A$1&\"_\"&ROW()-2,BdD!$K:$K,0)),\"\")","v":""},{"$f":"IF(COUNTIF(BdD!$A:$A,$A$1)>ROW()-1,INDEX(BdD!D:D,MATCH($A$1&\"_\"&ROW()-2,BdD!$K:$K,0)),\"\")","v":""},{"$f":"IF(COUNTIF(BdD!$A:$A,$A$1)>ROW()-1,INDEX(BdD!E:E,MATCH($A$1&\"_\"&ROW()-2,BdD!$K:$K,0)),\"\")","v":""},{"$f":"IF(COUNTIF(BdD!$A:$A,$A$1)>ROW()-1,INDEX(BdD!F:F,MATCH($A$1&\"_\"&ROW()-2,BdD!$K:$K,0)),\"\")","v":""},{"$f":"IF(COUNTIF(BdD!$A:$A,$A$1)>ROW()-1,INDEX(BdD!G:G,MATCH($A$1&\"_\"&ROW()-2,BdD!$K:$K,0)),\"\")","v":""},{"$f":"IF(COUNTIF(BdD!$A:$A,$A$1)>ROW()-1,INDEX(BdD!H:H,MATCH($A$1&\"_\"&ROW()-2,BdD!$K:$K,0)),\"\")","v":""},{"$f":"IF(COUNTIF(BdD!$A:$A,$A$1)>ROW()-1,INDEX(BdD!I:I,MATCH($A$1&\"_\"&ROW()-2,BdD!$K:$K,0)),\"\")","v":""}]
[{"$f":"IF(COUNTIF(BdD!$A:$A,$A$1)>ROW()-1,INDEX(BdD!B:B,MATCH($A$1&\"_\"&ROW()-2,BdD!$K:$K,0)),\"\")","v":""},{"$f":"IF(COUNTIF(BdD!$A:$A,$A$1)>ROW()-1,INDEX(BdD!C:C,MATCH($A$1&\"_\"&ROW()-2,BdD!$K:$K,0)),\"\")","v":""},{"$f":"IF(COUNTIF(BdD!$A:$A,$A$1)>ROW()-1,INDEX(BdD!D:D,MATCH($A$1&\"_\"&ROW()-2,BdD!$K:$K,0)),\"\")","v":""},{"$f":"IF(COUNTIF(BdD!$A:$A,$A$1)>ROW()-1,INDEX(BdD!E:E,MATCH($A$1&\"_\"&ROW()-2,BdD!$K:$K,0)),\"\")","v":""},{"$f":"IF(COUNTIF(BdD!$A:$A,$A$1)>ROW()-1,INDEX(BdD!F:F,MATCH($A$1&\"_\"&ROW()-2,BdD!$K:$K,0)),\"\")","v":""},{"$f":"IF(COUNTIF(BdD!$A:$A,$A$1)>ROW()-1,INDEX(BdD!G:G,MATCH($A$1&\"_\"&ROW()-2,BdD!$K:$K,0)),\"\")","v":""},{"$f":"IF(COUNTIF(BdD!$A:$A,$A$1)>ROW()-1,INDEX(BdD!H:H,MATCH($A$1&\"_\"&ROW()-2,BdD!$K:$K,0)),\"\")","v":""},{"$f":"IF(COUNTIF(BdD!$A:$A,$A$1)>ROW()-1,INDEX(BdD!I:I,MATCH($A$1&\"_\"&ROW()-2,BdD!$K:$K,0)),\"\")","v":""}]
[{"$f":"IF(COUNTIF(BdD!$A:$A,$A$1)>ROW()-1,INDEX(BdD!B:B,MATCH($A$1&\"_\"&ROW()-2,BdD!$K:$K,0)),\"\")","v":""},{"$f":"IF(COUNTIF(BdD!$A:$A,$A$1)>ROW()-1,INDEX(BdD!C:C,MATCH($A$1&\"_\"&ROW()-2,BdD!$K:$K,0)),\"\")","v":""},{"$f":"IF(COUNTIF(BdD!$A:$A,$A$1)>ROW()-1,INDEX(BdD!D:D,MATCH($A$1&\"_\"&ROW()-2,BdD!$K:$K,0)),\"\")","v":""},{"$f":"IF(COUNTIF(BdD!$A:$A,$A$1)>ROW()-1,INDEX(BdD!E:E,MATCH($A$1&\"_\"&ROW()-2,BdD!$K:$K,0)),\"\")","v":""},{"$f":"IF(COUNTIF(BdD!$A:$A,$A$1)>ROW()-1,INDEX(BdD!F:F,MATCH($A$1&\"_\"&ROW()-2,BdD!$K:$K,0)),\"\")","v":""},{"$f":"IF(COUNTIF(BdD!$A:$A,$A$1)>ROW()-1,INDEX(BdD!G:G,MATCH($A$1&\"_\"&ROW()-2,BdD!$K:$K,0)),\"\")","v":""},{"$f":"IF(COUNTIF(BdD!$A:$A,$A$1)>ROW()-1,INDEX(BdD!H:H,MATCH($A$1&\"_\"&ROW()-2,BdD!$K:$K,0)),\"\")","v":""},{"$f":"IF(COUNTIF(BdD!$A:$A,$A$1)>ROW()-1,INDEX(BdD!I:I,MATCH($A$1&\"_\"&ROW()-2,BdD!$K:$K,0)),\"\")","v":""}]
[{"$f":"IF(COUNTIF(BdD!$A:$A,$A$1)>ROW()-1,INDEX(BdD!B:B,MATCH($A$1&\"_\"&ROW()-2,BdD!$K:$K,0)),\"\")","v":""},{"$f":"IF(COUNTIF(BdD!$A:$A,$A$1)>ROW()-1,INDEX(BdD!C:C,MATCH($A$1&\"_\"&ROW()-2,BdD!$K:$K,0)),\"\")","v":""},{"$f":"IF(COUNTIF(BdD!$A:$A,$A$1)>ROW()-1,INDEX(BdD!D:D,MATCH($A$1&\"_\"&ROW()-2,BdD!$K:$K,0)),\"\")","v":""},{"$f":"IF(COUNTIF(BdD!$A:$A,$A$1)>ROW()-1,INDEX(BdD!E:E,MATCH($A$1&\"_\"&ROW()-2,BdD!$K:$K,0)),\"\")","v":""},{"$f":"IF(COUNTIF(BdD!$A:$A,$A$1)>ROW()-1,INDEX(BdD!F:F,MATCH($A$1&\"_\"&ROW()-2,BdD!$K:$K,0)),\"\")","v":""},{"$f":"IF(COUNTIF(BdD!$A:$A,$A$1)>ROW()-1,INDEX(BdD!G:G,MATCH($A$1&\"_\"&ROW()-2,BdD!$K:$K,0)),\"\")","v":""},{"$f":"IF(COUNTIF(BdD!$A:$A,$A$1)>ROW()-1,INDEX(BdD!H:H,MATCH($A$1&\"_\"&ROW()-2,BdD!$K:$K,0)),\"\")","v":""},{"$f":"IF(COUNTIF(BdD!$A:$A,$A$1)>ROW()-1,INDEX(BdD!I:I,MATCH($A$1&\"_\"&ROW()-2,BdD!$K:$K,0)),\"\")","v":""}]
[{"$f":"IF(COUNTIF(BdD!$A:$A,$A$1)>ROW()-1,INDEX(BdD!B:B,MATCH($A$1&\"_\"&ROW()-2,BdD!$K:$K,0)),\"\")","v":""},{"$f":"IF(COUNTIF(BdD!$A:$A,$A$1)>ROW()-1,INDEX(BdD!C:C,MATCH($A$1&\"_\"&ROW()-2,BdD!$K:$K,0)),\"\")","v":""},{"$f":"IF(COUNTIF(BdD!$A:$A,$A$1)>ROW()-1,INDEX(BdD!D:D,MATCH($A$1&\"_\"&ROW()-2,BdD!$K:$K,0)),\"\")","v":""},{"$f":"IF(COUNTIF(BdD!$A:$A,$A$1)>ROW()-1,INDEX(BdD!E:E,MATCH($A$1&\"_\"&ROW()-2,BdD!$K:$K,0)),\"\")","v":""},{"$f":"IF(COUNTIF(BdD!$A:$A,$A$1)>ROW()-1,INDEX(BdD!F:F,MATCH($A$1&\"_\"&ROW()-2,BdD!$K:$K,0)),\"\")","v":""},{"$f":"IF(COUNTIF(BdD!$A:$A,$A$1)>ROW()-1,INDEX(BdD!G:G,MATCH($A$1&\"_\"&ROW()-2,BdD!$K:$K,0)),\"\")","v":""},{"$f":"IF(COUNTIF(BdD!$A:$A,$A$1)>ROW()-1,INDEX(BdD!H:H,MATCH($A$1&\"_\"&ROW()-2,BdD!$K:$K,0)),\"\")","v":""},{"$f":"IF(COUNTIF(BdD!$A:$A,$A$1)>ROW()-1,INDEX(BdD!I:I,MATCH($A$1&\"_\"&ROW()-2,BdD!$K:$K,0)),\"\")","v":""}]
[{"$f":"IF(COUNTIF(BdD!$A:$A,$A$1)>ROW()-1,INDEX(BdD!B:B,MATCH($A$1&\"_\"&ROW()-2,BdD!$K:$K,0)),\"\")","v":""},{"$f":"IF(COUNTIF(BdD!$A:$A,$A$1)>ROW()-1,INDEX(BdD!C:C,MATCH($A$1&\"_\"&ROW()-2,BdD!$K:$K,0)),\"\")","v":""},{"$f":"IF(COUNTIF(BdD!$A:$A,$A$1)>ROW()-1,INDEX(BdD!D:D,MATCH($A$1&\"_\"&ROW()-2,BdD!$K:$K,0)),\"\")","v":""},{"$f":"IF(COUNTIF(BdD!$A:$A,$A$1)>ROW()-1,INDEX(BdD!E:E,MATCH($A$1&\"_\"&ROW()-2,BdD!$K:$K,0)),\"\")","v":""},{"$f":"IF(COUNTIF(BdD!$A:$A,$A$1)>ROW()-1,INDEX(BdD!F:F,MATCH($A$1&\"_\"&ROW()-2,BdD!$K:$K,0)),\"\")","v":""},{"$f":"IF(COUNTIF(BdD!$A:$A,$A$1)>ROW()-1,INDEX(BdD!G:G,MATCH($A$1&\"_\"&ROW()-2,BdD!$K:$K,0)),\"\")","v":""},{"$f":"IF(COUNTIF(BdD!$A:$A,$A$1)>ROW()-1,INDEX(BdD!H:H,MATCH($A$1&\"_\"&ROW()-2,BdD!$K:$K,0)),\"\")","v":""},{"$f":"IF(COUNTIF(BdD!$A:$A,$A$1)>ROW()-1,INDEX(BdD!I:I,MATCH($A$1&\"_\"&ROW()-2,BdD!$K:$K,0)),\"\")","v":""}]
[{"$f":"IF(COUNTIF(BdD!$A:$A,$A$1)>ROW()-1,INDEX(BdD!B:B,MATCH($A$1&\"_\"&ROW()-2,BdD!$K:$K,0)),\"\")","v":""},{"$f":"IF(COUNTIF(BdD!$A:$A,$A$1)>ROW()-1,INDEX(BdD!C:C,MATCH($A$1&\"_\"&ROW()-2,BdD!$K:$K,0)),\"\")","v":""},{"$f":"IF(COUNTIF(BdD!$A:$A,$A$1)>ROW()-1,INDEX(BdD!D:D,MATCH($A$1&\"_\"&ROW()-2,BdD!$K:$K,0)),\"\")","v":""},{"$f":"IF(COUNTIF(BdD!$A:$A,$A$1)>ROW()-1,INDEX(BdD!E:E,MATCH($A$1&\"_\"&ROW()-2,BdD!$K:$K,0)),\"\")","v":""},{"$f":"IF(COUNTIF(BdD!$A:$A,$A$1)>ROW()-1,INDEX(BdD!F:F,MATCH($A$1&\"_\"&ROW()-2,BdD!$K:$K,0)),\"\")","v":""},{"$f":"IF(COUNTIF(BdD!$A:$A,$A$1)>ROW()-1,INDEX(BdD!G:G,MATCH($A$1&\"_\"&ROW()-2,BdD!$K:$K,0)),\"\")","v":""},{"$f":"IF(COUNTIF(BdD!$A:$A,$A$1)>ROW()-1,INDEX(BdD!H:H,MATCH($A$1&\"_\"&ROW()-2,BdD!$K:$K,0)),\"\")","v":""},{"$f":"IF(COUNTIF(BdD!$A:$A,$A$1)>ROW()-1,INDEX(BdD!I:I,MATCH($A$1&\"_\"&ROW()-2,BdD!$K:$K,0)),\"\")","v":""}]
[{"$f":"IF(COUNTIF(BdD!$A:$A,$A$1)>ROW()-1,INDEX(BdD!B:B,MATCH($A$1&\"_\"&ROW()-2,BdD!$K:$K,0)),\"\")","v":""},{"$f":"IF(COUNTIF(BdD!$A:$A,$A$1)>ROW()-1,INDEX(BdD!C:C,MATCH($A$1&\"_\"&ROW()-2,BdD!$K:$K,0)),\"\")","v":""},{"$f":"IF(COUNTIF(BdD!$A:$A,$A$1)>ROW()-1,INDEX(BdD!D:D,MATCH($A$1&\"_\"&ROW()-2,BdD!$K:$K,0)),\"\")","v":""},{"$f":"IF(COUNTIF(BdD!$A:$A,$A$1)>ROW()-1,INDEX(BdD!E:E,MATCH($A$1&\"_\"&ROW()-2,BdD!$K:$K,0)),\"\")","v":""},{"$f":"IF(COUNTIF(BdD!$A:$A,$A$1)>ROW()-1,INDEX(BdD!F:F,MATCH($A$1&\"_\"&ROW()-2,BdD!$K:$K,0)),\"\")","v":""},{"$f":"IF(COUNTIF(BdD!$A:$A,$A$1)>ROW()-1,INDEX(BdD!G:G,MATCH($A$1&\"_\"&ROW()-2,BdD!$K:$K,0)),\"\")","v":""},{"$f":"IF(COUNTIF(BdD!$A:$A,$A$1)>ROW()-1,INDEX(BdD!H:H,MATCH($A$1&\"_\"&ROW()-2,BdD!$K:$K,0)),\"\")","v":""},{"$f":"IF(COUNTIF(BdD!$A:$A,$A$1)>ROW()-1,INDEX(BdD!I:I,MATCH($A$1&\"_\"&ROW()-2,BdD!$K:$K,0)),\"\")","v":""}]
[{"$f":"IF(COUNTIF(BdD!$A:$A,$A$1)>ROW()-1,INDEX(BdD!B:B,MATCH($A$1&\"_\"&ROW()-2,BdD!$K:$K,0)),\"\")","v":""},{"$f":"IF(COUNTIF(BdD!$A:$A,$A$1)>ROW()-1,INDEX(BdD!C:C,MATCH($A$1&\"_\"&ROW()-2,BdD!$K:$K,0)),\"\")","v":""},{"$f":"IF(COUNTIF(BdD!$A:$A,$A$1)>ROW()-1,INDEX(BdD!D:D,MATCH($A$1&\"_\"&ROW()-2,BdD!$K:$K,0)),\"\")","v":""},{"$f":"IF(COUNTIF(BdD!$A:$A,$A$1)>ROW()-1,INDEX(BdD!E:E,MATCH($A$1&\"_\"&ROW()-2,BdD!$K:$K,0)),\"\")","v":""},{"$f":"IF(COUNTIF(BdD!$A:$A,$A$1)>ROW()-1,INDEX(BdD!F:F,MATCH($A$1&\"_\"&ROW()-2,BdD!$K:$K,0)),\"\")","v":""},{"$f":"IF(COUNTIF(BdD!$A:$A,$A$1)>ROW()-1,INDEX(BdD!G:G,MATCH($A$1&\"_\"&ROW()-2,BdD!$K:$K,0)),\"\")","v":""},{"$f":"IF(COUNTIF(BdD!$A:$A,$A$1)>ROW()-1,INDEX(BdD!H:H,MATCH($A$1&\"_\"&ROW()-2,BdD!$K:$K,0)),\"\")","v":""},{"$f":"IF(COUNTIF(BdD!$A:$A,$A$1)>ROW()-1,INDEX(BdD!I:I,MATCH($A$1&\"_\"&ROW()-2,BdD!$K:$K,0)),\"\")","v":""}]
[{"$f":"IF(COUNTIF(BdD!$A:$A,$A$1)>ROW()-1,INDEX(BdD!B:B,MATCH($A$1&\"_\"&ROW()-2,BdD!$K:$K,0)),\"\")","v":""},{"$f":"IF(COUNTIF(BdD!$A:$A,$A$1)>ROW()-1,INDEX(BdD!C:C,MATCH($A$1&\"_\"&ROW()-2,BdD!$K:$K,0)),\"\")","v":""},{"$f":"IF(COUNTIF(BdD!$A:$A,$A$1)>ROW()-1,INDEX(BdD!D:D,MATCH($A$1&\"_\"&ROW()-2,BdD!$K:$K,0)),\"\")","v":""},{"$f":"IF(COUNTIF(BdD!$A:$A,$A$1)>ROW()-1,INDEX(BdD!E:E,MATCH($A$1&\"_\"&ROW()-2,BdD!$K:$K,0)),\"\")","v":""},{"$f":"IF(COUNTIF(BdD!$A:$A,$A$1)>ROW()-1,INDEX(BdD!F:F,MATCH($A$1&\"_\"&ROW()-2,BdD!$K:$K,0)),\"\")","v":""},{"$f":"IF(COUNTIF(BdD!$A:$A,$A$1)>ROW()-1,INDEX(BdD!G:G,MATCH($A$1&\"_\"&ROW()-2,BdD!$K:$K,0)),\"\")","v":""},{"$f":"IF(COUNTIF(BdD!$A:$A,$A$1)>ROW()-1,INDEX(BdD!H:H,MATCH($A$1&\"_\"&ROW()-2,BdD!$K:$K,0)),\"\")","v":""},{"$f":"IF(COUNTIF(BdD!$A:$A,$A$1)>ROW()-1,INDEX(BdD!I:I,MATCH($A$1&\"_\"&ROW()-2,BdD!$K:$K,0)),\"\")","v":""}]
[{"$f":"IF(COUNTIF(BdD!$A:$A,$A$1)>ROW()-1,INDEX(BdD!B:B,MATCH($A$1&\"_\"&ROW()-2,BdD!$K:$K,0)),\"\")","v":""},{"$f":"IF(COUNTIF(BdD!$A:$A,$A$1)>ROW()-1,INDEX(BdD!C:C,MATCH($A$1&\"_\"&ROW()-2,BdD!$K:$K,0)),\"\")","v":""},{"$f":"IF(COUNTIF(BdD!$A:$A,$A$1)>ROW()-1,INDEX(BdD!D:D,MATCH($A$1&\"_\"&ROW()-2,BdD!$K:$K,0)),\"\")","v":""},{"$f":"IF(COUNTIF(BdD!$A:$A,$A$1)>ROW()-1,INDEX(BdD!E:E,MATCH($A$1&\"_\"&ROW()-2,BdD!$K:$K,0)),\"\")","v":""},{"$f":"IF(COUNTIF(BdD!$A:$A,$A$1)>ROW()-1,INDEX(BdD!F:F,MATCH($A$1&\"_\"&ROW()-2,BdD!$K:$K,0)),\"\")","v":""},{"$f":"IF(COUNTIF(BdD!$A:$A,$A$1)>ROW()-1,INDEX(BdD!G:G,MATCH($A$1&\"_\"&ROW()-2,BdD!$K:$K,0)),\"\")","v":""},{"$f":"IF(COUNTIF(BdD!$A:$A,$A$1)>ROW()-1,INDEX(BdD!H:H,MATCH($A$1&\"_\"&ROW()-2,BdD!$K:$K,0)),\"\")","v":""},{"$f":"IF(COUNTIF(BdD!$A:$A,$A$1)>ROW()-1,INDEX(BdD!I:I,MATCH($A$1&\"_\"&ROW()-2,BdD!$K:$K,0)),\"\")","v":""}]
[{"$f":"IF(COUNTIF(BdD!$A:$A,$A$1)>ROW()-1,INDEX(BdD!B:B,MATCH($A$1&\"_\"&ROW()-2,BdD!$K:$K,0)),\"\")","v":""},{"$f":"IF(COUNTIF(BdD!$A:$A,$A$1)>ROW()-1,INDEX(BdD!C:C,MATCH($A$1&\"_\"&ROW()-2,BdD!$K:$K,0)),\"\")","v":""},{"$f":"IF(COUNTIF(BdD!$A:$A,$A$1)>ROW()-1,INDEX(BdD!D:D,MATCH($A$1&\"_\"&ROW()-2,BdD!$K:$K,0)),\"\")","v":""},{"$f":"IF(COUNTIF(BdD!$A:$A,$A$1)>ROW()-1,INDEX(BdD!E:E,MATCH($A$1&\"_\"&ROW()-2,BdD!$K:$K,0)),\"\")","v":""},{"$f":"IF(COUNTIF(BdD!$A:$A,$A$1)>ROW()-1,INDEX(BdD!F:F,MATCH($A$1&\"_\"&ROW()-2,BdD!$K:$K,0)),\"\")","v":""},{"$f":"IF(COUNTIF(BdD!$A:$A,$A$1)>ROW()-1,INDEX(BdD!G:G,MATCH($A$1&\"_\"&ROW()-2,BdD!$K:$K,0)),\"\")","v":""},{"$f":"IF(COUNTIF(BdD!$A:$A,$A$1)>ROW()-1,INDEX(BdD!H:H,MATCH($A$1&\"_\"&ROW()-2,BdD!$K:$K,0)),\"\")","v":""},{"$f":"IF(COUNTIF(BdD!$A:$A,$A$1)>ROW()-1,INDEX(BdD!I:I,MATCH($A$1&\"_\"&ROW()-2,BdD!$K:$K,0)),\"\")","v":""}]
[{"$f":"IF(COUNTIF(BdD!$A:$A,$A$1)>ROW()-1,INDEX(BdD!B:B,MATCH($A$1&\"_\"&ROW()-2,BdD!$K:$K,0)),\"\")","v":""},{"$f":"IF(COUNTIF(BdD!$A:$A,$A$1)>ROW()-1,INDEX(BdD!C:C,MATCH($A$1&\"_\"&ROW()-2,BdD!$K:$K,0)),\"\")","v":""},{"$f":"IF(COUNTIF(BdD!$A:$A,$A$1)>ROW()-1,INDEX(BdD!D:D,MATCH($A$1&\"_\"&ROW()-2,BdD!$K:$K,0)),\"\")","v":""},{"$f":"IF(COUNTIF(BdD!$A:$A,$A$1)>ROW()-1,INDEX(BdD!E:E,MATCH($A$1&\"_\"&ROW()-2,BdD!$K:$K,0)),\"\")","v":""},{"$f":"IF(COUNTIF(BdD!$A:$A,$A$1)>ROW()-1,INDEX(BdD!F:F,MATCH($A$1&\"_\"&ROW()-2,BdD!$K:$K,0)),\"\")","v":""},{"$f":"IF(COUNTIF(BdD!$A:$A,$A$1)>ROW()-1,INDEX(BdD!G:G,MATCH($A$1&\"_\"&ROW()-2,BdD!$K:$K,0)),\"\")","v":""},{"$f":"IF(COUNTIF(BdD!$A:$A,$A$1)>ROW()-1,INDEX(BdD!H:H,MATCH($A$1&\"_\"&ROW()-2,BdD!$K:$K,0)),\"\")","v":""},{"$f":"IF(COUNTIF(BdD!$A:$A,$A$1)>ROW()-1,INDEX(BdD!I:I,MATCH($A$1&\"_\"&ROW()-2,BdD!$K:$K,0)),\"\")","v":""}]
[{"$f":"IF(COUNTIF(BdD!$A:$A,$A$1)>ROW()-1,INDEX(BdD!B:B,MATCH($A$1&\"_\"&ROW()-2,BdD!$K:$K,0)),\"\")","v":""},{"$f":"IF(COUNTIF(BdD!$A:$A,$A$1)>ROW()-1,INDEX(BdD!C:C,MATCH($A$1&\"_\"&ROW()-2,BdD!$K:$K,0)),\"\")","v":""},{"$f":"IF(COUNTIF(BdD!$A:$A,$A$1)>ROW()-1,INDEX(BdD!D:D,MATCH($A$1&\"_\"&ROW()-2,BdD!$K:$K,0)),\"\")","v":""},{"$f":"IF(COUNTIF(BdD!$A:$A,$A$1)>ROW()-1,INDEX(BdD!E:E,MATCH($A$1&\"_\"&ROW()-2,BdD!$K:$K,0)),\"\")","v":""},{"$f":"IF(COUNTIF(BdD!$A:$A,$A$1)>ROW()-1,INDEX(BdD!F:F,MATCH($A$1&\"_\"&ROW()-2,BdD!$K:$K,0)),\"\")","v":""},{"$f":"IF(COUNTIF(BdD!$A:$A,$A$1)>ROW()-1,INDEX(BdD!G:G,MATCH($A$1&\"_\"&ROW()-2,BdD!$K:$K,0)),\"\")","v":""},{"$f":"IF(COUNTIF(BdD!$A:$A,$A$1)>ROW()-1,INDEX(BdD!H:H,MATCH($A$1&\"_\"&ROW()-2,BdD!$K:$K,0)),\"\")","v":""},{"$f":"IF(COUNTIF(BdD!$A:$A,$A$1)>ROW()-1,INDEX(BdD!I:I,MATCH($A$1&\"_\"&ROW()-2,BdD!$K:$K,0)),\"\")","v":""}]
[{"$f":"IF(COUNTIF(BdD!$A:$A,$A$1)>ROW()-1,INDEX(BdD!B:B,MATCH($A$1&\"_\"&ROW()-2,BdD!$K:$K,0)),\"\")","v":""},{"$f":"IF(COUNTIF(BdD!$A:$A,$A$1)>ROW()-1,INDEX(BdD!C:C,MATCH($A$1&\"_\"&ROW()-2,BdD!$K:$K,0)),\"\")","v":""},{"$f":"IF(COUNTIF(BdD!$A:$A,$A$1)>ROW()-1,INDEX(BdD!D:D,MATCH($A$1&\"_\"&ROW()-2,BdD!$K:$K,0)),\"\")","v":""},{"$f":"IF(COUNTIF(BdD!$A:$A,$A$1)>ROW()-1,INDEX(BdD!E:E,MATCH($A$1&\"_\"&ROW()-2,BdD!$K:$K,0)),\"\")","v":""},{"$f":"IF(COUNTIF(BdD!$A:$A,$A$1)>ROW()-1,INDEX(BdD!F:F,MATCH($A$1&\"_\"&ROW()-2,BdD!$K:$K,0)),\"\")","v":""},{"$f":"IF(COUNTIF(BdD!$A:$A,$A$1)>ROW()-1,INDEX(BdD!G:G,MATCH($A$1&\"_\"&ROW()-2,BdD!$K:$K,0)),\"\")","v":""},{"$f":"IF(COUNTIF(BdD!$A:$A,$A$1)>ROW()-1,INDEX(BdD!H:H,MATCH($A$1&\"_\"&ROW()-2,BdD!$K:$K,0)),\"\")","v":""},{"$f":"IF(COUNTIF(BdD!$A:$A,$A$1)>ROW()-1,INDEX(BdD!I:I,MATCH($A$1&\"_\"&ROW()-2,BdD!$K:$K,0)),\"\")","v":""}]
[{"$f":"IF(COUNTIF(BdD!$A:$A,$A$1)>ROW()-1,INDEX(BdD!B:B,MATCH($A$1&\"_\"&ROW()-2,BdD!$K:$K,0)),\"\")","v":""},{"$f":"IF(COUNTIF(BdD!$A:$A,$A$1)>ROW()-1,INDEX(BdD!C:C,MATCH($A$1&\"_\"&ROW()-2,BdD!$K:$K,0)),\"\")","v":""},{"$f":"IF(COUNTIF(BdD!$A:$A,$A$1)>ROW()-1,INDEX(BdD!D:D,MATCH($A$1&\"_\"&ROW()-2,BdD!$K:$K,0)),\"\")","v":""},{"$f":"IF(COUNTIF(BdD!$A:$A,$A$1)>ROW()-1,INDEX(BdD!E:E,MATCH($A$1&\"_\"&ROW()-2,BdD!$K:$K,0)),\"\")","v":""},{"$f":"IF(COUNTIF(BdD!$A:$A,$A$1)>ROW()-1,INDEX(BdD!F:F,MATCH($A$1&\"_\"&ROW()-2,BdD!$K:$K,0)),\"\")","v":""},{"$f":"IF(COUNTIF(BdD!$A:$A,$A$1)>ROW()-1,INDEX(BdD!G:G,MATCH($A$1&\"_\"&ROW()-2,BdD!$K:$K,0)),\"\")","v":""},{"$f":"IF(COUNTIF(BdD!$A:$A,$A$1)>ROW()-1,INDEX(BdD!H:H,MATCH($A$1&\"_\"&ROW()-2,BdD!$K:$K,0)),\"\")","v":""},{"$f":"IF(COUNTIF(BdD!$A:$A,$A$1)>ROW()-1,INDEX(BdD!I:I,MATCH($A$1&\"_\"&ROW()-2,BdD!$K:$K,0)),\"\")","v":""}]
[{"$f":"IF(COUNTIF(BdD!$A:$A,$A$1)>ROW()-1,INDEX(BdD!B:B,MATCH($A$1&\"_\"&ROW()-2,BdD!$K:$K,0)),\"\")","v":""},{"$f":"IF(COUNTIF(BdD!$A:$A,$A$1)>ROW()-1,INDEX(BdD!C:C,MATCH($A$1&\"_\"&ROW()-2,BdD!$K:$K,0)),\"\")","v":""},{"$f":"IF(COUNTIF(BdD!$A:$A,$A$1)>ROW()-1,INDEX(BdD!D:D,MATCH($A$1&\"_\"&ROW()-2,BdD!$K:$K,0)),\"\")","v":""},{"$f":"IF(COUNTIF(BdD!$A:$A,$A$1)>ROW()-1,INDEX(BdD!E:E,MATCH($A$1&\"_\"&ROW()-2,BdD!$K:$K,0)),\"\")","v":""},{"$f":"IF(COUNTIF(BdD!$A:$A,$A$1)>ROW()-1,INDEX(BdD!F:F,MATCH($A$1&\"_\"&ROW()-2,BdD!$K:$K,0)),\"\")","v":""},{"$f":"IF(COUNTIF(BdD!$A:$A,$A$1)>ROW()-1,INDEX(BdD!G:G,MATCH($A$1&\"_\"&ROW()-2,BdD!$K:$K,0)),\"\")","v":""},{"$f":"IF(COUNTIF(BdD!$A:$A,$A$1)>ROW()-1,INDEX(BdD!H:H,MATCH($A$1&\"_\"&ROW()-2,BdD!$K:$K,0)),\"\")","v":""},{"$f":"IF(COUNTIF(BdD!$A:$A,$A$1)>ROW()-1,INDEX(BdD!I:I,MATCH($A$1&\"_\"&ROW()-2,BdD!$K:$K,0)),\"\")","v":""}]
[{"$f":"IF(COUNTIF(BdD!$A:$A,$A$1)>ROW()-1,INDEX(BdD!B:B,MATCH($A$1&\"_\"&ROW()-2,BdD!$K:$K,0)),\"\")","v":""},{"$f":"IF(COUNTIF(BdD!$A:$A,$A$1)>ROW()-1,INDEX(BdD!C:C,MATCH($A$1&\"_\"&ROW()-2,BdD!$K:$K,0)),\"\")","v":""},{"$f":"IF(COUNTIF(BdD!$A:$A,$A$1)>ROW()-1,INDEX(BdD!D:D,MATCH($A$1&\"_\"&ROW()-2,BdD!$K:$K,0)),\"\")","v":""},{"$f":"IF(COUNTIF(BdD!$A:$A,$A$1)>ROW()-1,INDEX(BdD!E:E,MATCH($A$1&\"_\"&ROW()-2,BdD!$K:$K,0)),\"\")","v":""},{"$f":"IF(COUNTIF(BdD!$A:$A,$A$1)>ROW()-1,INDEX(BdD!F:F,MATCH($A$1&\"_\"&ROW()-2,BdD!$K:$K,0)),\"\")","v":""},{"$f":"IF(COUNTIF(BdD!$A:$A,$A$1)>ROW()-1,INDEX(BdD!G:G,MATCH($A$1&\"_\"&ROW()-2,BdD!$K:$K,0)),\"\")","v":""},{"$f":"IF(COUNTIF(BdD!$A:$A,$A$1)>ROW()-1,INDEX(BdD!H:H,MATCH($A$1&\"_\"&ROW()-2,BdD!$K:$K,0)),\"\")","v":""},{"$f":"IF(COUNTIF(BdD!$A:$A,$A$1)>ROW()-1,INDEX(BdD!I:I,MATCH($A$1&\"_\"&ROW()-2,BdD!$K:$K,0)),\"\")","v":""}]
[{"$f":"IF(COUNTIF(BdD!$A:$A,$A$1)>ROW()-1,INDEX(BdD!B:B,MATCH($A$1&\"_\"&ROW()-2,BdD!$K:$K,0)),\"\")","v":""},{"$f":"IF(COUNTIF(BdD!$A:$A,$A$1)>ROW()-1,INDEX(BdD!C:C,MATCH($A$1&\"_\"&ROW()-2,BdD!$K:$K,0)),\"\")","v":""},{"$f":"IF(COUNTIF(BdD!$A:$A,$A$1)>ROW()-1,INDEX(BdD!D:D,MATCH($A$1&\"_\"&ROW()-2,BdD!$K:$K,0)),\"\")","v":""},{"$f":"IF(COUNTIF(BdD!$A:$A,$A$1)>ROW()-1,INDEX(BdD!E:E,MATCH($A$1&\"_\"&ROW()-2,BdD!$K:$K,0)),\"\")","v":""},{"$f":"IF(COUNTIF(BdD!$A:$A,$A$1)>ROW()-1,INDEX(BdD!F:F,MATCH($A$1&\"_\"&ROW()-2,BdD!$K:$K,0)),\"\")","v":""},{"$f":"IF(COUNTIF(BdD!$A:$A,$A$1)>ROW()-1,INDEX(BdD!G:G,MATCH($A$1&\"_\"&ROW()-2,BdD!$K:$K,0)),\"\")","v":""},{"$f":"IF(COUNTIF(BdD!$A:$A,$A$1)>ROW()-1,INDEX(BdD!H:H,MATCH($A$1&\"_\"&ROW()-2,BdD!$K:$K,0)),\"\")","v":""},{"$f":"IF(COUNTIF(BdD!$A:$A,$A$1)>ROW()-1,INDEX(BdD!I:I,MATCH($A$1&\"_\"&ROW()-2,BdD!$K:$K,0)),\"\")","v":""}]
[{"$f":"IF(COUNTIF(BdD!$A:$A,$A$1)>ROW()-1,INDEX(BdD!B:B,MATCH($A$1&\"_\"&ROW()-2,BdD!$K:$K,0)),\"\")","v":""},{"$f":"IF(COUNTIF(BdD!$A:$A,$A$1)>ROW()-1,INDEX(BdD!C:C,MATCH($A$1&\"_\"&ROW()-2,BdD!$K:$K,0)),\"\")","v":""},{"$f":"IF(COUNTIF(BdD!$A:$A,$A$1)>ROW()-1,INDEX(BdD!D:D,MATCH($A$1&\"_\"&ROW()-2,BdD!$K:$K,0)),\"\")","v":""},{"$f":"IF(COUNTIF(BdD!$A:$A,$A$1)>ROW()-1,INDEX(BdD!E:E,MATCH($A$1&\"_\"&ROW()-2,BdD!$K:$K,0)),\"\")","v":""},{"$f":"IF(COUNTIF(BdD!$A:$A,$A$1)>ROW()-1,INDEX(BdD!F:F,MATCH($A$1&\"_\"&ROW()-2,BdD!$K:$K,0)),\"\")","v":""},{"$f":"IF(COUNTIF(BdD!$A:$A,$A$1)>ROW()-1,INDEX(BdD!G:G,MATCH($A$1&\"_\"&ROW()-2,BdD!$K:$K,0)),\"\")","v":""},{"$f":"IF(COUNTIF(BdD!$A:$A,$A$1)>ROW()-1,INDEX(BdD!H:H,MATCH($A$1&\"_\"&ROW()-2,BdD!$K:$K,0)),\"\")","v":""},{"$f":"IF(COUNTIF(BdD!$A:$A,$A$1)>ROW()-1,INDEX(BdD!I:I,MATCH($A$1&\"_\"&ROW()-2,BdD!$K:$K,0)),\"\")","v":""}]
[{"$f":"IF(COUNTIF(BdD!$A:$A,$A$1)>ROW()-1,INDEX(BdD!B:B,MATCH($A$1&\"_\"&ROW()-2,BdD!$K:$K,0)),\"\")","v":""},{"$f":"IF(COUNTIF(BdD!$A:$A,$A$1)>ROW()-1,INDEX(BdD!C:C,MATCH($A$1&\"_\"&ROW()-2,BdD!$K:$K,0)),\"\")","v":""},{"$f":"IF(COUNTIF(BdD!$A:$A,$A$1)>ROW()-1,INDEX(BdD!D:D,MATCH($A$1&\"_\"&ROW()-2,BdD!$K:$K,0)),\"\")","v":""},{"$f":"IF(COUNTIF(BdD!$A:$A,$A$1)>ROW()-1,INDEX(BdD!E:E,MATCH($A$1&\"_\"&ROW()-2,BdD!$K:$K,0)),\"\")","v":""},{"$f":"IF(COUNTIF(BdD!$A:$A,$A$1)>ROW()-1,INDEX(BdD!F:F,MATCH($A$1&\"_\"&ROW()-2,BdD!$K:$K,0)),\"\")","v":""},{"$f":"IF(COUNTIF(BdD!$A:$A,$A$1)>ROW()-1,INDEX(BdD!G:G,MATCH($A$1&\"_\"&ROW()-2,BdD!$K:$K,0)),\"\")","v":""},{"$f":"IF(COUNTIF(BdD!$A:$A,$A$1)>ROW()-1,INDEX(BdD!H:H,MATCH($A$1&\"_\"&ROW()-2,BdD!$K:$K,0)),\"\")","v":""},{"$f":"IF(COUNTIF(BdD!$A:$A,$A$1)>ROW()-1,INDEX(BdD!I:I,MATCH($A$1&\"_\"&ROW()-2,BdD!$K:$K,0)),\"\")","v":""}]
[{"$f":"IF(COUNTIF(BdD!$A:$A,$A$1)>ROW()-1,INDEX(BdD!B:B,MATCH($A$1&\"_\"&ROW()-2,BdD!$K:$K,0)),\"\")","v":""},{"$f":"IF(COUNTIF(BdD!$A:$A,$A$1)>ROW()-1,INDEX(BdD!C:C,MATCH($A$1&\"_\"&ROW()-2,BdD!$K:$K,0)),\"\")","v":""},{"$f":"IF(COUNTIF(BdD!$A:$A,$A$1)>ROW()-1,INDEX(BdD!D:D,MATCH($A$1&\"_\"&ROW()-2,BdD!$K:$K,0)),\"\")","v":""},{"$f":"IF(COUNTIF(BdD!$A:$A,$A$1)>ROW()-1,INDEX(BdD!E:E,MATCH($A$1&\"_\"&ROW()-2,BdD!$K:$K,0)),\"\")","v":""},{"$f":"IF(COUNTIF(BdD!$A:$A,$A$1)>ROW()-1,INDEX(BdD!F:F,MATCH($A$1&\"_\"&ROW()-2,BdD!$K:$K,0)),\"\")","v":""},{"$f":"IF(COUNTIF(BdD!$A:$A,$A$1)>ROW()-1,INDEX(BdD!G:G,MATCH($A$1&\"_\"&ROW()-2,BdD!$K:$K,0)),\"\")","v":""},{"$f":"IF(COUNTIF(BdD!$A:$A,$A$1)>ROW()-1,INDEX(BdD!H:H,MATCH($A$1&\"_\"&ROW()-2,BdD!$K:$K,0)),\"\")","v":""},{"$f":"IF(COUNTIF(BdD!$A:$A,$A$1)>ROW()-1,INDEX(BdD!I:I,MATCH($A$1&\"_\"&ROW()-2,BdD!$K:$K,0)),\"\")","v":""}]
[{"$f":"IF(COUNTIF(BdD!$A:$A,$A$1)>ROW()-1,INDEX(BdD!B:B,MATCH($A$1&\"_\"&ROW()-2,BdD!$K:$K,0)),\"\")","v":""},{"$f":"IF(COUNTIF(BdD!$A:$A,$A$1)>ROW()-1,INDEX(BdD!C:C,MATCH($A$1&\"_\"&ROW()-2,BdD!$K:$K,0)),\"\")","v":""},{"$f":"IF(COUNTIF(BdD!$A:$A,$A$1)>ROW()-1,INDEX(BdD!D:D,MATCH($A$1&\"_\"&ROW()-2,BdD!$K:$K,0)),\"\")","v":""},{"$f":"IF(COUNTIF(BdD!$A:$A,$A$1)>ROW()-1,INDEX(BdD!E:E,MATCH($A$1&\"_\"&ROW()-2,BdD!$K:$K,0)),\"\")","v":""},{"$f":"IF(COUNTIF(BdD!$A:$A,$A$1)>ROW()-1,INDEX(BdD!F:F,MATCH($A$1&\"_\"&ROW()-2,BdD!$K:$K,0)),\"\")","v":""},{"$f":"IF(COUNTIF(BdD!$A:$A,$A$1)>ROW()-1,INDEX(BdD!G:G,MATCH($A$1&\"_\"&ROW()-2,BdD!$K:$K,0)),\"\")","v":""},{"$f":"IF(COUNTIF(BdD!$A:$A,$A$1)>ROW()-1,INDEX(BdD!H:H,MATCH($A$1&\"_\"&ROW()-2,BdD!$K:$K,0)),\"\")","v":""},{"$f":"IF(COUNTIF(BdD!$A:$A,$A$1)>ROW()-1,INDEX(BdD!I:I,MATCH($A$1&\"_\"&ROW()-2,BdD!$K:$K,0)),\"\")","v":""}]
[{"$f":"IF(COUNTIF(BdD!$A:$A,$A$1)>ROW()-1,INDEX(BdD!B:B,MATCH($A$1&\"_\"&ROW()-2,BdD!$K:$K,0)),\"\")","v":""},{"$f":"IF(COUNTIF(BdD!$A:$A,$A$1)>ROW()-1,INDEX(BdD!C:C,MATCH($A$1&\"_\"&ROW()-2,BdD!$K:$K,0)),\"\")","v":""},{"$f":"IF(COUNTIF(BdD!$A:$A,$A$1)>ROW()-1,INDEX(BdD!D:D,MATCH($A$1&\"_\"&ROW()-2,BdD!$K:$K,0)),\"\")","v":""},{"$f":"IF(COUNTIF(BdD!$A:$A,$A$1)>ROW()-1,INDEX(BdD!E:E,MATCH($A$1&\"_\"&ROW()-2,BdD!$K:$K,0)),\"\")","v":""},{"$f":"IF(COUNTIF(BdD!$A:$A,$A$1)>ROW()-1,INDEX(BdD!F:F,MATCH($A$1&\"_\"&ROW()-2,BdD!$K:$K,0)),\"\")","v":""},{"$f":"IF(COUNTIF(BdD!$A:$A,$A$1)>ROW()-1,INDEX(BdD!G:G,MATCH($A$1&\"_\"&ROW()-2,BdD!$K:$K,0)),\"\")","v":""},{"$f":"IF(COUNTIF(BdD!$A:$A,$A$1)>ROW()-1,INDEX(BdD!H:H,MATCH($A$1&\"_\"&ROW()-2,BdD!$K:$K,0)),\"\")","v":""},{"$f":"IF(COUNTIF(BdD!$A:$A,$A$1)>ROW()-1,INDEX(BdD!I:I,MATCH($A$1&\"_\"&ROW()-2,BdD!$K:$K,0)),\"\")","v":""}]
[{"$f":"IF(COUNTIF(BdD!$A:$A,$A$1)>ROW()-1,INDEX(BdD!B:B,MATCH($A$1&\"_\"&ROW()-2,BdD!$K:$K,0)),\"\")","v":""},{"$f":"IF(COUNTIF(BdD!$A:$A,$A$1)>ROW()-1,INDEX(BdD!C:C,MATCH($A$1&\"_\"&ROW()-2,BdD!$K:$K,0)),\"\")","v":""},{"$f":"IF(COUNTIF(BdD!$A:$A,$A$1)>ROW()-1,INDEX(BdD!D:D,MATCH($A$1&\"_\"&ROW()-2,BdD!$K:$K,0)),\"\")","v":""},{"$f":"IF(COUNTIF(BdD!$A:$A,$A$1)>ROW()-1,INDEX(BdD!E:E,MATCH($A$1&\"_\"&ROW()-2,BdD!$K:$K,0)),\"\")","v":""},{"$f":"IF(COUNTIF(BdD!$A:$A,$A$1)>ROW()-1,INDEX(BdD!F:F,MATCH($A$1&\"_\"&ROW()-2,BdD!$K:$K,0)),\"\")","v":""},{"$f":"IF(COUNTIF(BdD!$A:$A,$A$1)>ROW()-1,INDEX(BdD!G:G,MATCH($A$1&\"_\"&ROW()-2,BdD!$K:$K,0)),\"\")","v":""},{"$f":"IF(COUNTIF(BdD!$A:$A,$A$1)>ROW()-1,INDEX(BdD!H:H,MATCH($A$1&\"_\"&ROW()-2,BdD!$K:$K,0)),\"\")","v":""},{"$f":"IF(COUNTIF(BdD!$A:$A,$A$1)>ROW()-1,INDEX(BdD!I:I,MATCH($A$1&\"_\"&ROW()-2,BdD!$K:$K,0)),\"\")","v":""}]
[{"$f":"IF(COUNTIF(BdD!$A:$A,$A$1)>ROW()-1,INDEX(BdD!B:B,MATCH($A$1&\"_\"&ROW()-2,BdD!$K:$K,0)),\"\")","v":""},{"$f":"IF(COUNTIF(BdD!$A:$A,$A$1)>ROW()-1,INDEX(BdD!C:C,MATCH($A$1&\"_\"&ROW()-2,BdD!$K:$K,0)),\"\")","v":""},{"$f":"IF(COUNTIF(BdD!$A:$A,$A$1)>ROW()-1,INDEX(BdD!D:D,MATCH($A$1&\"_\"&ROW()-2,BdD!$K:$K,0)),\"\")","v":""},{"$f":"IF(COUNTIF(BdD!$A:$A,$A$1)>ROW()-1,INDEX(BdD!E:E,MATCH($A$1&\"_\"&ROW()-2,BdD!$K:$K,0)),\"\")","v":""},{"$f":"IF(COUNTIF(BdD!$A:$A,$A$1)>ROW()-1,INDEX(BdD!F:F,MATCH($A$1&\"_\"&ROW()-2,BdD!$K:$K,0)),\"\")","v":""},{"$f":"IF(COUNTIF(BdD!$A:$A,$A$1)>ROW()-1,INDEX(BdD!G:G,MATCH($A$1&\"_\"&ROW()-2,BdD!$K:$K,0)),\"\")","v":""},{"$f":"IF(COUNTIF(BdD!$A:$A,$A$1)>ROW()-1,INDEX(BdD!H:H,MATCH($A$1&\"_\"&ROW()-2,BdD!$K:$K,0)),\"\")","v":""},{"$f":"IF(COUNTIF(BdD!$A:$A,$A$1)>ROW()-1,INDEX(BdD!I:I,MATCH($A$1&\"_\"&ROW()-2,BdD!$K:$K,0)),\"\")","v":""}]
[{"$f":"IF(COUNTIF(BdD!$A:$A,$A$1)>ROW()-1,INDEX(BdD!B:B,MATCH($A$1&\"_\"&ROW()-2,BdD!$K:$K,0)),\"\")","v":""},{"$f":"IF(COUNTIF(BdD!$A:$A,$A$1)>ROW()-1,INDEX(BdD!C:C,MATCH($A$1&\"_\"&ROW()-2,BdD!$K:$K,0)),\"\")","v":""},{"$f":"IF(COUNTIF(BdD!$A:$A,$A$1)>ROW()-1,INDEX(BdD!D:D,MATCH($A$1&\"_\"&ROW()-2,BdD!$K:$K,0)),\"\")","v":""},{"$f":"IF(COUNTIF(BdD!$A:$A,$A$1)>ROW()-1,INDEX(BdD!E:E,MATCH($A$1&\"_\"&ROW()-2,BdD!$K:$K,0)),\"\")","v":""},{"$f":"IF(COUNTIF(BdD!$A:$A,$A$1)>ROW()-1,INDEX(BdD!F:F,MATCH($A$1&\"_\"&ROW()-2,BdD!$K:$K,0)),\"\")","v":""},{"$f":"IF(COUNTIF(BdD!$A:$A,$A$1)>ROW()-1,INDEX(BdD!G:G,MATCH($A$1&\"_\"&ROW()-2,BdD!$K:$K,0)),\"\")","v":""},{"$f":"IF(COUNTIF(BdD!$A:$A,$A$1)>ROW()-1,INDEX(BdD!H:H,MATCH($A$1&\"_\"&ROW()-2,BdD!$K:$K,0)),\"\")","v":""},{"$f":"IF(COUNTIF(BdD!$A:$A,$A$1)>ROW()-1,INDEX(BdD!I:I,MATCH($A$1&\"_\"&ROW()-2,BdD!$K:$K,0)),\"\")","v":""}]
[{"$f":"IF(COUNTIF(BdD!$A:$A,$A$1)>ROW()-1,INDEX(BdD!B:B,MATCH($A$1&\"_\"&ROW()-2,BdD!$K:$K,0)),\"\")","v":""},{"$f":"IF(COUNTIF(BdD!$A:$A,$A$1)>ROW()-1,INDEX(BdD!C:C,MATCH($A$1&\"_\"&ROW()-2,BdD!$K:$K,0)),\"\")","v":""},{"$f":"IF(COUNTIF(BdD!$A:$A,$A$1)>ROW()-1,INDEX(BdD!D:D,MATCH($A$1&\"_\"&ROW()-2,BdD!$K:$K,0)),\"\")","v":""},{"$f":"IF(COUNTIF(BdD!$A:$A,$A$1)>ROW()-1,INDEX(BdD!E:E,MATCH($A$1&\"_\"&ROW()-2,BdD!$K:$K,0)),\"\")","v":""},{"$f":"IF(COUNTIF(BdD!$A:$A,$A$1)>ROW()-1,INDEX(BdD!F:F,MATCH($A$1&\"_\"&ROW()-2,BdD!$K:$K,0)),\"\")","v":""},{"$f":"IF(COUNTIF(BdD!$A:$A,$A$1)>ROW()-1,INDEX(BdD!G:G,MATCH($A$1&\"_\"&ROW()-2,BdD!$K:$K,0)),\"\")","v":""},{"$f":"IF(COUNTIF(BdD!$A:$A,$A$1)>ROW()-1,INDEX(BdD!H:H,MATCH($A$1&\"_\"&ROW()-2,BdD!$K:$K,0)),\"\")","v":""},{"$f":"IF(COUNTIF(BdD!$A:$A,$A$1)>ROW()-1,INDEX(BdD!I:I,MATCH($A$1&\"_\"&ROW()-2,BdD!$K:$K,0)),\"\")","v":""}]
[{"$f":"IF(COUNTIF(BdD!$A:$A,$A$1)>ROW()-1,INDEX(BdD!B:B,MATCH($A$1&\"_\"&ROW()-2,BdD!$K:$K,0)),\"\")","v":""},{"$f":"IF(COUNTIF(BdD!$A:$A,$A$1)>ROW()-1,INDEX(BdD!C:C,MATCH($A$1&\"_\"&ROW()-2,BdD!$K:$K,0)),\"\")","v":""},{"$f":"IF(COUNTIF(BdD!$A:$A,$A$1)>ROW()-1,INDEX(BdD!D:D,MATCH($A$1&\"_\"&ROW()-2,BdD!$K:$K,0)),\"\")","v":""},{"$f":"IF(COUNTIF(BdD!$A:$A,$A$1)>ROW()-1,INDEX(BdD!E:E,MATCH($A$1&\"_\"&ROW()-2,BdD!$K:$K,0)),\"\")","v":""},{"$f":"IF(COUNTIF(BdD!$A:$A,$A$1)>ROW()-1,INDEX(BdD!F:F,MATCH($A$1&\"_\"&ROW()-2,BdD!$K:$K,0)),\"\")","v":""},{"$f":"IF(COUNTIF(BdD!$A:$A,$A$1)>ROW()-1,INDEX(BdD!G:G,MATCH($A$1&\"_\"&ROW()-2,BdD!$K:$K,0)),\"\")","v":""},{"$f":"IF(COUNTIF(BdD!$A:$A,$A$1)>ROW()-1,INDEX(BdD!H:H,MATCH($A$1&\"_\"&ROW()-2,BdD!$K:$K,0)),\"\")","v":""},{"$f":"IF(COUNTIF(BdD!$A:$A,$A$1)>ROW()-1,INDEX(BdD!I:I,MATCH($A$1&\"_\"&ROW()-2,BdD!$K:$K,0)),\"\")","v":""}]
[{"$f":"IF(COUNTIF(BdD!$A:$A,$A$1)>ROW()-1,INDEX(BdD!B:B,MATCH($A$1&\"_\"&ROW()-2,BdD!$K:$K,0)),\"\")","v":""},{"$f":"IF(COUNTIF(BdD!$A:$A,$A$1)>ROW()-1,INDEX(BdD!C:C,MATCH($A$1&\"_\"&ROW()-2,BdD!$K:$K,0)),\"\")","v":""},{"$f":"IF(COUNTIF(BdD!$A:$A,$A$1)>ROW()-1,INDEX(BdD!D:D,MATCH($A$1&\"_\"&ROW()-2,BdD!$K:$K,0)),\"\")","v":""},{"$f":"IF(COUNTIF(BdD!$A:$A,$A$1)>ROW()-1,INDEX(BdD!E:E,MATCH($A$1&\"_\"&ROW()-2,BdD!$K:$K,0)),\"\")","v":""},{"$f":"IF(COUNTIF(BdD!$A:$A,$A$1)>ROW()-1,INDEX(BdD!F:F,MATCH($A$1&\"_\"&ROW()-2,BdD!$K:$K,0)),\"\")","v":""},{"$f":"IF(COUNTIF(BdD!$A:$A,$A$1)>ROW()-1,INDEX(BdD!G:G,MATCH($A$1&\"_\"&ROW()-2,BdD!$K:$K,0)),\"\")","v":""},{"$f":"IF(COUNTIF(BdD!$A:$A,$A$1)>ROW()-1,INDEX(BdD!H:H,MATCH($A$1&\"_\"&ROW()-2,BdD!$K:$K,0)),\"\")","v":""},{"$f":"IF(COUNTIF(BdD!$A:$A,$A$1)>ROW()-1,INDEX(BdD!I:I,MATCH($A$1&\"_\"&ROW()-2,BdD!$K:$K,0)),\"\")","v":""}]
[{"$f":"IF(COUNTIF(BdD!$A:$A,$A$1)>ROW()-1,INDEX(BdD!B:B,MATCH($A$1&\"_\"&ROW()-2,BdD!$K:$K,0)),\"\")","v":""},{"$f":"IF(COUNTIF(BdD!$A:$A,$A$1)>ROW()-1,INDEX(BdD!C:C,MATCH($A$1&\"_\"&ROW()-2,BdD!$K:$K,0)),\"\")","v":""},{"$f":"IF(COUNTIF(BdD!$A:$A,$A$1)>ROW()-1,INDEX(BdD!D:D,MATCH($A$1&\"_\"&ROW()-2,BdD!$K:$K,0)),\"\")","v":""},{"$f":"IF(COUNTIF(BdD!$A:$A,$A$1)>ROW()-1,INDEX(BdD!E:E,MATCH($A$1&\"_\"&ROW()-2,BdD!$K:$K,0)),\"\")","v":""},{"$f":"IF(COUNTIF(BdD!$A:$A,$A$1)>ROW()-1,INDEX(BdD!F:F,MATCH($A$1&\"_\"&ROW()-2,BdD!$K:$K,0)),\"\")","v":""},{"$f":"IF(COUNTIF(BdD!$A:$A,$A$1)>ROW()-1,INDEX(BdD!G:G,MATCH($A$1&\"_\"&ROW()-2,BdD!$K:$K,0)),\"\")","v":""},{"$f":"IF(COUNTIF(BdD!$A:$A,$A$1)>ROW()-1,INDEX(BdD!H:H,MATCH($A$1&\"_\"&ROW()-2,BdD!$K:$K,0)),\"\")","v":""},{"$f":"IF(COUNTIF(BdD!$A:$A,$A$1)>ROW()-1,INDEX(BdD!I:I,MATCH($A$1&\"_\"&ROW()-2,BdD!$K:$K,0)),\"\")","v":""}]
[{"$f":"IF(COUNTIF(BdD!$A:$A,$A$1)>ROW()-1,INDEX(BdD!B:B,MATCH($A$1&\"_\"&ROW()-2,BdD!$K:$K,0)),\"\")","v":""},{"$f":"IF(COUNTIF(BdD!$A:$A,$A$1)>ROW()-1,INDEX(BdD!C:C,MATCH($A$1&\"_\"&ROW()-2,BdD!$K:$K,0)),\"\")","v":""},{"$f":"IF(COUNTIF(BdD!$A:$A,$A$1)>ROW()-1,INDEX(BdD!D:D,MATCH($A$1&\"_\"&ROW()-2,BdD!$K:$K,0)),\"\")","v":""},{"$f":"IF(COUNTIF(BdD!$A:$A,$A$1)>ROW()-1,INDEX(BdD!E:E,MATCH($A$1&\"_\"&ROW()-2,BdD!$K:$K,0)),\"\")","v":""},{"$f":"IF(COUNTIF(BdD!$A:$A,$A$1)>ROW()-1,INDEX(BdD!F:F,MATCH($A$1&\"_\"&ROW()-2,BdD!$K:$K,0)),\"\")","v":""},{"$f":"IF(COUNTIF(BdD!$A:$A,$A$1)>ROW()-1,INDEX(BdD!G:G,MATCH($A$1&\"_\"&ROW()-2,BdD!$K:$K,0)),\"\")","v":""},{"$f":"IF(COUNTIF(BdD!$A:$A,$A$1)>ROW()-1,INDEX(BdD!H:H,MATCH($A$1&\"_\"&ROW()-2,BdD!$K:$K,0)),\"\")","v":""},{"$f":"IF(COUNTIF(BdD!$A:$A,$A$1)>ROW()-1,INDEX(BdD!I:I,MATCH($A$1&\"_\"&ROW()-2,BdD!$K:$K,0)),\"\")","v":""}]
[{"$f":"IF(COUNTIF(BdD!$A:$A,$A$1)>ROW()-1,INDEX(BdD!B:B,MATCH($A$1&\"_\"&ROW()-2,BdD!$K:$K,0)),\"\")","v":""},{"$f":"IF(COUNTIF(BdD!$A:$A,$A$1)>ROW()-1,INDEX(BdD!C:C,MATCH($A$1&\"_\"&ROW()-2,BdD!$K:$K,0)),\"\")","v":""},{"$f":"IF(COUNTIF(BdD!$A:$A,$A$1)>ROW()-1,INDEX(BdD!D:D,MATCH($A$1&\"_\"&ROW()-2,BdD!$K:$K,0)),\"\")","v":""},{"$f":"IF(COUNTIF(BdD!$A:$A,$A$1)>ROW()-1,INDEX(BdD!E:E,MATCH($A$1&\"_\"&ROW()-2,BdD!$K:$K,0)),\"\")","v":""},{"$f":"IF(COUNTIF(BdD!$A:$A,$A$1)>ROW()-1,INDEX(BdD!F:F,MATCH($A$1&\"_\"&ROW()-2,BdD!$K:$K,0)),\"\")","v":""},{"$f":"IF(COUNTIF(BdD!$A:$A,$A$1)>ROW()-1,INDEX(BdD!G:G,MATCH($A$1&\"_\"&ROW()-2,BdD!$K:$K,0)),\"\")","v":""},{"$f":"IF(COUNTIF(BdD!$A:$A,$A$1)>ROW()-1,INDEX(BdD!H:H,MATCH($A$1&\"_\"&ROW()-2,BdD!$K:$K,0)),\"\")","v":""},{"$f":"IF(COUNTIF(BdD!$A:$A,$A$1)>ROW()-1,INDEX(BdD!I:I,MATCH($A$1&\"_\"&ROW()-2,BdD!$K:$K,0)),\"\")","v":""}]
[{"$f":"IF(COUNTIF(BdD!$A:$A,$A$1)>ROW()-1,INDEX(BdD!B:B,MATCH($A$1&\"_\"&ROW()-2,BdD!$K:$K,0)),\"\")","v":""},{"$f":"IF(COUNTIF(BdD!$A:$A,$A$1)>ROW()-1,INDEX(BdD!C:C,MATCH($A$1&\"_\"&ROW()-2,BdD!$K:$K,0)),\"\")","v":""},{"$f":"IF(COUNTIF(BdD!$A:$A,$A$1)>ROW()-1,INDEX(BdD!D:D,MATCH($A$1&\"_\"&ROW()-2,BdD!$K:$K,0)),\"\")","v":""},{"$f":"IF(COUNTIF(BdD!$A:$A,$A$1)>ROW()-1,INDEX(BdD!E:E,MATCH($A$1&\"_\"&ROW()-2,BdD!$K:$K,0)),\"\")","v":""},{"$f":"IF(COUNTIF(BdD!$A:$A,$A$1)>ROW()-1,INDEX(BdD!F:F,MATCH($A$1&\"_\"&ROW()-2,BdD!$K:$K,0)),\"\")","v":""},{"$f":"IF(COUNTIF(BdD!$A:$A,$A$1)>ROW()-1,INDEX(BdD!G:G,MATCH($A$1&\"_\"&ROW()-2,BdD!$K:$K,0)),\"\")","v":""},{"$f":"IF(COUNTIF(BdD!$A:$A,$A$1)>ROW()-1,INDEX(BdD!H:H,MATCH($A$1&\"_\"&ROW()-2,BdD!$K:$K,0)),\"\")","v":""},{"$f":"IF(COUNTIF(BdD!$A:$A,$A$1)>ROW()-1,INDEX(BdD!I:I,MATCH($A$1&\"_\"&ROW()-2,BdD!$K:$K,0)),\"\")","v":""}]
[{"$f":"IF(COUNTIF(BdD!$A:$A,$A$1)>ROW()-1,INDEX(BdD!B:B,MATCH($A$1&\"_\"&ROW()-2,BdD!$K:$K,0)),\"\")","v":""},{"$f":"IF(COUNTIF(BdD!$A:$A,$A$1)>ROW()-1,INDEX(BdD!C:C,MATCH($A$1&\"_\"&ROW()-2,BdD!$K:$K,0)),\"\")","v":""},{"$f":"IF(COUNTIF(BdD!$A:$A,$A$1)>ROW()-1,INDEX(BdD!D:D,MATCH($A$1&\"_\"&ROW()-2,BdD!$K:$K,0)),\"\")","v":""},{"$f":"IF(COUNTIF(BdD!$A:$A,$A$1)>ROW()-1,INDEX(BdD!E:E,MATCH($A$1&\"_\"&ROW()-2,BdD!$K:$K,0)),\"\")","v":""},{"$f":"IF(COUNTIF(BdD!$A:$A,$A$1)>ROW()-1,INDEX(BdD!F:F,MATCH($A$1&\"_\"&ROW()-2,BdD!$K:$K,0)),\"\")","v":""},{"$f":"IF(COUNTIF(BdD!$A:$A,$A$1)>ROW()-1,INDEX(BdD!G:G,MATCH($A$1&\"_\"&ROW()-2,BdD!$K:$K,0)),\"\")","v":""},{"$f":"IF(COUNTIF(BdD!$A:$A,$A$1)>ROW()-1,INDEX(BdD!H:H,MATCH($A$1&\"_\"&ROW()-2,BdD!$K:$K,0)),\"\")","v":""},{"$f":"IF(COUNTIF(BdD!$A:$A,$A$1)>ROW()-1,INDEX(BdD!I:I,MATCH($A$1&\"_\"&ROW()-2,BdD!$K:$K,0)),\"\")","v":""}]
[{"$f":"IF(COUNTIF(BdD!$A:$A,$A$1)>ROW()-1,INDEX(BdD!B:B,MATCH($A$1&\"_\"&ROW()-2,BdD!$K:$K,0)),\"\")","v":""},{"$f":"IF(COUNTIF(BdD!$A:$A,$A$1)>ROW()-1,INDEX(BdD!C:C,MATCH($A$1&\"_\"&ROW()-2,BdD!$K:$K,0)),\"\")","v":""},{"$f":"IF(COUNTIF(BdD!$A:$A,$A$1)>ROW()-1,INDEX(BdD!D:D,MATCH($A$1&\"_\"&ROW()-2,BdD!$K:$K,0)),\"\")","v":""},{"$f":"IF(COUNTIF(BdD!$A:$A,$A$1)>ROW()-1,INDEX(BdD!E:E,MATCH($A$1&\"_\"&ROW()-2,BdD!$K:$K,0)),\"\")","v":""},{"$f":"IF(COUNTIF(BdD!$A:$A,$A$1)>ROW()-1,INDEX(BdD!F:F,MATCH($A$1&\"_\"&ROW()-2,BdD!$K:$K,0)),\"\")","v":""},{"$f":"IF(COUNTIF(BdD!$A:$A,$A$1)>ROW()-1,INDEX(BdD!G:G,MATCH($A$1&\"_\"&ROW()-2,BdD!$K:$K,0)),\"\")","v":""},{"$f":"IF(COUNTIF(BdD!$A:$A,$A$1)>ROW()-1,INDEX(BdD!H:H,MATCH($A$1&\"_\"&ROW()-2,BdD!$K:$K,0)),\"\")","v":""},{"$f":"IF(COUNTIF(BdD!$A:$A,$A$1)>ROW()-1,INDEX(BdD!I:I,MATCH($A$1&\"_\"&ROW()-2,BdD!$K:$K,0)),\"\")","v":""}]
[{"$f":"IF(COUNTIF(BdD!$A:$A,$A$1)>ROW()-1,INDEX(BdD!B:B,MATCH($A$1&\"_\"&ROW()-2,BdD!$K:$K,0)),\"\")","v":""},{"$f":"IF(COUNTIF(BdD!$A:$A,$A$1)>ROW()-1,INDEX(BdD!C:C,MATCH($A$1&\"_\"&ROW()-2,BdD!$K:$K,0)),\"\")","v":""},{"$f":"IF(COUNTIF(BdD!$A:$A,$A$1)>ROW()-1,INDEX(BdD!D:D,MATCH($A$1&\"_\"&ROW()-2,BdD!$K:$K,0)),\"\")","v":""},{"$f":"IF(COUNTIF(BdD!$A:$A,$A$1)>ROW()-1,INDEX(BdD!E:E,MATCH($A$1&\"_\"&ROW()-2,BdD!$K:$K,0)),\"\")","v":""},{"$f":"IF(COUNTIF(BdD!$A:$A,$A$1)>ROW()-1,INDEX(BdD!F:F,MATCH($A$1&\"_\"&ROW()-2,BdD!$K:$K,0)),\"\")","v":""},{"$f":"IF(COUNTIF(BdD!$A:$A,$A$1)>ROW()-1,INDEX(BdD!G:G,MATCH($A$1&\"_\"&ROW()-2,BdD!$K:$K,0)),\"\")","v":""},{"$f":"IF(COUNTIF(BdD!$A:$A,$A$1)>ROW()-1,INDEX(BdD!H:H,MATCH($A$1&\"_\"&ROW()-2,BdD!$K:$K,0)),\"\")","v":""},{"$f":"IF(COUNTIF(BdD!$A:$A,$A$1)>ROW()-1,INDEX(BdD!I:I,MATCH($A$1&\"_\"&ROW()-2,BdD!$K:$K,0)),\"\")","v":""}]
[{"$f":"IF(COUNTIF(BdD!$A:$A,$A$1)>ROW()-1,INDEX(BdD!B:B,MATCH($A$1&\"_\"&ROW()-2,BdD!$K:$K,0)),\"\")","v":""},{"$f":"IF(COUNTIF(BdD!$A:$A,$A$1)>ROW()-1,INDEX(BdD!C:C,MATCH($A$1&\"_\"&ROW()-2,BdD!$K:$K,0)),\"\")","v":""},{"$f":"IF(COUNTIF(BdD!$A:$A,$A$1)>ROW()-1,INDEX(BdD!D:D,MATCH($A$1&\"_\"&ROW()-2,BdD!$K:$K,0)),\"\")","v":""},{"$f":"IF(COUNTIF(BdD!$A:$A,$A$1)>ROW()-1,INDEX(BdD!E:E,MATCH($A$1&\"_\"&ROW()-2,BdD!$K:$K,0)),\"\")","v":""},{"$f":"IF(COUNTIF(BdD!$A:$A,$A$1)>ROW()-1,INDEX(BdD!F:F,MATCH($A$1&\"_\"&ROW()-2,BdD!$K:$K,0)),\"\")","v":""},{"$f":"IF(COUNTIF(BdD!$A:$A,$A$1)>ROW()-1,INDEX(BdD!G:G,MATCH($A$1&\"_\"&ROW()-2,BdD!$K:$K,0)),\"\")","v":""},{"$f":"IF(COUNTIF(BdD!$A:$A,$A$1)>ROW()-1,INDEX(BdD!H:H,MATCH($A$1&\"_\"&ROW()-2,BdD!$K:$K,0)),\"\")","v":""},{"$f":"IF(COUNTIF(BdD!$A:$A,$A$1)>ROW()-1,INDEX(BdD!I:I,MATCH($A$1&\"_\"&ROW()-2,BdD!$K:$K,0)),\"\")","v":""}]
[{"$f":"IF(COUNTIF(BdD!$A:$A,$A$1)>ROW()-1,INDEX(BdD!B:B,MATCH($A$1&\"_\"&ROW()-2,BdD!$K:$K,0)),\"\")","v":""},{"$f":"IF(COUNTIF(BdD!$A:$A,$A$1)>ROW()-1,INDEX(BdD!C:C,MATCH($A$1&\"_\"&ROW()-2,BdD!$K:$K,0)),\"\")","v":""},{"$f":"IF(COUNTIF(BdD!$A:$A,$A$1)>ROW()-1,INDEX(BdD!D:D,MATCH($A$1&\"_\"&ROW()-2,BdD!$K:$K,0)),\"\")","v":""},{"$f":"IF(COUNTIF(BdD!$A:$A,$A$1)>ROW()-1,INDEX(BdD!E:E,MATCH($A$1&\"_\"&ROW()-2,BdD!$K:$K,0)),\"\")","v":""},{"$f":"IF(COUNTIF(BdD!$A:$A,$A$1)>ROW()-1,INDEX(BdD!F:F,MATCH($A$1&\"_\"&ROW()-2,BdD!$K:$K,0)),\"\")","v":""},{"$f":"IF(COUNTIF(BdD!$A:$A,$A$1)>ROW()-1,INDEX(BdD!G:G,MATCH($A$1&\"_\"&ROW()-2,BdD!$K:$K,0)),\"\")","v":""},{"$f":"IF(COUNTIF(BdD!$A:$A,$A$1)>ROW()-1,INDEX(BdD!H:H,MATCH($A$1&\"_\"&ROW()-2,BdD!$K:$K,0)),\"\")","v":""},{"$f":"IF(COUNTIF(BdD!$A:$A,$A$1)>ROW()-1,INDEX(BdD!I:I,MATCH($A$1&\"_\"&ROW()-2,BdD!$K:$K,0)),\"\")","v":""}]
[{"$f":"IF(COUNTIF(BdD!$A:$A,$A$1)>ROW()-1,INDEX(BdD!B:B,MATCH($A$1&\"_\"&ROW()-2,BdD!$K:$K,0)),\"\")","v":""},{"$f":"IF(COUNTIF(BdD!$A:$A,$A$1)>ROW()-1,INDEX(BdD!C:C,MATCH($A$1&\"_\"&ROW()-2,BdD!$K:$K,0)),\"\")","v":""},{"$f":"IF(COUNTIF(BdD!$A:$A,$A$1)>ROW()-1,INDEX(BdD!D:D,MATCH($A$1&\"_\"&ROW()-2,BdD!$K:$K,0)),\"\")","v":""},{"$f":"IF(COUNTIF(BdD!$A:$A,$A$1)>ROW()-1,INDEX(BdD!E:E,MATCH($A$1&\"_\"&ROW()-2,BdD!$K:$K,0)),\"\")","v":""},{"$f":"IF(COUNTIF(BdD!$A:$A,$A$1)>ROW()-1,INDEX(BdD!F:F,MATCH($A$1&\"_\"&ROW()-2,BdD!$K:$K,0)),\"\")","v":""},{"$f":"IF(COUNTIF(BdD!$A:$A,$A$1)>ROW()-1,INDEX(BdD!G:G,MATCH($A$1&\"_\"&ROW()-2,BdD!$K:$K,0)),\"\")","v":""},{"$f":"IF(COUNTIF(BdD!$A:$A,$A$1)>ROW()-1,INDEX(BdD!H:H,MATCH($A$1&\"_\"&ROW()-2,BdD!$K:$K,0)),\"\")","v":""},{"$f":"IF(COUNTIF(BdD!$A:$A,$A$1)>ROW()-1,INDEX(BdD!I:I,MATCH($A$1&\"_\"&ROW()-2,BdD!$K:$K,0)),\"\")","v":""}]
[{"$f":"IF(COUNTIF(BdD!$A:$A,$A$1)>ROW()-1,INDEX(BdD!B:B,MATCH($A$1&\"_\"&ROW()-2,BdD!$K:$K,0)),\"\")","v":""},{"$f":"IF(COUNTIF(BdD!$A:$A,$A$1)>ROW()-1,INDEX(BdD!C:C,MATCH($A$1&\"_\"&ROW()-2,BdD!$K:$K,0)),\"\")","v":""},{"$f":"IF(COUNTIF(BdD!$A:$A,$A$1)>ROW()-1,INDEX(BdD!D:D,MATCH($A$1&\"_\"&ROW()-2,BdD!$K:$K,0)),\"\")","v":""},{"$f":"IF(COUNTIF(BdD!$A:$A,$A$1)>ROW()-1,INDEX(BdD!E:E,MATCH($A$1&\"_\"&ROW()-2,BdD!$K:$K,0)),\"\")","v":""},{"$f":"IF(COUNTIF(BdD!$A:$A,$A$1)>ROW()-1,INDEX(BdD!F:F,MATCH($A$1&\"_\"&ROW()-2,BdD!$K:$K,0)),\"\")","v":""},{"$f":"IF(COUNTIF(BdD!$A:$A,$A$1)>ROW()-1,INDEX(BdD!G:G,MATCH($A$1&\"_\"&ROW()-2,BdD!$K:$K,0)),\"\")","v":""},{"$f":"IF(COUNTIF(BdD!$A:$A,$A$1)>ROW()-1,INDEX(BdD!H:H,MATCH($A$1&\"_\"&ROW()-2,BdD!$K:$K,0)),\"\")","v":""},{"$f":"IF(COUNTIF(BdD!$A:$A,$A$1)>ROW()-1,INDEX(BdD!I:I,MATCH($A$1&\"_\"&ROW()-2,BdD!$K:$K,0)),\"\")","v":""}]
[{"$f":"IF(COUNTIF(BdD!$A:$A,$A$1)>ROW()-1,INDEX(BdD!B:B,MATCH($A$1&\"_\"&ROW()-2,BdD!$K:$K,0)),\"\")","v":""},{"$f":"IF(COUNTIF(BdD!$A:$A,$A$1)>ROW()-1,INDEX(BdD!C:C,MATCH($A$1&\"_\"&ROW()-2,BdD!$K:$K,0)),\"\")","v":""},{"$f":"IF(COUNTIF(BdD!$A:$A,$A$1)>ROW()-1,INDEX(BdD!D:D,MATCH($A$1&\"_\"&ROW()-2,BdD!$K:$K,0)),\"\")","v":""},{"$f":"IF(COUNTIF(BdD!$A:$A,$A$1)>ROW()-1,INDEX(BdD!E:E,MATCH($A$1&\"_\"&ROW()-2,BdD!$K:$K,0)),\"\")","v":""},{"$f":"IF(COUNTIF(BdD!$A:$A,$A$1)>ROW()-1,INDEX(BdD!F:F,MATCH($A$1&\"_\"&ROW()-2,BdD!$K:$K,0)),\"\")","v":""},{"$f":"IF(COUNTIF(BdD!$A:$A,$A$1)>ROW()-1,INDEX(BdD!G:G,MATCH($A$1&\"_\"&ROW()-2,BdD!$K:$K,0)),\"\")","v":""},{"$f":"IF(COUNTIF(BdD!$A:$A,$A$1)>ROW()-1,INDEX(BdD!H:H,MATCH($A$1&\"_\"&ROW()-2,BdD!$K:$K,0)),\"\")","v":""},{"$f":"IF(COUNTIF(BdD!$A:$A,$A$1)>ROW()-1,INDEX(BdD!I:I,MATCH($A$1&\"_\"&ROW()-2,BdD!$K:$K,0)),\"\")","v":""}]
[{"$f":"IF(COUNTIF(BdD!$A:$A,$A$1)>ROW()-1,INDEX(BdD!B:B,MATCH($A$1&\"_\"&ROW()-2,BdD!$K:$K,0)),\"\")","v":""},{"$f":"IF(COUNTIF(BdD!$A:$A,$A$1)>ROW()-1,INDEX(BdD!C:C,MATCH($A$1&\"_\"&ROW()-2,BdD!$K:$K,0)),\"\")","v":""},{"$f":"IF(COUNTIF(BdD!$A:$A,$A$1)>ROW()-1,INDEX(BdD!D:D,MATCH($A$1&\"_\"&ROW()-2,BdD!$K:$K,0)),\"\")","v":""},{"$f":"IF(COUNTIF(BdD!$A:$A,$A$1)>ROW()-1,INDEX(BdD!E:E,MATCH($A$1&\"_\"&ROW()-2,BdD!$K:$K,0)),\"\")","v":""},{"$f":"IF(COUNTIF(BdD!$A:$A,$A$1)>ROW()-1,INDEX(BdD!F:F,MATCH($A$1&\"_\"&ROW()-2,BdD!$K:$K,0)),\"\")","v":""},{"$f":"IF(COUNTIF(BdD!$A:$A,$A$1)>ROW()-1,INDEX(BdD!G:G,MATCH($A$1&\"_\"&ROW()-2,BdD!$K:$K,0)),\"\")","v":""},{"$f":"IF(COUNTIF(BdD!$A:$A,$A$1)>ROW()-1,INDEX(BdD!H:H,MATCH($A$1&\"_\"&ROW()-2,BdD!$K:$K,0)),\"\")","v":""},{"$f":"IF(COUNTIF(BdD!$A:$A,$A$1)>ROW()-1,INDEX(BdD!I:I,MATCH($A$1&\"_\"&ROW()-2,BdD!$K:$K,0)),\"\")","v":""}]
[{"$f":"IF(COUNTIF(BdD!$A:$A,$A$1)>ROW()-1,INDEX(BdD!B:B,MATCH($A$1&\"_\"&ROW()-2,BdD!$K:$K,0)),\"\")","v":""},{"$f":"IF(COUNTIF(BdD!$A:$A,$A$1)>ROW()-1,INDEX(BdD!C:C,MATCH($A$1&\"_\"&ROW()-2,BdD!$K:$K,0)),\"\")","v":""},{"$f":"IF(COUNTIF(BdD!$A:$A,$A$1)>ROW()-1,INDEX(BdD!D:D,MATCH($A$1&\"_\"&ROW()-2,BdD!$K:$K,0)),\"\")","v":""},{"$f":"IF(COUNTIF(BdD!$A:$A,$A$1)>ROW()-1,INDEX(BdD!E:E,MATCH($A$1&\"_\"&ROW()-2,BdD!$K:$K,0)),\"\")","v":""},{"$f":"IF(COUNTIF(BdD!$A:$A,$A$1)>ROW()-1,INDEX(BdD!F:F,MATCH($A$1&\"_\"&ROW()-2,BdD!$K:$K,0)),\"\")","v":""},{"$f":"IF(COUNTIF(BdD!$A:$A,$A$1)>ROW()-1,INDEX(BdD!G:G,MATCH($A$1&\"_\"&ROW()-2,BdD!$K:$K,0)),\"\")","v":""},{"$f":"IF(COUNTIF(BdD!$A:$A,$A$1)>ROW()-1,INDEX(BdD!H:H,MATCH($A$1&\"_\"&ROW()-2,BdD!$K:$K,0)),\"\")","v":""},{"$f":"IF(COUNTIF(BdD!$A:$A,$A$1)>ROW()-1,INDEX(BdD!I:I,MATCH($A$1&\"_\"&ROW()-2,BdD!$K:$K,0)),\"\")","v":""}]
[{"$f":"IF(COUNTIF(BdD!$A:$A,$A$1)>ROW()-1,INDEX(BdD!B:B,MATCH($A$1&\"_\"&ROW()-2,BdD!$K:$K,0)),\"\")","v":""},{"$f":"IF(COUNTIF(BdD!$A:$A,$A$1)>ROW()-1,INDEX(BdD!C:C,MATCH($A$1&\"_\"&ROW()-2,BdD!$K:$K,0)),\"\")","v":""},{"$f":"IF(COUNTIF(BdD!$A:$A,$A$1)>ROW()-1,INDEX(BdD!D:D,MATCH($A$1&\"_\"&ROW()-2,BdD!$K:$K,0)),\"\")","v":""},{"$f":"IF(COUNTIF(BdD!$A:$A,$A$1)>ROW()-1,INDEX(BdD!E:E,MATCH($A$1&\"_\"&ROW()-2,BdD!$K:$K,0)),\"\")","v":""},{"$f":"IF(COUNTIF(BdD!$A:$A,$A$1)>ROW()-1,INDEX(BdD!F:F,MATCH($A$1&\"_\"&ROW()-2,BdD!$K:$K,0)),\"\")","v":""},{"$f":"IF(COUNTIF(BdD!$A:$A,$A$1)>ROW()-1,INDEX(BdD!G:G,MATCH($A$1&\"_\"&ROW()-2,BdD!$K:$K,0)),\"\")","v":""},{"$f":"IF(COUNTIF(BdD!$A:$A,$A$1)>ROW()-1,INDEX(BdD!H:H,MATCH($A$1&\"_\"&ROW()-2,BdD!$K:$K,0)),\"\")","v":""},{"$f":"IF(COUNTIF(BdD!$A:$A,$A$1)>ROW()-1,INDEX(BdD!I:I,MATCH($A$1&\"_\"&ROW()-2,BdD!$K:$K,0)),\"\")","v":""}]
[{"$f":"IF(COUNTIF(BdD!$A:$A,$A$1)>ROW()-1,INDEX(BdD!B:B,MATCH($A$1&\"_\"&ROW()-2,BdD!$K:$K,0)),\"\")","v":""},{"$f":"IF(COUNTIF(BdD!$A:$A,$A$1)>ROW()-1,INDEX(BdD!C:C,MATCH($A$1&\"_\"&ROW()-2,BdD!$K:$K,0)),\"\")","v":""},{"$f":"IF(COUNTIF(BdD!$A:$A,$A$1)>ROW()-1,INDEX(BdD!D:D,MATCH($A$1&\"_\"&ROW()-2,BdD!$K:$K,0)),\"\")","v":""},{"$f":"IF(COUNTIF(BdD!$A:$A,$A$1)>ROW()-1,INDEX(BdD!E:E,MATCH($A$1&\"_\"&ROW()-2,BdD!$K:$K,0)),\"\")","v":""},{"$f":"IF(COUNTIF(BdD!$A:$A,$A$1)>ROW()-1,INDEX(BdD!F:F,MATCH($A$1&\"_\"&ROW()-2,BdD!$K:$K,0)),\"\")","v":""},{"$f":"IF(COUNTIF(BdD!$A:$A,$A$1)>ROW()-1,INDEX(BdD!G:G,MATCH($A$1&\"_\"&ROW()-2,BdD!$K:$K,0)),\"\")","v":""},{"$f":"IF(COUNTIF(BdD!$A:$A,$A$1)>ROW()-1,INDEX(BdD!H:H,MATCH($A$1&\"_\"&ROW()-2,BdD!$K:$K,0)),\"\")","v":""},{"$f":"IF(COUNTIF(BdD!$A:$A,$A$1)>ROW()-1,INDEX(BdD!I:I,MATCH($A$1&\"_\"&ROW()-2,BdD!$K:$K,0)),\"\")","v":""}]
[{"$f":"IF(COUNTIF(BdD!$A:$A,$A$1)>ROW()-1,INDEX(BdD!B:B,MATCH($A$1&\"_\"&ROW()-2,BdD!$K:$K,0)),\"\")","v":""},{"$f":"IF(COUNTIF(BdD!$A:$A,$A$1)>ROW()-1,INDEX(BdD!C:C,MATCH($A$1&\"_\"&ROW()-2,BdD!$K:$K,0)),\"\")","v":""},{"$f":"IF(COUNTIF(BdD!$A:$A,$A$1)>ROW()-1,INDEX(BdD!D:D,MATCH($A$1&\"_\"&ROW()-2,BdD!$K:$K,0)),\"\")","v":""},{"$f":"IF(COUNTIF(BdD!$A:$A,$A$1)>ROW()-1,INDEX(BdD!E:E,MATCH($A$1&\"_\"&ROW()-2,BdD!$K:$K,0)),\"\")","v":""},{"$f":"IF(COUNTIF(BdD!$A:$A,$A$1)>ROW()-1,INDEX(BdD!F:F,MATCH($A$1&\"_\"&ROW()-2,BdD!$K:$K,0)),\"\")","v":""},{"$f":"IF(COUNTIF(BdD!$A:$A,$A$1)>ROW()-1,INDEX(BdD!G:G,MATCH($A$1&\"_\"&ROW()-2,BdD!$K:$K,0)),\"\")","v":""},{"$f":"IF(COUNTIF(BdD!$A:$A,$A$1)>ROW()-1,INDEX(BdD!H:H,MATCH($A$1&\"_\"&ROW()-2,BdD!$K:$K,0)),\"\")","v":""},{"$f":"IF(COUNTIF(BdD!$A:$A,$A$1)>ROW()-1,INDEX(BdD!I:I,MATCH($A$1&\"_\"&ROW()-2,BdD!$K:$K,0)),\"\")","v":""}]
[{"$f":"IF(COUNTIF(BdD!$A:$A,$A$1)>ROW()-1,INDEX(BdD!B:B,MATCH($A$1&\"_\"&ROW()-2,BdD!$K:$K,0)),\"\")","v":""},{"$f":"IF(COUNTIF(BdD!$A:$A,$A$1)>ROW()-1,INDEX(BdD!C:C,MATCH($A$1&\"_\"&ROW()-2,BdD!$K:$K,0)),\"\")","v":""},{"$f":"IF(COUNTIF(BdD!$A:$A,$A$1)>ROW()-1,INDEX(BdD!D:D,MATCH($A$1&\"_\"&ROW()-2,BdD!$K:$K,0)),\"\")","v":""},{"$f":"IF(COUNTIF(BdD!$A:$A,$A$1)>ROW()-1,INDEX(BdD!E:E,MATCH($A$1&\"_\"&ROW()-2,BdD!$K:$K,0)),\"\")","v":""},{"$f":"IF(COUNTIF(BdD!$A:$A,$A$1)>ROW()-1,INDEX(BdD!F:F,MATCH($A$1&\"_\"&ROW()-2,BdD!$K:$K,0)),\"\")","v":""},{"$f":"IF(COUNTIF(BdD!$A:$A,$A$1)>ROW()-1,INDEX(BdD!G:G,MATCH($A$1&\"_\"&ROW()-2,BdD!$K:$K,0)),\"\")","v":""},{"$f":"IF(COUNTIF(BdD!$A:$A,$A$1)>ROW()-1,INDEX(BdD!H:H,MATCH($A$1&\"_\"&ROW()-2,BdD!$K:$K,0)),\"\")","v":""},{"$f":"IF(COUNTIF(BdD!$A:$A,$A$1)>ROW()-1,INDEX(BdD!I:I,MATCH($A$1&\"_\"&ROW()-2,BdD!$K:$K,0)),\"\")","v":""}]
[{"$f":"IF(COUNTIF(BdD!$A:$A,$A$1)>ROW()-1,INDEX(BdD!B:B,MATCH($A$1&\"_\"&ROW()-2,BdD!$K:$K,0)),\"\")","v":""},{"$f":"IF(COUNTIF(BdD!$A:$A,$A$1)>ROW()-1,INDEX(BdD!C:C,MATCH($A$1&\"_\"&ROW()-2,BdD!$K:$K,0)),\"\")","v":""},{"$f":"IF(COUNTIF(BdD!$A:$A,$A$1)>ROW()-1,INDEX(BdD!D:D,MATCH($A$1&\"_\"&ROW()-2,BdD!$K:$K,0)),\"\")","v":""},{"$f":"IF(COUNTIF(BdD!$A:$A,$A$1)>ROW()-1,INDEX(BdD!E:E,MATCH($A$1&\"_\"&ROW()-2,BdD!$K:$K,0)),\"\")","v":""},{"$f":"IF(COUNTIF(BdD!$A:$A,$A$1)>ROW()-1,INDEX(BdD!F:F,MATCH($A$1&\"_\"&ROW()-2,BdD!$K:$K,0)),\"\")","v":""},{"$f":"IF(COUNTIF(BdD!$A:$A,$A$1)>ROW()-1,INDEX(BdD!G:G,MATCH($A$1&\"_\"&ROW()-2,BdD!$K:$K,0)),\"\")","v":""},{"$f":"IF(COUNTIF(BdD!$A:$A,$A$1)>ROW()-1,INDEX(BdD!H:H,MATCH($A$1&\"_\"&ROW()-2,BdD!$K:$K,0)),\"\")","v":""},{"$f":"IF(COUNTIF(BdD!$A:$A,$A$1)>ROW()-1,INDEX(BdD!I:I,MATCH($A$1&\"_\"&ROW()-2,BdD!$K:$K,0)),\"\")","v":""}]
[{"$f":"IF(COUNTIF(BdD!$A:$A,$A$1)>ROW()-1,INDEX(BdD!B:B,MATCH($A$1&\"_\"&ROW()-2,BdD!$K:$K,0)),\"\")","v":""},{"$f":"IF(COUNTIF(BdD!$A:$A,$A$1)>ROW()-1,INDEX(BdD!C:C,MATCH($A$1&\"_\"&ROW()-2,BdD!$K:$K,0)),\"\")","v":""},{"$f":"IF(COUNTIF(BdD!$A:$A,$A$1)>ROW()-1,INDEX(BdD!D:D,MATCH($A$1&\"_\"&ROW()-2,BdD!$K:$K,0)),\"\")","v":""},{"$f":"IF(COUNTIF(BdD!$A:$A,$A$1)>ROW()-1,INDEX(BdD!E:E,MATCH($A$1&\"_\"&ROW()-2,BdD!$K:$K,0)),\"\")","v":""},{"$f":"IF(COUNTIF(BdD!$A:$A,$A$1)>ROW()-1,INDEX(BdD!F:F,MATCH($A$1&\"_\"&ROW()-2,BdD!$K:$K,0)),\"\")","v":""},{"$f":"IF(COUNTIF(BdD!$A:$A,$A$1)>ROW()-1,INDEX(BdD!G:G,MATCH($A$1&\"_\"&ROW()-2,BdD!$K:$K,0)),\"\")","v":""},{"$f":"IF(COUNTIF(BdD!$A:$A,$A$1)>ROW()-1,INDEX(BdD!H:H,MATCH($A$1&\"_\"&ROW()-2,BdD!$K:$K,0)),\"\")","v":""},{"$f":"IF(COUNTIF(BdD!$A:$A,$A$1)>ROW()-1,INDEX(BdD!I:I,MATCH($A$1&\"_\"&ROW()-2,BdD!$K:$K,0)),\"\")","v":""}]
[{"$f":"IF(COUNTIF(BdD!$A:$A,$A$1)>ROW()-1,INDEX(BdD!B:B,MATCH($A$1&\"_\"&ROW()-2,BdD!$K:$K,0)),\"\")","v":""},{"$f":"IF(COUNTIF(BdD!$A:$A,$A$1)>ROW()-1,INDEX(BdD!C:C,MATCH($A$1&\"_\"&ROW()-2,BdD!$K:$K,0)),\"\")","v":""},{"$f":"IF(COUNTIF(BdD!$A:$A,$A$1)>ROW()-1,INDEX(BdD!D:D,MATCH($A$1&\"_\"&ROW()-2,BdD!$K:$K,0)),\"\")","v":""},{"$f":"IF(COUNTIF(BdD!$A:$A,$A$1)>ROW()-1,INDEX(BdD!E:E,MATCH($A$1&\"_\"&ROW()-2,BdD!$K:$K,0)),\"\")","v":""},{"$f":"IF(COUNTIF(BdD!$A:$A,$A$1)>ROW()-1,INDEX(BdD!F:F,MATCH($A$1&\"_\"&ROW()-2,BdD!$K:$K,0)),\"\")","v":""},{"$f":"IF(COUNTIF(BdD!$A:$A,$A$1)>ROW()-1,INDEX(BdD!G:G,MATCH($A$1&\"_\"&ROW()-2,BdD!$K:$K,0)),\"\")","v":""},{"$f":"IF(COUNTIF(BdD!$A:$A,$A$1)>ROW()-1,INDEX(BdD!H:H,MATCH($A$1&\"_\"&ROW()-2,BdD!$K:$K,0)),\"\")","v":""},{"$f":"IF(COUNTIF(BdD!$A:$A,$A$1)>ROW()-1,INDEX(BdD!I:I,MATCH($A$1&\"_\"&ROW()-2,BdD!$K:$K,0)),\"\")","v":""}]
[{"$f":"IF(COUNTIF(BdD!$A:$A,$A$1)>ROW()-1,INDEX(BdD!B:B,MATCH($A$1&\"_\"&ROW()-2,BdD!$K:$K,0)),\"\")","v":""},{"$f":"IF(COUNTIF(BdD!$A:$A,$A$1)>ROW()-1,INDEX(BdD!C:C,MATCH($A$1&\"_\"&ROW()-2,BdD!$K:$K,0)),\"\")","v":""},{"$f":"IF(COUNTIF(BdD!$A:$A,$A$1)>ROW()-1,INDEX(BdD!D:D,MATCH($A$1&\"_\"&ROW()-2,BdD!$K:$K,0)),\"\")","v":""},{"$f":"IF(COUNTIF(BdD!$A:$A,$A$1)>ROW()-1,INDEX(BdD!E:E,MATCH($A$1&\"_\"&ROW()-2,BdD!$K:$K,0)),\"\")","v":""},{"$f":"IF(COUNTIF(BdD!$A:$A,$A$1)>ROW()-1,INDEX(BdD!F:F,MATCH($A$1&\"_\"&ROW()-2,BdD!$K:$K,0)),\"\")","v":""},{"$f":"IF(COUNTIF(BdD!$A:$A,$A$1)>ROW()-1,INDEX(BdD!G:G,MATCH($A$1&\"_\"&ROW()-2,BdD!$K:$K,0)),\"\")","v":""},{"$f":"IF(COUNTIF(BdD!$A:$A,$A$1)>ROW()-1,INDEX(BdD!H:H,MATCH($A$1&\"_\"&ROW()-2,BdD!$K:$K,0)),\"\")","v":""},{"$f":"IF(COUNTIF(BdD!$A:$A,$A$1)>ROW()-1,INDEX(BdD!I:I,MATCH($A$1&\"_\"&ROW()-2,BdD!$K:$K,0)),\"\")","v":""}]
[{"$f":"IF(COUNTIF(BdD!$A:$A,$A$1)>ROW()-1,INDEX(BdD!B:B,MATCH($A$1&\"_\"&ROW()-2,BdD!$K:$K,0)),\"\")","v":""},{"$f":"IF(COUNTIF(BdD!$A:$A,$A$1)>ROW()-1,INDEX(BdD!C:C,MATCH($A$1&\"_\"&ROW()-2,BdD!$K:$K,0)),\"\")","v":""},{"$f":"IF(COUNTIF(BdD!$A:$A,$A$1)>ROW()-1,INDEX(BdD!D:D,MATCH($A$1&\"_\"&ROW()-2,BdD!$K:$K,0)),\"\")","v":""},{"$f":"IF(COUNTIF(BdD!$A:$A,$A$1)>ROW()-1,INDEX(BdD!E:E,MATCH($A$1&\"_\"&ROW()-2,BdD!$K:$K,0)),\"\")","v":""},{"$f":"IF(COUNTIF(BdD!$A:$A,$A$1)>ROW()-1,INDEX(BdD!F:F,MATCH($A$1&\"_\"&ROW()-2,BdD!$K:$K,0)),\"\")","v":""},{"$f":"IF(COUNTIF(BdD!$A:$A,$A$1)>ROW()-1,INDEX(BdD!G:G,MATCH($A$1&\"_\"&ROW()-2,BdD!$K:$K,0)),\"\")","v":""},{"$f":"IF(COUNTIF(BdD!$A:$A,$A$1)>ROW()-1,INDEX(BdD!H:H,MATCH($A$1&\"_\"&ROW()-2,BdD!$K:$K,0)),\"\")","v":""},{"$f":"IF(COUNTIF(BdD!$A:$A,$A$1)>ROW()-1,INDEX(BdD!I:I,MATCH($A$1&\"_\"&ROW()-2,BdD!$K:$K,0)),\"\")","v":""}]
[{"$f":"IF(COUNTIF(BdD!$A:$A,$A$1)>ROW()-1,INDEX(BdD!B:B,MATCH($A$1&\"_\"&ROW()-2,BdD!$K:$K,0)),\"\")","v":""},{"$f":"IF(COUNTIF(BdD!$A:$A,$A$1)>ROW()-1,INDEX(BdD!C:C,MATCH($A$1&\"_\"&ROW()-2,BdD!$K:$K,0)),\"\")","v":""},{"$f":"IF(COUNTIF(BdD!$A:$A,$A$1)>ROW()-1,INDEX(BdD!D:D,MATCH($A$1&\"_\"&ROW()-2,BdD!$K:$K,0)),\"\")","v":""},{"$f":"IF(COUNTIF(BdD!$A:$A,$A$1)>ROW()-1,INDEX(BdD!E:E,MATCH($A$1&\"_\"&ROW()-2,BdD!$K:$K,0)),\"\")","v":""},{"$f":"IF(COUNTIF(BdD!$A:$A,$A$1)>ROW()-1,INDEX(BdD!F:F,MATCH($A$1&\"_\"&ROW()-2,BdD!$K:$K,0)),\"\")","v":""},{"$f":"IF(COUNTIF(BdD!$A:$A,$A$1)>ROW()-1,INDEX(BdD!G:G,MATCH($A$1&\"_\"&ROW()-2,BdD!$K:$K,0)),\"\")","v":""},{"$f":"IF(COUNTIF(BdD!$A:$A,$A$1)>ROW()-1,INDEX(BdD!H:H,MATCH($A$1&\"_\"&ROW()-2,BdD!$K:$K,0)),\"\")","v":""},{"$f":"IF(COUNTIF(BdD!$A:$A,$A$1)>ROW()-1,INDEX(BdD!I:I,MATCH($A$1&\"_\"&ROW()-2,BdD!$K:$K,0)),\"\")","v":""}]
[{"$f":"IF(COUNTIF(BdD!$A:$A,$A$1)>ROW()-1,INDEX(BdD!B:B,MATCH($A$1&\"_\"&ROW()-2,BdD!$K:$K,0)),\"\")","v":""},{"$f":"IF(COUNTIF(BdD!$A:$A,$A$1)>ROW()-1,INDEX(BdD!C:C,MATCH($A$1&\"_\"&ROW()-2,BdD!$K:$K,0)),\"\")","v":""},{"$f":"IF(COUNTIF(BdD!$A:$A,$A$1)>ROW()-1,INDEX(BdD!D:D,MATCH($A$1&\"_\"&ROW()-2,BdD!$K:$K,0)),\"\")","v":""},{"$f":"IF(COUNTIF(BdD!$A:$A,$A$1)>ROW()-1,INDEX(BdD!E:E,MATCH($A$1&\"_\"&ROW()-2,BdD!$K:$K,0)),\"\")","v":""},{"$f":"IF(COUNTIF(BdD!$A:$A,$A$1)>ROW()-1,INDEX(BdD!F:F,MATCH($A$1&\"_\"&ROW()-2,BdD!$K:$K,0)),\"\")","v":""},{"$f":"IF(COUNTIF(BdD!$A:$A,$A$1)>ROW()-1,INDEX(BdD!G:G,MATCH($A$1&\"_\"&ROW()-2,BdD!$K:$K,0)),\"\")","v":""},{"$f":"IF(COUNTIF(BdD!$A:$A,$A$1)>ROW()-1,INDEX(BdD!H:H,MATCH($A$1&\"_\"&ROW()-2,BdD!$K:$K,0)),\"\")","v":""},{"$f":"IF(COUNTIF(BdD!$A:$A,$A$1)>ROW()-1,INDEX(BdD!I:I,MATCH($A$1&\"_\"&ROW()-2,BdD!$K:$K,0)),\"\")","v":""}]
[{"$f":"IF(COUNTIF(BdD!$A:$A,$A$1)>ROW()-1,INDEX(BdD!B:B,MATCH($A$1&\"_\"&ROW()-2,BdD!$K:$K,0)),\"\")","v":""},{"$f":"IF(COUNTIF(BdD!$A:$A,$A$1)>ROW()-1,INDEX(BdD!C:C,MATCH($A$1&\"_\"&ROW()-2,BdD!$K:$K,0)),\"\")","v":""},{"$f":"IF(COUNTIF(BdD!$A:$A,$A$1)>ROW()-1,INDEX(BdD!D:D,MATCH($A$1&\"_\"&ROW()-2,BdD!$K:$K,0)),\"\")","v":""},{"$f":"IF(COUNTIF(BdD!$A:$A,$A$1)>ROW()-1,INDEX(BdD!E:E,MATCH($A$1&\"_\"&ROW()-2,BdD!$K:$K,0)),\"\")","v":""},{"$f":"IF(COUNTIF(BdD!$A:$A,$A$1)>ROW()-1,INDEX(BdD!F:F,MATCH($A$1&\"_\"&ROW()-2,BdD!$K:$K,0)),\"\")","v":""},{"$f":"IF(COUNTIF(BdD!$A:$A,$A$1)>ROW()-1,INDEX(BdD!G:G,MATCH($A$1&\"_\"&ROW()-2,BdD!$K:$K,0)),\"\")","v":""},{"$f":"IF(COUNTIF(BdD!$A:$A,$A$1)>ROW()-1,INDEX(BdD!H:H,MATCH($A$1&\"_\"&ROW()-2,BdD!$K:$K,0)),\"\")","v":""},{"$f":"IF(COUNTIF(BdD!$A:$A,$A$1)>ROW()-1,INDEX(BdD!I:I,MATCH($A$1&\"_\"&ROW()-2,BdD!$K:$K,0)),\"\")","v":""}]
[{"$f":"IF(COUNTIF(BdD!$A:$A,$A$1)>ROW()-1,INDEX(BdD!B:B,MATCH($A$1&\"_\"&ROW()-2,BdD!$K:$K,0)),\"\")","v":""},{"$f":"IF(COUNTIF(BdD!$A:$A,$A$1)>ROW()-1,INDEX(BdD!C:C,MATCH($A$1&\"_\"&ROW()-2,BdD!$K:$K,0)),\"\")","v":""},{"$f":"IF(COUNTIF(BdD!$A:$A,$A$1)>ROW()-1,INDEX(BdD!D:D,MATCH($A$1&\"_\"&ROW()-2,BdD!$K:$K,0)),\"\")","v":""},{"$f":"IF(COUNTIF(BdD!$A:$A,$A$1)>ROW()-1,INDEX(BdD!E:E,MATCH($A$1&\"_\"&ROW()-2,BdD!$K:$K,0)),\"\")","v":""},{"$f":"IF(COUNTIF(BdD!$A:$A,$A$1)>ROW()-1,INDEX(BdD!F:F,MATCH($A$1&\"_\"&ROW()-2,BdD!$K:$K,0)),\"\")","v":""},{"$f":"IF(COUNTIF(BdD!$A:$A,$A$1)>ROW()-1,INDEX(BdD!G:G,MATCH($A$1&\"_\"&ROW()-2,BdD!$K:$K,0)),\"\")","v":""},{"$f":"IF(COUNTIF(BdD!$A:$A,$A$1)>ROW()-1,INDEX(BdD!H:H,MATCH($A$1&\"_\"&ROW()-2,BdD!$K:$K,0)),\"\")","v":""},{"$f":"IF(COUNTIF(BdD!$A:$A,$A$1)>ROW()-1,INDEX(BdD!I:I,MATCH($A$1&\"_\"&ROW()-2,BdD!$K:$K,0)),\"\")","v":""}]
[{"$f":"IF(COUNTIF(BdD!$A:$A,$A$1)>ROW()-1,INDEX(BdD!B:B,MATCH($A$1&\"_\"&ROW()-2,BdD!$K:$K,0)),\"\")","v":""},{"$f":"IF(COUNTIF(BdD!$A:$A,$A$1)>ROW()-1,INDEX(BdD!C:C,MATCH($A$1&\"_\"&ROW()-2,BdD!$K:$K,0)),\"\")","v":""},{"$f":"IF(COUNTIF(BdD!$A:$A,$A$1)>ROW()-1,INDEX(BdD!D:D,MATCH($A$1&\"_\"&ROW()-2,BdD!$K:$K,0)),\"\")","v":""},{"$f":"IF(COUNTIF(BdD!$A:$A,$A$1)>ROW()-1,INDEX(BdD!E:E,MATCH($A$1&\"_\"&ROW()-2,BdD!$K:$K,0)),\"\")","v":""},{"$f":"IF(COUNTIF(BdD!$A:$A,$A$1)>ROW()-1,INDEX(BdD!F:F,MATCH($A$1&\"_\"&ROW()-2,BdD!$K:$K,0)),\"\")","v":""},{"$f":"IF(COUNTIF(BdD!$A:$A,$A$1)>ROW()-1,INDEX(BdD!G:G,MATCH($A$1&\"_\"&ROW()-2,BdD!$K:$K,0)),\"\")","v":""},{"$f":"IF(COUNTIF(BdD!$A:$A,$A$1)>ROW()-1,INDEX(BdD!H:H,MATCH($A$1&\"_\"&ROW()-2,BdD!$K:$K,0)),\"\")","v":""},{"$f":"IF(COUNTIF(BdD!$A:$A,$A$1)>ROW()-1,INDEX(BdD!I:I,MATCH($A$1&\"_\"&ROW()-2,BdD!$K:$K,0)),\"\")","v":""}]
[{"$f":"IF(COUNTIF(BdD!$A:$A,$A$1)>ROW()-1,INDEX(BdD!B:B,MATCH($A$1&\"_\"&ROW()-2,BdD!$K:$K,0)),\"\")","v":""},{"$f":"IF(COUNTIF(BdD!$A:$A,$A$1)>ROW()-1,INDEX(BdD!C:C,MATCH($A$1&\"_\"&ROW()-2,BdD!$K:$K,0)),\"\")","v":""},{"$f":"IF(COUNTIF(BdD!$A:$A,$A$1)>ROW()-1,INDEX(BdD!D:D,MATCH($A$1&\"_\"&ROW()-2,BdD!$K:$K,0)),\"\")","v":""},{"$f":"IF(COUNTIF(BdD!$A:$A,$A$1)>ROW()-1,INDEX(BdD!E:E,MATCH($A$1&\"_\"&ROW()-2,BdD!$K:$K,0)),\"\")","v":""},{"$f":"IF(COUNTIF(BdD!$A:$A,$A$1)>ROW()-1,INDEX(BdD!F:F,MATCH($A$1&\"_\"&ROW()-2,BdD!$K:$K,0)),\"\")","v":""},{"$f":"IF(COUNTIF(BdD!$A:$A,$A$1)>ROW()-1,INDEX(BdD!G:G,MATCH($A$1&\"_\"&ROW()-2,BdD!$K:$K,0)),\"\")","v":""},{"$f":"IF(COUNTIF(BdD!$A:$A,$A$1)>ROW()-1,INDEX(BdD!H:H,MATCH($A$1&\"_\"&ROW()-2,BdD!$K:$K,0)),\"\")","v":""},{"$f":"IF(COUNTIF(BdD!$A:$A,$A$1)>ROW()-1,INDEX(BdD!I:I,MATCH($A$1&\"_\"&ROW()-2,BdD!$K:$K,0)),\"\")","v":""}]
[{"$f":"IF(COUNTIF(BdD!$A:$A,$A$1)>ROW()-1,INDEX(BdD!B:B,MATCH($A$1&\"_\"&ROW()-2,BdD!$K:$K,0)),\"\")","v":""},{"$f":"IF(COUNTIF(BdD!$A:$A,$A$1)>ROW()-1,INDEX(BdD!C:C,MATCH($A$1&\"_\"&ROW()-2,BdD!$K:$K,0)),\"\")","v":""},{"$f":"IF(COUNTIF(BdD!$A:$A,$A$1)>ROW()-1,INDEX(BdD!D:D,MATCH($A$1&\"_\"&ROW()-2,BdD!$K:$K,0)),\"\")","v":""},{"$f":"IF(COUNTIF(BdD!$A:$A,$A$1)>ROW()-1,INDEX(BdD!E:E,MATCH($A$1&\"_\"&ROW()-2,BdD!$K:$K,0)),\"\")","v":""},{"$f":"IF(COUNTIF(BdD!$A:$A,$A$1)>ROW()-1,INDEX(BdD!F:F,MATCH($A$1&\"_\"&ROW()-2,BdD!$K:$K,0)),\"\")","v":""},{"$f":"IF(COUNTIF(BdD!$A:$A,$A$1)>ROW()-1,INDEX(BdD!G:G,MATCH($A$1&\"_\"&ROW()-2,BdD!$K:$K,0)),\"\")","v":""},{"$f":"IF(COUNTIF(BdD!$A:$A,$A$1)>ROW()-1,INDEX(BdD!H:H,MATCH($A$1&\"_\"&ROW()-2,BdD!$K:$K,0)),\"\")","v":""},{"$f":"IF(COUNTIF(BdD!$A:$A,$A$1)>ROW()-1,INDEX(BdD!I:I,MATCH($A$1&\"_\"&ROW()-2,BdD!$K:$K,0)),\"\")","v":""}]
[{"$f":"IF(COUNTIF(BdD!$A:$A,$A$1)>ROW()-1,INDEX(BdD!B:B,MATCH($A$1&\"_\"&ROW()-2,BdD!$K:$K,0)),\"\")","v":""},{"$f":"IF(COUNTIF(BdD!$A:$A,$A$1)>ROW()-1,INDEX(BdD!C:C,MATCH($A$1&\"_\"&ROW()-2,BdD!$K:$K,0)),\"\")","v":""},{"$f":"IF(COUNTIF(BdD!$A:$A,$A$1)>ROW()-1,INDEX(BdD!D:D,MATCH($A$1&\"_\"&ROW()-2,BdD!$K:$K,0)),\"\")","v":""},{"$f":"IF(COUNTIF(BdD!$A:$A,$A$1)>ROW()-1,INDEX(BdD!E:E,MATCH($A$1&\"_\"&ROW()-2,BdD!$K:$K,0)),\"\")","v":""},{"$f":"IF(COUNTIF(BdD!$A:$A,$A$1)>ROW()-1,INDEX(BdD!F:F,MATCH($A$1&\"_\"&ROW()-2,BdD!$K:$K,0)),\"\")","v":""},{"$f":"IF(COUNTIF(BdD!$A:$A,$A$1)>ROW()-1,INDEX(BdD!G:G,MATCH($A$1&\"_\"&ROW()-2,BdD!$K:$K,0)),\"\")","v":""},{"$f":"IF(COUNTIF(BdD!$A:$A,$A$1)>ROW()-1,INDEX(BdD!H:H,MATCH($A$1&\"_\"&ROW()-2,BdD!$K:$K,0)),\"\")","v":""},{"$f":"IF(COUNTIF(BdD!$A:$A,$A$1)>ROW()-1,INDEX(BdD!I:I,MATCH($A$1&\"_\"&ROW()-2,BdD!$K:$K,0)),\"\")","v":""}]
[{"$f":"IF(COUNTIF(BdD!$A:$A,$A$1)>ROW()-1,INDEX(BdD!B:B,MATCH($A$1&\"_\"&ROW()-2,BdD!$K:$K,0)),\"\")","v":""},{"$f":"IF(COUNTIF(BdD!$A:$A,$A$1)>ROW()-1,INDEX(BdD!C:C,MATCH($A$1&\"_\"&ROW()-2,BdD!$K:$K,0)),\"\")","v":""},{"$f":"IF(COUNTIF(BdD!$A:$A,$A$1)>ROW()-1,INDEX(BdD!D:D,MATCH($A$1&\"_\"&ROW()-2,BdD!$K:$K,0)),\"\")","v":""},{"$f":"IF(COUNTIF(BdD!$A:$A,$A$1)>ROW()-1,INDEX(BdD!E:E,MATCH($A$1&\"_\"&ROW()-2,BdD!$K:$K,0)),\"\")","v":""},{"$f":"IF(COUNTIF(BdD!$A:$A,$A$1)>ROW()-1,INDEX(BdD!F:F,MATCH($A$1&\"_\"&ROW()-2,BdD!$K:$K,0)),\"\")","v":""},{"$f":"IF(COUNTIF(BdD!$A:$A,$A$1)>ROW()-1,INDEX(BdD!G:G,MATCH($A$1&\"_\"&ROW()-2,BdD!$K:$K,0)),\"\")","v":""},{"$f":"IF(COUNTIF(BdD!$A:$A,$A$1)>ROW()-1,INDEX(BdD!H:H,MATCH($A$1&\"_\"&ROW()-2,BdD!$K:$K,0)),\"\")","v":""},{"$f":"IF(COUNTIF(BdD!$A:$A,$A$1)>ROW()-1,INDEX(BdD!I:I,MATCH($A$1&\"_\"&ROW()-2,BdD!$K:$K,0)),\"\")","v":""}]
[{"$f":"IF(COUNTIF(BdD!$A:$A,$A$1)>ROW()-1,INDEX(BdD!B:B,MATCH($A$1&\"_\"&ROW()-2,BdD!$K:$K,0)),\"\")","v":""},{"$f":"IF(COUNTIF(BdD!$A:$A,$A$1)>ROW()-1,INDEX(BdD!C:C,MATCH($A$1&\"_\"&ROW()-2,BdD!$K:$K,0)),\"\")","v":""},{"$f":"IF(COUNTIF(BdD!$A:$A,$A$1)>ROW()-1,INDEX(BdD!D:D,MATCH($A$1&\"_\"&ROW()-2,BdD!$K:$K,0)),\"\")","v":""},{"$f":"IF(COUNTIF(BdD!$A:$A,$A$1)>ROW()-1,INDEX(BdD!E:E,MATCH($A$1&\"_\"&ROW()-2,BdD!$K:$K,0)),\"\")","v":""},{"$f":"IF(COUNTIF(BdD!$A:$A,$A$1)>ROW()-1,INDEX(BdD!F:F,MATCH($A$1&\"_\"&ROW()-2,BdD!$K:$K,0)),\"\")","v":""},{"$f":"IF(COUNTIF(BdD!$A:$A,$A$1)>ROW()-1,INDEX(BdD!G:G,MATCH($A$1&\"_\"&ROW()-2,BdD!$K:$K,0)),\"\")","v":""},{"$f":"IF(COUNTIF(BdD!$A:$A,$A$1)>ROW()-1,INDEX(BdD!H:H,MATCH($A$1&\"_\"&ROW()-2,BdD!$K:$K,0)),\"\")","v":""},{"$f":"IF(COUNTIF(BdD!$A:$A,$A$1)>ROW()-1,INDEX(BdD!I:I,MATCH($A$1&\"_\"&ROW()-2,BdD!$K:$K,0)),\"\")","v":""}]
[{"$f":"IF(COUNTIF(BdD!$A:$A,$A$1)>ROW()-1,INDEX(BdD!B:B,MATCH($A$1&\"_\"&ROW()-2,BdD!$K:$K,0)),\"\")","v":""},{"$f":"IF(COUNTIF(BdD!$A:$A,$A$1)>ROW()-1,INDEX(BdD!C:C,MATCH($A$1&\"_\"&ROW()-2,BdD!$K:$K,0)),\"\")","v":""},{"$f":"IF(COUNTIF(BdD!$A:$A,$A$1)>ROW()-1,INDEX(BdD!D:D,MATCH($A$1&\"_\"&ROW()-2,BdD!$K:$K,0)),\"\")","v":""},{"$f":"IF(COUNTIF(BdD!$A:$A,$A$1)>ROW()-1,INDEX(BdD!E:E,MATCH($A$1&\"_\"&ROW()-2,BdD!$K:$K,0)),\"\")","v":""},{"$f":"IF(COUNTIF(BdD!$A:$A,$A$1)>ROW()-1,INDEX(BdD!F:F,MATCH($A$1&\"_\"&ROW()-2,BdD!$K:$K,0)),\"\")","v":""},{"$f":"IF(COUNTIF(BdD!$A:$A,$A$1)>ROW()-1,INDEX(BdD!G:G,MATCH($A$1&\"_\"&ROW()-2,BdD!$K:$K,0)),\"\")","v":""},{"$f":"IF(COUNTIF(BdD!$A:$A,$A$1)>ROW()-1,INDEX(BdD!H:H,MATCH($A$1&\"_\"&ROW()-2,BdD!$K:$K,0)),\"\")","v":""},{"$f":"IF(COUNTIF(BdD!$A:$A,$A$1)>ROW()-1,INDEX(BdD!I:I,MATCH($A$1&\"_\"&ROW()-2,BdD!$K:$K,0)),\"\")","v":""}]
[{"$f":"IF(COUNTIF(BdD!$A:$A,$A$1)>ROW()-1,INDEX(BdD!B:B,MATCH($A$1&\"_\"&ROW()-2,BdD!$K:$K,0)),\"\")","v":""},{"$f":"IF(COUNTIF(BdD!$A:$A,$A$1)>ROW()-1,INDEX(BdD!C:C,MATCH($A$1&\"_\"&ROW()-2,BdD!$K:$K,0)),\"\")","v":""},{"$f":"IF(COUNTIF(BdD!$A:$A,$A$1)>ROW()-1,INDEX(BdD!D:D,MATCH($A$1&\"_\"&ROW()-2,BdD!$K:$K,0)),\"\")","v":""},{"$f":"IF(COUNTIF(BdD!$A:$A,$A$1)>ROW()-1,INDEX(BdD!E:E,MATCH($A$1&\"_\"&ROW()-2,BdD!$K:$K,0)),\"\")","v":""},{"$f":"IF(COUNTIF(BdD!$A:$A,$A$1)>ROW()-1,INDEX(BdD!F:F,MATCH($A$1&\"_\"&ROW()-2,BdD!$K:$K,0)),\"\")","v":""},{"$f":"IF(COUNTIF(BdD!$A:$A,$A$1)>ROW()-1,INDEX(BdD!G:G,MATCH($A$1&\"_\"&ROW()-2,BdD!$K:$K,0)),\"\")","v":""},{"$f":"IF(COUNTIF(BdD!$A:$A,$A$1)>ROW()-1,INDEX(BdD!H:H,MATCH($A$1&\"_\"&ROW()-2,BdD!$K:$K,0)),\"\")","v":""},{"$f":"IF(COUNTIF(BdD!$A:$A,$A$1)>ROW()-1,INDEX(BdD!I:I,MATCH($A$1&\"_\"&ROW()-2,BdD!$K:$K,0)),\"\")","v":""}]
[{"$f":"IF(COUNTIF(BdD!$A:$A,$A$1)>ROW()-1,INDEX(BdD!B:B,MATCH($A$1&\"_\"&ROW()-2,BdD!$K:$K,0)),\"\")","v":""},{"$f":"IF(COUNTIF(BdD!$A:$A,$A$1)>ROW()-1,INDEX(BdD!C:C,MATCH($A$1&\"_\"&ROW()-2,BdD!$K:$K,0)),\"\")","v":""},{"$f":"IF(COUNTIF(BdD!$A:$A,$A$1)>ROW()-1,INDEX(BdD!D:D,MATCH($A$1&\"_\"&ROW()-2,BdD!$K:$K,0)),\"\")","v":""},{"$f":"IF(COUNTIF(BdD!$A:$A,$A$1)>ROW()-1,INDEX(BdD!E:E,MATCH($A$1&\"_\"&ROW()-2,BdD!$K:$K,0)),\"\")","v":""},{"$f":"IF(COUNTIF(BdD!$A:$A,$A$1)>ROW()-1,INDEX(BdD!F:F,MATCH($A$1&\"_\"&ROW()-2,BdD!$K:$K,0)),\"\")","v":""},{"$f":"IF(COUNTIF(BdD!$A:$A,$A$1)>ROW()-1,INDEX(BdD!G:G,MATCH($A$1&\"_\"&ROW()-2,BdD!$K:$K,0)),\"\")","v":""},{"$f":"IF(COUNTIF(BdD!$A:$A,$A$1)>ROW()-1,INDEX(BdD!H:H,MATCH($A$1&\"_\"&ROW()-2,BdD!$K:$K,0)),\"\")","v":""},{"$f":"IF(COUNTIF(BdD!$A:$A,$A$1)>ROW()-1,INDEX(BdD!I:I,MATCH($A$1&\"_\"&ROW()-2,BdD!$K:$K,0)),\"\")","v":""}]
[{"$f":"IF(COUNTIF(BdD!$A:$A,$A$1)>ROW()-1,INDEX(BdD!B:B,MATCH($A$1&\"_\"&ROW()-2,BdD!$K:$K,0)),\"\")","v":""},{"$f":"IF(COUNTIF(BdD!$A:$A,$A$1)>ROW()-1,INDEX(BdD!C:C,MATCH($A$1&\"_\"&ROW()-2,BdD!$K:$K,0)),\"\")","v":""},{"$f":"IF(COUNTIF(BdD!$A:$A,$A$1)>ROW()-1,INDEX(BdD!D:D,MATCH($A$1&\"_\"&ROW()-2,BdD!$K:$K,0)),\"\")","v":""},{"$f":"IF(COUNTIF(BdD!$A:$A,$A$1)>ROW()-1,INDEX(BdD!E:E,MATCH($A$1&\"_\"&ROW()-2,BdD!$K:$K,0)),\"\")","v":""},{"$f":"IF(COUNTIF(BdD!$A:$A,$A$1)>ROW()-1,INDEX(BdD!F:F,MATCH($A$1&\"_\"&ROW()-2,BdD!$K:$K,0)),\"\")","v":""},{"$f":"IF(COUNTIF(BdD!$A:$A,$A$1)>ROW()-1,INDEX(BdD!G:G,MATCH($A$1&\"_\"&ROW()-2,BdD!$K:$K,0)),\"\")","v":""},{"$f":"IF(COUNTIF(BdD!$A:$A,$A$1)>ROW()-1,INDEX(BdD!H:H,MATCH($A$1&\"_\"&ROW()-2,BdD!$K:$K,0)),\"\")","v":""},{"$f":"IF(COUNTIF(BdD!$A:$A,$A$1)>ROW()-1,INDEX(BdD!I:I,MATCH($A$1&\"_\"&ROW()-2,BdD!$K:$K,0)),\"\")","v":""}]
[{"$f":"IF(COUNTIF(BdD!$A:$A,$A$1)>ROW()-1,INDEX(BdD!B:B,MATCH($A$1&\"_\"&ROW()-2,BdD!$K:$K,0)),\"\")","v":""},{"$f":"IF(COUNTIF(BdD!$A:$A,$A$1)>ROW()-1,INDEX(BdD!C:C,MATCH($A$1&\"_\"&ROW()-2,BdD!$K:$K,0)),\"\")","v":""},{"$f":"IF(COUNTIF(BdD!$A:$A,$A$1)>ROW()-1,INDEX(BdD!D:D,MATCH($A$1&\"_\"&ROW()-2,BdD!$K:$K,0)),\"\")","v":""},{"$f":"IF(COUNTIF(BdD!$A:$A,$A$1)>ROW()-1,INDEX(BdD!E:E,MATCH($A$1&\"_\"&ROW()-2,BdD!$K:$K,0)),\"\")","v":""},{"$f":"IF(COUNTIF(BdD!$A:$A,$A$1)>ROW()-1,INDEX(BdD!F:F,MATCH($A$1&\"_\"&ROW()-2,BdD!$K:$K,0)),\"\")","v":""},{"$f":"IF(COUNTIF(BdD!$A:$A,$A$1)>ROW()-1,INDEX(BdD!G:G,MATCH($A$1&\"_\"&ROW()-2,BdD!$K:$K,0)),\"\")","v":""},{"$f":"IF(COUNTIF(BdD!$A:$A,$A$1)>ROW()-1,INDEX(BdD!H:H,MATCH($A$1&\"_\"&ROW()-2,BdD!$K:$K,0)),\"\")","v":""},{"$f":"IF(COUNTIF(BdD!$A:$A,$A$1)>ROW()-1,INDEX(BdD!I:I,MATCH($A$1&\"_\"&ROW()-2,BdD!$K:$K,0)),\"\")","v":""}]
[{"$f":"IF(COUNTIF(BdD!$A:$A,$A$1)>ROW()-1,INDEX(BdD!B:B,MATCH($A$1&\"_\"&ROW()-2,BdD!$K:$K,0)),\"\")","v":""},{"$f":"IF(COUNTIF(BdD!$A:$A,$A$1)>ROW()-1,INDEX(BdD!C:C,MATCH($A$1&\"_\"&ROW()-2,BdD!$K:$K,0)),\"\")","v":""},{"$f":"IF(COUNTIF(BdD!$A:$A,$A$1)>ROW()-1,INDEX(BdD!D:D,MATCH($A$1&\"_\"&ROW()-2,BdD!$K:$K,0)),\"\")","v":""},{"$f":"IF(COUNTIF(BdD!$A:$A,$A$1)>ROW()-1,INDEX(BdD!E:E,MATCH($A$1&\"_\"&ROW()-2,BdD!$K:$K,0)),\"\")","v":""},{"$f":"IF(COUNTIF(BdD!$A:$A,$A$1)>ROW()-1,INDEX(BdD!F:F,MATCH($A$1&\"_\"&ROW()-2,BdD!$K:$K,0)),\"\")","v":""},{"$f":"IF(COUNTIF(BdD!$A:$A,$A$1)>ROW()-1,INDEX(BdD!G:G,MATCH($A$1&\"_\"&ROW()-2,BdD!$K:$K,0)),\"\")","v":""},{"$f":"IF(COUNTIF(BdD!$A:$A,$A$1)>ROW()-1,INDEX(BdD!H:H,MATCH($A$1&\"_\"&ROW()-2,BdD!$K:$K,0)),\"\")","v":""},{"$f":"IF(COUNTIF(BdD!$A:$A,$A$1)>ROW()-1,INDEX(BdD!I:I,MATCH($A$1&\"_\"&ROW()-2,BdD!$K:$K,0)),\"\")","v":""}]
[{"$f":"IF(COUNTIF(BdD!$A:$A,$A$1)>ROW()-1,INDEX(BdD!B:B,MATCH($A$1&\"_\"&ROW()-2,BdD!$K:$K,0)),\"\")","v":""},{"$f":"IF(COUNTIF(BdD!$A:$A,$A$1)>ROW()-1,INDEX(BdD!C:C,MATCH($A$1&\"_\"&ROW()-2,BdD!$K:$K,0)),\"\")","v":""},{"$f":"IF(COUNTIF(BdD!$A:$A,$A$1)>ROW()-1,INDEX(BdD!D:D,MATCH($A$1&\"_\"&ROW()-2,BdD!$K:$K,0)),\"\")","v":""},{"$f":"IF(COUNTIF(BdD!$A:$A,$A$1)>ROW()-1,INDEX(BdD!E:E,MATCH($A$1&\"_\"&ROW()-2,BdD!$K:$K,0)),\"\")","v":""},{"$f":"IF(COUNTIF(BdD!$A:$A,$A$1)>ROW()-1,INDEX(BdD!F:F,MATCH($A$1&\"_\"&ROW()-2,BdD!$K:$K,0)),\"\")","v":""},{"$f":"IF(COUNTIF(BdD!$A:$A,$A$1)>ROW()-1,INDEX(BdD!G:G,MATCH($A$1&\"_\"&ROW()-2,BdD!$K:$K,0)),\"\")","v":""},{"$f":"IF(COUNTIF(BdD!$A:$A,$A$1)>ROW()-1,INDEX(BdD!H:H,MATCH($A$1&\"_\"&ROW()-2,BdD!$K:$K,0)),\"\")","v":""},{"$f":"IF(COUNTIF(BdD!$A:$A,$A$1)>ROW()-1,INDEX(BdD!I:I,MATCH($A$1&\"_\"&ROW()-2,BdD!$K:$K,0)),\"\")","v":""}]
[{"$f":"IF(COUNTIF(BdD!$A:$A,$A$1)>ROW()-1,INDEX(BdD!B:B,MATCH($A$1&\"_\"&ROW()-2,BdD!$K:$K,0)),\"\")","v":""},{"$f":"IF(COUNTIF(BdD!$A:$A,$A$1)>ROW()-1,INDEX(BdD!C:C,MATCH($A$1&\"_\"&ROW()-2,BdD!$K:$K,0)),\"\")","v":""},{"$f":"IF(COUNTIF(BdD!$A:$A,$A$1)>ROW()-1,INDEX(BdD!D:D,MATCH($A$1&\"_\"&ROW()-2,BdD!$K:$K,0)),\"\")","v":""},{"$f":"IF(COUNTIF(BdD!$A:$A,$A$1)>ROW()-1,INDEX(BdD!E:E,MATCH($A$1&\"_\"&ROW()-2,BdD!$K:$K,0)),\"\")","v":""},{"$f":"IF(COUNTIF(BdD!$A:$A,$A$1)>ROW()-1,INDEX(BdD!F:F,MATCH($A$1&\"_\"&ROW()-2,BdD!$K:$K,0)),\"\")","v":""},{"$f":"IF(COUNTIF(BdD!$A:$A,$A$1)>ROW()-1,INDEX(BdD!G:G,MATCH($A$1&\"_\"&ROW()-2,BdD!$K:$K,0)),\"\")","v":""},{"$f":"IF(COUNTIF(BdD!$A:$A,$A$1)>ROW()-1,INDEX(BdD!H:H,MATCH($A$1&\"_\"&ROW()-2,BdD!$K:$K,0)),\"\")","v":""},{"$f":"IF(COUNTIF(BdD!$A:$A,$A$1)>ROW()-1,INDEX(BdD!I:I,MATCH($A$1&\"_\"&ROW()-2,BdD!$K:$K,0)),\"\")","v":""}]
[{"$f":"IF(COUNTIF(BdD!$A:$A,$A$1)>ROW()-1,INDEX(BdD!B:B,MATCH($A$1&\"_\"&ROW()-2,BdD!$K:$K,0)),\"\")","v":""},{"$f":"IF(COUNTIF(BdD!$A:$A,$A$1)>ROW()-1,INDEX(BdD!C:C,MATCH($A$1&\"_\"&ROW()-2,BdD!$K:$K,0)),\"\")","v":""},{"$f":"IF(COUNTIF(BdD!$A:$A,$A$1)>ROW()-1,INDEX(BdD!D:D,MATCH($A$1&\"_\"&ROW()-2,BdD!$K:$K,0)),\"\")","v":""},{"$f":"IF(COUNTIF(BdD!$A:$A,$A$1)>ROW()-1,INDEX(BdD!E:E,MATCH($A$1&\"_\"&ROW()-2,BdD!$K:$K,0)),\"\")","v":""},{"$f":"IF(COUNTIF(BdD!$A:$A,$A$1)>ROW()-1,INDEX(BdD!F:F,MATCH($A$1&\"_\"&ROW()-2,BdD!$K:$K,0)),\"\")","v":""},{"$f":"IF(COUNTIF(BdD!$A:$A,$A$1)>ROW()-1,INDEX(BdD!G:G,MATCH($A$1&\"_\"&ROW()-2,BdD!$K:$K,0)),\"\")","v":""},{"$f":"IF(COUNTIF(BdD!$A:$A,$A$1)>ROW()-1,INDEX(BdD!H:H,MATCH($A$1&\"_\"&ROW()-2,BdD!$K:$K,0)),\"\")","v":""},{"$f":"IF(COUNTIF(BdD!$A:$A,$A$1)>ROW()-1,INDEX(BdD!I:I,MATCH($A$1&\"_\"&ROW()-2,BdD!$K:$K,0)),\"\")","v":""}]
[{"$f":"IF(COUNTIF(BdD!$A:$A,$A$1)>ROW()-1,INDEX(BdD!B:B,MATCH($A$1&\"_\"&ROW()-2,BdD!$K:$K,0)),\"\")","v":""},{"$f":"IF(COUNTIF(BdD!$A:$A,$A$1)>ROW()-1,INDEX(BdD!C:C,MATCH($A$1&\"_\"&ROW()-2,BdD!$K:$K,0)),\"\")","v":""},{"$f":"IF(COUNTIF(BdD!$A:$A,$A$1)>ROW()-1,INDEX(BdD!D:D,MATCH($A$1&\"_\"&ROW()-2,BdD!$K:$K,0)),\"\")","v":""},{"$f":"IF(COUNTIF(BdD!$A:$A,$A$1)>ROW()-1,INDEX(BdD!E:E,MATCH($A$1&\"_\"&ROW()-2,BdD!$K:$K,0)),\"\")","v":""},{"$f":"IF(COUNTIF(BdD!$A:$A,$A$1)>ROW()-1,INDEX(BdD!F:F,MATCH($A$1&\"_\"&ROW()-2,BdD!$K:$K,0)),\"\")","v":""},{"$f":"IF(COUNTIF(BdD!$A:$A,$A$1)>ROW()-1,INDEX(BdD!G:G,MATCH($A$1&\"_\"&ROW()-2,BdD!$K:$K,0)),\"\")","v":""},{"$f":"IF(COUNTIF(BdD!$A:$A,$A$1)>ROW()-1,INDEX(BdD!H:H,MATCH($A$1&\"_\"&ROW()-2,BdD!$K:$K,0)),\"\")","v":""},{"$f":"IF(COUNTIF(BdD!$A:$A,$A$1)>ROW()-1,INDEX(BdD!I:I,MATCH($A$1&\"_\"&ROW()-2,BdD!$K:$K,0)),\"\")","v":""}]
[{"$f":"IF(COUNTIF(BdD!$A:$A,$A$1)>ROW()-1,INDEX(BdD!B:B,MATCH($A$1&\"_\"&ROW()-2,BdD!$K:$K,0)),\"\")","v":""},{"$f":"IF(COUNTIF(BdD!$A:$A,$A$1)>ROW()-1,INDEX(BdD!C:C,MATCH($A$1&\"_\"&ROW()-2,BdD!$K:$K,0)),\"\")","v":""},{"$f":"IF(COUNTIF(BdD!$A:$A,$A$1)>ROW()-1,INDEX(BdD!D:D,MATCH($A$1&\"_\"&ROW()-2,BdD!$K:$K,0)),\"\")","v":""},{"$f":"IF(COUNTIF(BdD!$A:$A,$A$1)>ROW()-1,INDEX(BdD!E:E,MATCH($A$1&\"_\"&ROW()-2,BdD!$K:$K,0)),\"\")","v":""},{"$f":"IF(COUNTIF(BdD!$A:$A,$A$1)>ROW()-1,INDEX(BdD!F:F,MATCH($A$1&\"_\"&ROW()-2,BdD!$K:$K,0)),\"\")","v":""},{"$f":"IF(COUNTIF(BdD!$A:$A,$A$1)>ROW()-1,INDEX(BdD!G:G,MATCH($A$1&\"_\"&ROW()-2,BdD!$K:$K,0)),\"\")","v":""},{"$f":"IF(COUNTIF(BdD!$A:$A,$A$1)>ROW()-1,INDEX(BdD!H:H,MATCH($A$1&\"_\"&ROW()-2,BdD!$K:$K,0)),\"\")","v":""},{"$f":"IF(COUNTIF(BdD!$A:$A,$A$1)>ROW()-1,INDEX(BdD!I:I,MATCH($A$1&\"_\"&ROW()-2,BdD!$K:$K,0)),\"\")","v":""}]
[{"$f":"IF(COUNTIF(BdD!$A:$A,$A$1)>ROW()-1,INDEX(BdD!B:B,MATCH($A$1&\"_\"&ROW()-2,BdD!$K:$K,0)),\"\")","v":""},{"$f":"IF(COUNTIF(BdD!$A:$A,$A$1)>ROW()-1,INDEX(BdD!C:C,MATCH($A$1&\"_\"&ROW()-2,BdD!$K:$K,0)),\"\")","v":""},{"$f":"IF(COUNTIF(BdD!$A:$A,$A$1)>ROW()-1,INDEX(BdD!D:D,MATCH($A$1&\"_\"&ROW()-2,BdD!$K:$K,0)),\"\")","v":""},{"$f":"IF(COUNTIF(BdD!$A:$A,$A$1)>ROW()-1,INDEX(BdD!E:E,MATCH($A$1&\"_\"&ROW()-2,BdD!$K:$K,0)),\"\")","v":""},{"$f":"IF(COUNTIF(BdD!$A:$A,$A$1)>ROW()-1,INDEX(BdD!F:F,MATCH($A$1&\"_\"&ROW()-2,BdD!$K:$K,0)),\"\")","v":""},{"$f":"IF(COUNTIF(BdD!$A:$A,$A$1)>ROW()-1,INDEX(BdD!G:G,MATCH($A$1&\"_\"&ROW()-2,BdD!$K:$K,0)),\"\")","v":""},{"$f":"IF(COUNTIF(BdD!$A:$A,$A$1)>ROW()-1,INDEX(BdD!H:H,MATCH($A$1&\"_\"&ROW()-2,BdD!$K:$K,0)),\"\")","v":""},{"$f":"IF(COUNTIF(BdD!$A:$A,$A$1)>ROW()-1,INDEX(BdD!I:I,MATCH($A$1&\"_\"&ROW()-2,BdD!$K:$K,0)),\"\")","v":""}]
[{"$f":"IF(COUNTIF(BdD!$A:$A,$A$1)>ROW()-1,INDEX(BdD!B:B,MATCH($A$1&\"_\"&ROW()-2,BdD!$K:$K,0)),\"\")","v":""},{"$f":"IF(COUNTIF(BdD!$A:$A,$A$1)>ROW()-1,INDEX(BdD!C:C,MATCH($A$1&\"_\"&ROW()-2,BdD!$K:$K,0)),\"\")","v":""},{"$f":"IF(COUNTIF(BdD!$A:$A,$A$1)>ROW()-1,INDEX(BdD!D:D,MATCH($A$1&\"_\"&ROW()-2,BdD!$K:$K,0)),\"\")","v":""},{"$f":"IF(COUNTIF(BdD!$A:$A,$A$1)>ROW()-1,INDEX(BdD!E:E,MATCH($A$1&\"_\"&ROW()-2,BdD!$K:$K,0)),\"\")","v":""},{"$f":"IF(COUNTIF(BdD!$A:$A,$A$1)>ROW()-1,INDEX(BdD!F:F,MATCH($A$1&\"_\"&ROW()-2,BdD!$K:$K,0)),\"\")","v":""},{"$f":"IF(COUNTIF(BdD!$A:$A,$A$1)>ROW()-1,INDEX(BdD!G:G,MATCH($A$1&\"_\"&ROW()-2,BdD!$K:$K,0)),\"\")","v":""},{"$f":"IF(COUNTIF(BdD!$A:$A,$A$1)>ROW()-1,INDEX(BdD!H:H,MATCH($A$1&\"_\"&ROW()-2,BdD!$K:$K,0)),\"\")","v":""},{"$f":"IF(COUNTIF(BdD!$A:$A,$A$1)>ROW()-1,INDEX(BdD!I:I,MATCH($A$1&\"_\"&ROW()-2,BdD!$K:$K,0)),\"\")","v":""}]
[{"$f":"IF(COUNTIF(BdD!$A:$A,$A$1)>ROW()-1,INDEX(BdD!B:B,MATCH($A$1&\"_\"&ROW()-2,BdD!$K:$K,0)),\"\")","v":""},{"$f":"IF(COUNTIF(BdD!$A:$A,$A$1)>ROW()-1,INDEX(BdD!C:C,MATCH($A$1&\"_\"&ROW()-2,BdD!$K:$K,0)),\"\")","v":""},{"$f":"IF(COUNTIF(BdD!$A:$A,$A$1)>ROW()-1,INDEX(BdD!D:D,MATCH($A$1&\"_\"&ROW()-2,BdD!$K:$K,0)),\"\")","v":""},{"$f":"IF(COUNTIF(BdD!$A:$A,$A$1)>ROW()-1,INDEX(BdD!E:E,MATCH($A$1&\"_\"&ROW()-2,BdD!$K:$K,0)),\"\")","v":""},{"$f":"IF(COUNTIF(BdD!$A:$A,$A$1)>ROW()-1,INDEX(BdD!F:F,MATCH($A$1&\"_\"&ROW()-2,BdD!$K:$K,0)),\"\")","v":""},{"$f":"IF(COUNTIF(BdD!$A:$A,$A$1)>ROW()-1,INDEX(BdD!G:G,MATCH($A$1&\"_\"&ROW()-2,BdD!$K:$K,0)),\"\")","v":""},{"$f":"IF(COUNTIF(BdD!$A:$A,$A$1)>ROW()-1,INDEX(BdD!H:H,MATCH($A$1&\"_\"&ROW()-2,BdD!$K:$K,0)),\"\")","v":""},{"$f":"IF(COUNTIF(BdD!$A:$A,$A$1)>ROW()-1,INDEX(BdD!I:I,MATCH($A$1&\"_\"&ROW()-2,BdD!$K:$K,0)),\"\")","v":""}]
[{"$f":"IF(COUNTIF(BdD!$A:$A,$A$1)>ROW()-1,INDEX(BdD!B:B,MATCH($A$1&\"_\"&ROW()-2,BdD!$K:$K,0)),\"\")","v":""},{"$f":"IF(COUNTIF(BdD!$A:$A,$A$1)>ROW()-1,INDEX(BdD!C:C,MATCH($A$1&\"_\"&ROW()-2,BdD!$K:$K,0)),\"\")","v":""},{"$f":"IF(COUNTIF(BdD!$A:$A,$A$1)>ROW()-1,INDEX(BdD!D:D,MATCH($A$1&\"_\"&ROW()-2,BdD!$K:$K,0)),\"\")","v":""},{"$f":"IF(COUNTIF(BdD!$A:$A,$A$1)>ROW()-1,INDEX(BdD!E:E,MATCH($A$1&\"_\"&ROW()-2,BdD!$K:$K,0)),\"\")","v":""},{"$f":"IF(COUNTIF(BdD!$A:$A,$A$1)>ROW()-1,INDEX(BdD!F:F,MATCH($A$1&\"_\"&ROW()-2,BdD!$K:$K,0)),\"\")","v":""},{"$f":"IF(COUNTIF(BdD!$A:$A,$A$1)>ROW()-1,INDEX(BdD!G:G,MATCH($A$1&\"_\"&ROW()-2,BdD!$K:$K,0)),\"\")","v":""},{"$f":"IF(COUNTIF(BdD!$A:$A,$A$1)>ROW()-1,INDEX(BdD!H:H,MATCH($A$1&\"_\"&ROW()-2,BdD!$K:$K,0)),\"\")","v":""},{"$f":"IF(COUNTIF(BdD!$A:$A,$A$1)>ROW()-1,INDEX(BdD!I:I,MATCH($A$1&\"_\"&ROW()-2,BdD!$K:$K,0)),\"\")","v":""}]
[{"$f":"IF(COUNTIF(BdD!$A:$A,$A$1)>ROW()-1,INDEX(BdD!B:B,MATCH($A$1&\"_\"&ROW()-2,BdD!$K:$K,0)),\"\")","v":""},{"$f":"IF(COUNTIF(BdD!$A:$A,$A$1)>ROW()-1,INDEX(BdD!C:C,MATCH($A$1&\"_\"&ROW()-2,BdD!$K:$K,0)),\"\")","v":""},{"$f":"IF(COUNTIF(BdD!$A:$A,$A$1)>ROW()-1,INDEX(BdD!D:D,MATCH($A$1&\"_\"&ROW()-2,BdD!$K:$K,0)),\"\")","v":""},{"$f":"IF(COUNTIF(BdD!$A:$A,$A$1)>ROW()-1,INDEX(BdD!E:E,MATCH($A$1&\"_\"&ROW()-2,BdD!$K:$K,0)),\"\")","v":""},{"$f":"IF(COUNTIF(BdD!$A:$A,$A$1)>ROW()-1,INDEX(BdD!F:F,MATCH($A$1&\"_\"&ROW()-2,BdD!$K:$K,0)),\"\")","v":""},{"$f":"IF(COUNTIF(BdD!$A:$A,$A$1)>ROW()-1,INDEX(BdD!G:G,MATCH($A$1&\"_\"&ROW()-2,BdD!$K:$K,0)),\"\")","v":""},{"$f":"IF(COUNTIF(BdD!$A:$A,$A$1)>ROW()-1,INDEX(BdD!H:H,MATCH($A$1&\"_\"&ROW()-2,BdD!$K:$K,0)),\"\")","v":""},{"$f":"IF(COUNTIF(BdD!$A:$A,$A$1)>ROW()-1,INDEX(BdD!I:I,MATCH($A$1&\"_\"&ROW()-2,BdD!$K:$K,0)),\"\")","v":""}]
[{"$f":"IF(COUNTIF(BdD!$A:$A,$A$1)>ROW()-1,INDEX(BdD!B:B,MATCH($A$1&\"_\"&ROW()-2,BdD!$K:$K,0)),\"\")","v":""},{"$f":"IF(COUNTIF(BdD!$A:$A,$A$1)>ROW()-1,INDEX(BdD!C:C,MATCH($A$1&\"_\"&ROW()-2,BdD!$K:$K,0)),\"\")","v":""},{"$f":"IF(COUNTIF(BdD!$A:$A,$A$1)>ROW()-1,INDEX(BdD!D:D,MATCH($A$1&\"_\"&ROW()-2,BdD!$K:$K,0)),\"\")","v":""},{"$f":"IF(COUNTIF(BdD!$A:$A,$A$1)>ROW()-1,INDEX(BdD!E:E,MATCH($A$1&\"_\"&ROW()-2,BdD!$K:$K,0)),\"\")","v":""},{"$f":"IF(COUNTIF(BdD!$A:$A,$A$1)>ROW()-1,INDEX(BdD!F:F,MATCH($A$1&\"_\"&ROW()-2,BdD!$K:$K,0)),\"\")","v":""},{"$f":"IF(COUNTIF(BdD!$A:$A,$A$1)>ROW()-1,INDEX(BdD!G:G,MATCH($A$1&\"_\"&ROW()-2,BdD!$K:$K,0)),\"\")","v":""},{"$f":"IF(COUNTIF(BdD!$A:$A,$A$1)>ROW()-1,INDEX(BdD!H:H,MATCH($A$1&\"_\"&ROW()-2,BdD!$K:$K,0)),\"\")","v":""},{"$f":"IF(COUNTIF(BdD!$A:$A,$A$1)>ROW()-1,INDEX(BdD!I:I,MATCH($A$1&\"_\"&ROW()-2,BdD!$K:$K,0)),\"\")","v":""}]
[{"$f":"IF(COUNTIF(BdD!$A:$A,$A$1)>ROW()-1,INDEX(BdD!B:B,MATCH($A$1&\"_\"&ROW()-2,BdD!$K:$K,0)),\"\")","v":""},{"$f":"IF(COUNTIF(BdD!$A:$A,$A$1)>ROW()-1,INDEX(BdD!C:C,MATCH($A$1&\"_\"&ROW()-2,BdD!$K:$K,0)),\"\")","v":""},{"$f":"IF(COUNTIF(BdD!$A:$A,$A$1)>ROW()-1,INDEX(BdD!D:D,MATCH($A$1&\"_\"&ROW()-2,BdD!$K:$K,0)),\"\")","v":""},{"$f":"IF(COUNTIF(BdD!$A:$A,$A$1)>ROW()-1,INDEX(BdD!E:E,MATCH($A$1&\"_\"&ROW()-2,BdD!$K:$K,0)),\"\")","v":""},{"$f":"IF(COUNTIF(BdD!$A:$A,$A$1)>ROW()-1,INDEX(BdD!F:F,MATCH($A$1&\"_\"&ROW()-2,BdD!$K:$K,0)),\"\")","v":""},{"$f":"IF(COUNTIF(BdD!$A:$A,$A$1)>ROW()-1,INDEX(BdD!G:G,MATCH($A$1&\"_\"&ROW()-2,BdD!$K:$K,0)),\"\")","v":""},{"$f":"IF(COUNTIF(BdD!$A:$A,$A$1)>ROW()-1,INDEX(BdD!H:H,MATCH($A$1&\"_\"&ROW()-2,BdD!$K:$K,0)),\"\")","v":""},{"$f":"IF(COUNTIF(BdD!$A:$A,$A$1)>ROW()-1,INDEX(BdD!I:I,MATCH($A$1&\"_\"&ROW()-2,BdD!$K:$K,0)),\"\")","v":""}]
[{"$f":"IF(COUNTIF(BdD!$A:$A,$A$1)>ROW()-1,INDEX(BdD!B:B,MATCH($A$1&\"_\"&ROW()-2,BdD!$K:$K,0)),\"\")","v":""},{"$f":"IF(COUNTIF(BdD!$A:$A,$A$1)>ROW()-1,INDEX(BdD!C:C,MATCH($A$1&\"_\"&ROW()-2,BdD!$K:$K,0)),\"\")","v":""},{"$f":"IF(COUNTIF(BdD!$A:$A,$A$1)>ROW()-1,INDEX(BdD!D:D,MATCH($A$1&\"_\"&ROW()-2,BdD!$K:$K,0)),\"\")","v":""},{"$f":"IF(COUNTIF(BdD!$A:$A,$A$1)>ROW()-1,INDEX(BdD!E:E,MATCH($A$1&\"_\"&ROW()-2,BdD!$K:$K,0)),\"\")","v":""},{"$f":"IF(COUNTIF(BdD!$A:$A,$A$1)>ROW()-1,INDEX(BdD!F:F,MATCH($A$1&\"_\"&ROW()-2,BdD!$K:$K,0)),\"\")","v":""},{"$f":"IF(COUNTIF(BdD!$A:$A,$A$1)>ROW()-1,INDEX(BdD!G:G,MATCH($A$1&\"_\"&ROW()-2,BdD!$K:$K,0)),\"\")","v":""},{"$f":"IF(COUNTIF(BdD!$A:$A,$A$1)>ROW()-1,INDEX(BdD!H:H,MATCH($A$1&\"_\"&ROW()-2,BdD!$K:$K,0)),\"\")","v":""},{"$f":"IF(COUNTIF(BdD!$A:$A,$A$1)>ROW()-1,INDEX(BdD!I:I,MATCH($A$1&\"_\"&ROW()-2,BdD!$K:$K,0)),\"\")","v":""}]
[{"$f":"IF(COUNTIF(BdD!$A:$A,$A$1)>ROW()-1,INDEX(BdD!B:B,MATCH($A$1&\"_\"&ROW()-2,BdD!$K:$K,0)),\"\")","v":""},{"$f":"IF(COUNTIF(BdD!$A:$A,$A$1)>ROW()-1,INDEX(BdD!C:C,MATCH($A$1&\"_\"&ROW()-2,BdD!$K:$K,0)),\"\")","v":""},{"$f":"IF(COUNTIF(BdD!$A:$A,$A$1)>ROW()-1,INDEX(BdD!D:D,MATCH($A$1&\"_\"&ROW()-2,BdD!$K:$K,0)),\"\")","v":""},{"$f":"IF(COUNTIF(BdD!$A:$A,$A$1)>ROW()-1,INDEX(BdD!E:E,MATCH($A$1&\"_\"&ROW()-2,BdD!$K:$K,0)),\"\")","v":""},{"$f":"IF(COUNTIF(BdD!$A:$A,$A$1)>ROW()-1,INDEX(BdD!F:F,MATCH($A$1&\"_\"&ROW()-2,BdD!$K:$K,0)),\"\")","v":""},{"$f":"IF(COUNTIF(BdD!$A:$A,$A$1)>ROW()-1,INDEX(BdD!G:G,MATCH($A$1&\"_\"&ROW()-2,BdD!$K:$K,0)),\"\")","v":""},{"$f":"IF(COUNTIF(BdD!$A:$A,$A$1)>ROW()-1,INDEX(BdD!H:H,MATCH($A$1&\"_\"&ROW()-2,BdD!$K:$K,0)),\"\")","v":""},{"$f":"IF(COUNTIF(BdD!$A:$A,$A$1)>ROW()-1,INDEX(BdD!I:I,MATCH($A$1&\"_\"&ROW()-2,BdD!$K:$K,0)),\"\")","v":""}]
[{"$f":"IF(COUNTIF(BdD!$A:$A,$A$1)>ROW()-1,INDEX(BdD!B:B,MATCH($A$1&\"_\"&ROW()-2,BdD!$K:$K,0)),\"\")","v":""},{"$f":"IF(COUNTIF(BdD!$A:$A,$A$1)>ROW()-1,INDEX(BdD!C:C,MATCH($A$1&\"_\"&ROW()-2,BdD!$K:$K,0)),\"\")","v":""},{"$f":"IF(COUNTIF(BdD!$A:$A,$A$1)>ROW()-1,INDEX(BdD!D:D,MATCH($A$1&\"_\"&ROW()-2,BdD!$K:$K,0)),\"\")","v":""},{"$f":"IF(COUNTIF(BdD!$A:$A,$A$1)>ROW()-1,INDEX(BdD!E:E,MATCH($A$1&\"_\"&ROW()-2,BdD!$K:$K,0)),\"\")","v":""},{"$f":"IF(COUNTIF(BdD!$A:$A,$A$1)>ROW()-1,INDEX(BdD!F:F,MATCH($A$1&\"_\"&ROW()-2,BdD!$K:$K,0)),\"\")","v":""},{"$f":"IF(COUNTIF(BdD!$A:$A,$A$1)>ROW()-1,INDEX(BdD!G:G,MATCH($A$1&\"_\"&ROW()-2,BdD!$K:$K,0)),\"\")","v":""},{"$f":"IF(COUNTIF(BdD!$A:$A,$A$1)>ROW()-1,INDEX(BdD!H:H,MATCH($A$1&\"_\"&ROW()-2,BdD!$K:$K,0)),\"\")","v":""},{"$f":"IF(COUNTIF(BdD!$A:$A,$A$1)>ROW()-1,INDEX(BdD!I:I,MATCH($A$1&\"_\"&ROW()-2,BdD!$K:$K,0)),\"\")","v":""}]
[{"$f":"IF(COUNTIF(BdD!$A:$A,$A$1)>ROW()-1,INDEX(BdD!B:B,MATCH($A$1&\"_\"&ROW()-2,BdD!$K:$K,0)),\"\")","v":""},{"$f":"IF(COUNTIF(BdD!$A:$A,$A$1)>ROW()-1,INDEX(BdD!C:C,MATCH($A$1&\"_\"&ROW()-2,BdD!$K:$K,0)),\"\")","v":""},{"$f":"IF(COUNTIF(BdD!$A:$A,$A$1)>ROW()-1,INDEX(BdD!D:D,MATCH($A$1&\"_\"&ROW()-2,BdD!$K:$K,0)),\"\")","v":""},{"$f":"IF(COUNTIF(BdD!$A:$A,$A$1)>ROW()-1,INDEX(BdD!E:E,MATCH($A$1&\"_\"&ROW()-2,BdD!$K:$K,0)),\"\")","v":""},{"$f":"IF(COUNTIF(BdD!$A:$A,$A$1)>ROW()-1,INDEX(BdD!F:F,MATCH($A$1&\"_\"&ROW()-2,BdD!$K:$K,0)),\"\")","v":""},{"$f":"IF(COUNTIF(BdD!$A:$A,$A$1)>ROW()-1,INDEX(BdD!G:G,MATCH($A$1&\"_\"&ROW()-2,BdD!$K:$K,0)),\"\")","v":""},{"$f":"IF(COUNTIF(BdD!$A:$A,$A$1)>ROW()-1,INDEX(BdD!H:H,MATCH($A$1&\"_\"&ROW()-2,BdD!$K:$K,0)),\"\")","v":""},{"$f":"IF(COUNTIF(BdD!$A:$A,$A$1)>ROW()-1,INDEX(BdD!I:I,MATCH($A$1&\"_\"&ROW()-2,BdD!$K:$K,0)),\"\")","v":""}]
[{"$f":"IF(COUNTIF(BdD!$A:$A,$A$1)>ROW()-1,INDEX(BdD!B:B,MATCH($A$1&\"_\"&ROW()-2,BdD!$K:$K,0)),\"\")","v":""},{"$f":"IF(COUNTIF(BdD!$A:$A,$A$1)>ROW()-1,INDEX(BdD!C:C,MATCH($A$1&\"_\"&ROW()-2,BdD!$K:$K,0)),\"\")","v":""},{"$f":"IF(COUNTIF(BdD!$A:$A,$A$1)>ROW()-1,INDEX(BdD!D:D,MATCH($A$1&\"_\"&ROW()-2,BdD!$K:$K,0)),\"\")","v":""},{"$f":"IF(COUNTIF(BdD!$A:$A,$A$1)>ROW()-1,INDEX(BdD!E:E,MATCH($A$1&\"_\"&ROW()-2,BdD!$K:$K,0)),\"\")","v":""},{"$f":"IF(COUNTIF(BdD!$A:$A,$A$1)>ROW()-1,INDEX(BdD!F:F,MATCH($A$1&\"_\"&ROW()-2,BdD!$K:$K,0)),\"\")","v":""},{"$f":"IF(COUNTIF(BdD!$A:$A,$A$1)>ROW()-1,INDEX(BdD!G:G,MATCH($A$1&\"_\"&ROW()-2,BdD!$K:$K,0)),\"\")","v":""},{"$f":"IF(COUNTIF(BdD!$A:$A,$A$1)>ROW()-1,INDEX(BdD!H:H,MATCH($A$1&\"_\"&ROW()-2,BdD!$K:$K,0)),\"\")","v":""},{"$f":"IF(COUNTIF(BdD!$A:$A,$A$1)>ROW()-1,INDEX(BdD!I:I,MATCH($A$1&\"_\"&ROW()-2,BdD!$K:$K,0)),\"\")","v":""}]
[{"$f":"IF(COUNTIF(BdD!$A:$A,$A$1)>ROW()-1,INDEX(BdD!B:B,MATCH($A$1&\"_\"&ROW()-2,BdD!$K:$K,0)),\"\")","v":""},{"$f":"IF(COUNTIF(BdD!$A:$A,$A$1)>ROW()-1,INDEX(BdD!C:C,MATCH($A$1&\"_\"&ROW()-2,BdD!$K:$K,0)),\"\")","v":""},{"$f":"IF(COUNTIF(BdD!$A:$A,$A$1)>ROW()-1,INDEX(BdD!D:D,MATCH($A$1&\"_\"&ROW()-2,BdD!$K:$K,0)),\"\")","v":""},{"$f":"IF(COUNTIF(BdD!$A:$A,$A$1)>ROW()-1,INDEX(BdD!E:E,MATCH($A$1&\"_\"&ROW()-2,BdD!$K:$K,0)),\"\")","v":""},{"$f":"IF(COUNTIF(BdD!$A:$A,$A$1)>ROW()-1,INDEX(BdD!F:F,MATCH($A$1&\"_\"&ROW()-2,BdD!$K:$K,0)),\"\")","v":""},{"$f":"IF(COUNTIF(BdD!$A:$A,$A$1)>ROW()-1,INDEX(BdD!G:G,MATCH($A$1&\"_\"&ROW()-2,BdD!$K:$K,0)),\"\")","v":""},{"$f":"IF(COUNTIF(BdD!$A:$A,$A$1)>ROW()-1,INDEX(BdD!H:H,MATCH($A$1&\"_\"&ROW()-2,BdD!$K:$K,0)),\"\")","v":""},{"$f":"IF(COUNTIF(BdD!$A:$A,$A$1)>ROW()-1,INDEX(BdD!I:I,MATCH($A$1&\"_\"&ROW()-2,BdD!$K:$K,0)),\"\")","v":""}]
[{"$f":"IF(COUNTIF(BdD!$A:$A,$A$1)>ROW()-1,INDEX(BdD!B:B,MATCH($A$1&\"_\"&ROW()-2,BdD!$K:$K,0)),\"\")","v":""},{"$f":"IF(COUNTIF(BdD!$A:$A,$A$1)>ROW()-1,INDEX(BdD!C:C,MATCH($A$1&\"_\"&ROW()-2,BdD!$K:$K,0)),\"\")","v":""},{"$f":"IF(COUNTIF(BdD!$A:$A,$A$1)>ROW()-1,INDEX(BdD!D:D,MATCH($A$1&\"_\"&ROW()-2,BdD!$K:$K,0)),\"\")","v":""},{"$f":"IF(COUNTIF(BdD!$A:$A,$A$1)>ROW()-1,INDEX(BdD!E:E,MATCH($A$1&\"_\"&ROW()-2,BdD!$K:$K,0)),\"\")","v":""},{"$f":"IF(COUNTIF(BdD!$A:$A,$A$1)>ROW()-1,INDEX(BdD!F:F,MATCH($A$1&\"_\"&ROW()-2,BdD!$K:$K,0)),\"\")","v":""},{"$f":"IF(COUNTIF(BdD!$A:$A,$A$1)>ROW()-1,INDEX(BdD!G:G,MATCH($A$1&\"_\"&ROW()-2,BdD!$K:$K,0)),\"\")","v":""},{"$f":"IF(COUNTIF(BdD!$A:$A,$A$1)>ROW()-1,INDEX(BdD!H:H,MATCH($A$1&\"_\"&ROW()-2,BdD!$K:$K,0)),\"\")","v":""},{"$f":"IF(COUNTIF(BdD!$A:$A,$A$1)>ROW()-1,INDEX(BdD!I:I,MATCH($A$1&\"_\"&ROW()-2,BdD!$K:$K,0)),\"\")","v":""}]
[{"$f":"IF(COUNTIF(BdD!$A:$A,$A$1)>ROW()-1,INDEX(BdD!B:B,MATCH($A$1&\"_\"&ROW()-2,BdD!$K:$K,0)),\"\")","v":""},{"$f":"IF(COUNTIF(BdD!$A:$A,$A$1)>ROW()-1,INDEX(BdD!C:C,MATCH($A$1&\"_\"&ROW()-2,BdD!$K:$K,0)),\"\")","v":""},{"$f":"IF(COUNTIF(BdD!$A:$A,$A$1)>ROW()-1,INDEX(BdD!D:D,MATCH($A$1&\"_\"&ROW()-2,BdD!$K:$K,0)),\"\")","v":""},{"$f":"IF(COUNTIF(BdD!$A:$A,$A$1)>ROW()-1,INDEX(BdD!E:E,MATCH($A$1&\"_\"&ROW()-2,BdD!$K:$K,0)),\"\")","v":""},{"$f":"IF(COUNTIF(BdD!$A:$A,$A$1)>ROW()-1,INDEX(BdD!F:F,MATCH($A$1&\"_\"&ROW()-2,BdD!$K:$K,0)),\"\")","v":""},{"$f":"IF(COUNTIF(BdD!$A:$A,$A$1)>ROW()-1,INDEX(BdD!G:G,MATCH($A$1&\"_\"&ROW()-2,BdD!$K:$K,0)),\"\")","v":""},{"$f":"IF(COUNTIF(BdD!$A:$A,$A$1)>ROW()-1,INDEX(BdD!H:H,MATCH($A$1&\"_\"&ROW()-2,BdD!$K:$K,0)),\"\")","v":""},{"$f":"IF(COUNTIF(BdD!$A:$A,$A$1)>ROW()-1,INDEX(BdD!I:I,MATCH($A$1&\"_\"&ROW()-2,BdD!$K:$K,0)),\"\")","v":""}]

{"sheet":"MONO","index":2,"n_rows":36,"n_cols":8,"rows_kept":36,"cut":false,"hidden":false,"merged":[]}
[null,null,"codage",null,null,null,"valeur cherchée","résultats"]
["Kevin","Cyprés",{"$f":"IF(A2=$G$2,MAX($C$1:C1)+1,\"\")","v":""},null,"Roger",null,"Roger",{"$f":"IF(ROW()-1>MAX(C:C),\"\",INDEX(B:B,MATCH(ROW()-1,C:C,0)))","v":"If"}]
["André","Mélèze",{"$f":"IF(A3=$G$2,MAX($C$1:C2)+1,\"\")","v":""},null,"Paul",null,null,{"$f":"IF(ROW()-1>MAX(C:C),\"\",INDEX(B:B,MATCH(ROW()-1,C:C,0)))","v":"Chêne"}]
["Simone","Cornouiller",{"$f":"IF(A4=$G$2,MAX($C$1:C3)+1,\"\")","v":""},null,"Marcel",null,null,"Bouleau"]
["Marcel","Charme",{"$f":"IF(A5=$G$2,MAX($C$1:C4)+1,\"\")","v":""},null,"André",null,null,"Olivier"]
["Paul","Peuplier",{"$f":"IF(A6=$G$2,MAX($C$1:C5)+1,\"\")","v":""},null,"Kevin",null,null,"Tremble"]
["Roger","If",{"$f":"IF(A7=$G$2,MAX($C$1:C6)+1,\"\")","v":1},null,"Simone",null,null,""]
["Roger","Chêne",{"$f":"IF(A8=$G$2,MAX($C$1:C7)+1,\"\")","v":2},null,null,null,null,""]
["Léa","Saule",{"$f":"IF(A9=$G$2,MAX($C$1:C8)+1,\"\")","v":""},null,null,null,null,""]
["Paul","Baobab",{"$f":"IF(A10=$G$2,MAX($C$1:C9)+1,\"\")","v":""},null,null,null,null,""]
["Kevin","Séquoïa",{"$f":"IF(A11=$G$2,MAX($C$1:C10)+1,\"\")","v":""},null,null,null,null,""]
["Léa","Frêne",{"$f":"IF(A12=$G$2,MAX($C$1:C11)+1,\"\")","v":""},null,null,null,null,""]
["Léa","Epicéa",{"$f":"IF(A13=$G$2,MAX($C$1:C12)+1,\"\")","v":""},null,null,null,null,""]
["Roger","Bouleau",{"$f":"IF(A14=$G$2,MAX($C$1:C13)+1,\"\")","v":3},null,null,null,null,""]
["Kevin","Frêne",{"$f":"IF(A15=$G$2,MAX($C$1:C14)+1,\"\")","v":""},null,null,null,null,""]
["Paul","Murier",{"$f":"IF(A16=$G$2,MAX($C$1:C15)+1,\"\")","v":""},null,null,null,null,""]
["Simone","Sorbier",{"$f":"IF(A17=$G$2,MAX($C$1:C16)+1,\"\")","v":""},null,null,null,null,""]
["André","Erable",{"$f":"IF(A18=$G$2,MAX($C$1:C17)+1,\"\")","v":""},null,null,null,null,""]
["Léa","Noyer",{"$f":"IF(A19=$G$2,MAX($C$1:C18)+1,\"\")","v":""},null,null,null,null,""]
["Kevin","Bouleau",{"$f":"IF(A20=$G$2,MAX($C$1:C19)+1,\"\")","v":""},null,null,null,null,""]
["Marcel","Orme",{"$f":"IF(A21=$G$2,MAX($C$1:C20)+1,\"\")","v":""},null,null,null,null,""]
["André","Sorbier",{"$f":"IF(A22=$G$2,MAX($C$1:C21)+1,\"\")","v":""},null,null,null,null,""]
["Kevin","Platane",{"$f":"IF(A23=$G$2,MAX($C$1:C22)+1,\"\")","v":""},null,null,null,null,""]
["Simone","Sycomore",{"$f":"IF(A24=$G$2,MAX($C$1:C23)+1,\"\")","v":""}]
["Simone","Palmier",{"$f":"IF(A25=$G$2,MAX($C$1:C24)+1,\"\")","v":""}]
["Marcel","Tuyas",{"$f":"IF(A26=$G$2,MAX($C$1:C25)+1,\"\")","v":""}]
["Roger","Olivier",{"$f":"IF(A27=$G$2,MAX($C$1:C26)+1,\"\")","v":4}]
["Simone","Chêne",{"$f":"IF(A28=$G$2,MAX($C$1:C27)+1,\"\")","v":""}]
["Léa","Platane",{"$f":"IF(A29=$G$2,MAX($C$1:C28)+1,\"\")","v":""}]
["André","Epicéa",{"$f":"IF(A30=$G$2,MAX($C$1:C29)+1,\"\")","v":""}]
["Marcel","Orme",{"$f":"IF(A31=$G$2,MAX($C$1:C30)+1,\"\")","v":""}]
["André","Pin",{"$f":"IF(A32=$G$2,MAX($C$1:C31)+1,\"\")","v":""}]
["Paul","Mélèze",{"$f":"IF(A33=$G$2,MAX($C$1:C32)+1,\"\")","v":""}]
["Roger","Tremble",{"$f":"IF(A34=$G$2,MAX($C$1:C33)+1,\"\")","v":5}]
["Paul","Pin",{"$f":"IF(A35=$G$2,MAX($C$1:C34)+1,\"\")","v":""}]
["Marcel","Hêtre",{"$f":"IF(A36=$G$2,MAX($C$1:C35)+1,\"\")","v":""}]