{"text_format":"1","workbook":"xlsx","n_sheets":14,"sheets":["BD","An","Janvier","Février","Mars","Avril","Mai","Juin","Juillet","Août","Septembre","Octobre","Novembre","Décembre"],"not_rendered":{"charts":0,"images":4,"macros":1,"external_links":0,"defined_names":165,"comments":0,"pivot_tables":0},"unopened":[],"bounds":{"document_bytes":16777216,"sheet_cells":100000,"rows_first":2000,"rows_last":500,"rows_between":2000,"halvings":0,"cell_chars":16384,"cell_head_chars":4096},"cells_cut":0,"cells_raw":0,"read":"whole","date_system":"1900"}

{"sheet":"BD","index":0,"n_rows":3,"n_cols":13,"rows_kept":3,"cut":false,"hidden":false,"merged":[]}
["Nom","Prénom","Adresse","CP","Ville","telephone","Permis","Validité du permis","Vehicule","Pris le","Prévue","restitué","Durée prev"]
["GERAC","PAUL",null,null,null,null,null,null,null,"2014-02-04","2014-02-05",null,"2 Jour(s)"]
["MARCEL","BEN HUR",null,null,null,null,null,null,null,"2014-02-05","2014-02-07",null,"3  Jours"]

{"sheet":"An","index":1,"n_rows":43,"n_cols":26,"rows_kept":43,"cut":false,"hidden":false,"merged":[[44,0,44,16],[46,0,46,4],[46,6,46,10],[46,12,46,16],[35,0,35,6],[35,8,35,14],[35,16,35,22],[43,16,43,22],[43,0,43,14],[17,0,17,6],[17,8,17,14],[17,16,17,22],[26,0,26,6],[26,8,26,14],[26,16,26,22],[6,0,6,22],[8,0,8,6],[8,8,8,14],[5,0,5,22],[0,0,0,25],[1,0,1,15],[2,0,2,2],[2,4,2,6],[2,8,2,10],[2,16,2,22],[3,0,3,2],[3,4,3,6],[3,8,3,10],[3,11,3,14],[3,16,3,21],[8,16,8,22]]}
[]
[]
["An",null,null,null,"Mois",null,null,null,"premier jour",null,null,null,null,null,null,null,"Calendrier Titre"]
[2014,null,null,null,1,null,null,null,1,null,null,"1:di, 2:lu"]
["Note : Les calendriers mensuels montrent seulement le premier 2 vacances/événements par le jour de la liste au dessous. "]
[{"$f":"IF(Q4=\"\",\"\",Q4)","v":""}]
[{"$f":"IF(A4,A4&\"\")","v":"2014"}]
[]
[{"$f":"DATE($A$4,$E$4,1)","v":"2014-01-01"},null,null,null,null,null,null,null,{"$f":"DATE(YEAR(A9),MONTH(A9)+1,1)","v":"2014-02-01"},null,null,null,null,null,null,null,{"$f":"DATE(YEAR(I9),MONTH(I9)+1,1)","v":"2014-03-01"},null,null,null,null,null,null,null,"Date","Vacances ou Evénement"]
[{"$f":"INDEX({\"di\";\"lu\";\"ma\";\"me\";\"je\";\"ve\";\"sa\"},1+MOD($I$4+1-2,7))","v":"di"},{"$f":"INDEX({\"di\";\"lu\";\"ma\";\"me\";\"je\";\"ve\";\"sa\"},1+MOD($I$4+2-2,7))","v":"lu"},{"$f":"INDEX({\"di\";\"lu\";\"ma\";\"me\";\"je\";\"ve\";\"sa\"},1+MOD($I$4+3-2,7))","v":"ma"},{"$f":"INDEX({\"di\";\"lu\";\"ma\";\"me\";\"je\";\"ve\";\"sa\"},1+MOD($I$4+4-2,7))","v":"me"},{"$f":"INDEX({\"di\";\"lu\";\"ma\";\"me\";\"je\";\"ve\";\"sa\"},1+MOD($I$4+5-2,7))","v":"je"},{"$f":"INDEX({\"di\";\"lu\";\"ma\";\"me\";\"je\";\"ve\";\"sa\"},1+MOD($I$4+6-2,7))","v":"ve"},{"$f":"INDEX({\"di\";\"lu\";\"ma\";\"me\";\"je\";\"ve\";\"sa\"},1+MOD($I$4+7-2,7))","v":"sa"},null,{"$f":"$A$10","v":"di"},{"$f":"$B$10","v":"lu"},{"$f":"$C$10","v":"ma"},{"$f":"$D$10","v":"me"},{"$f":"$E$10","v":"je"},{"$f":"$F$10","v":"ve"},{"$f":"$G$10","v":"sa"},null,{"$f":"$A$10","v":"di"},{"$f":"$B$10","v":"lu"},{"$f":"$C$10","v":"ma"},{"$f":"$D$10","v":"me"},{"$f":"$E$10","v":"je"},{"$f":"$F$10","v":"ve"},{"$f":"$G$10","v":"sa"}]
[{"$f":"IF(MONTH($A$9)<>MONTH($A$9-(WEEKDAY($A$9,1)-($I$4-1))-IF((WEEKDAY($A$9,1)-($I$4-1))<=0,7,0)+(ROW(A11)-ROW($A$11))*7+(COLUMN(A11)-COLUMN($A$11)+1)),\"\",$A$9-(WEEKDAY($A$9,1)-($I$4-1))-IF((WEEKDAY($A$9,1)-($I$4-1))<=0,7,0)+(ROW(A11)-ROW($A$11))*7+(COLUMN(A11)-COLUMN($A$11)+1))","v":""},"","","2014-01-01","2014-01-02","2014-01-03","2014-01-04",null,{"$f":"IF(MONTH($I$9)<>MONTH($I$9-(WEEKDAY($I$9,1)-($I$4-1))-IF((WEEKDAY($I$9,1)-($I$4-1))<=0,7,0)+(ROW(I11)-ROW($I$11))*7+(COLUMN(I11)-COLUMN($I$11)+1)),\"\",$I$9-(WEEKDAY($I$9,1)-($I$4-1))-IF((WEEKDAY($I$9,1)-($I$4-1))<=0,7,0)+(ROW(I11)-ROW($I$11))*7+(COLUMN(I11)-COLUMN($I$11)+1))","v":""},"","","","","","2014-02-01",null,{"$f":"IF(MONTH($Q$9)<>MONTH($Q$9-(WEEKDAY($Q$9,1)-($I$4-1))-IF((WEEKDAY($Q$9,1)-($I$4-1))<=0,7,0)+(ROW(Q11)-ROW($Q$11))*7+(COLUMN(Q11)-COLUMN($Q$11)+1)),\"\",$Q$9-(WEEKDAY($Q$9,1)-($I$4-1))-IF((WEEKDAY($Q$9,1)-($I$4-1))<=0,7,0)+(ROW(Q11)-ROW($Q$11))*7+(COLUMN(Q11)-COLUMN($Q$11)+1))","v":""},"","","","","","2014-03-01",null,{"$f":"DATE(Année,1,1)","v":"2014-01-01"},"Premier de l'an "]
["2014-01-05","2014-01-06","2014-01-07","2014-01-08","2014-01-09","2014-01-10","2014-01-11",null,"2014-02-02","2014-02-03","2014-02-04","2014-02-05","2014-02-06","2014-02-07","2014-02-08",null,"2014-03-02","2014-03-03","2014-03-04","2014-03-05","2014-03-06","2014-03-07","2014-03-08",null,{"$f":"DATE(Année,3,29.56+0.979*MOD(204-11*MOD(Année,19),30)- WEEKDAY(DATE(Année,3,28.56+0.979*MOD(204-11*MOD(Année,19),30))))","v":"2014-04-20"},"Pâques"]
["2014-01-12","2014-01-13","2014-01-14","2014-01-15","2014-01-16","2014-01-17","2014-01-18",null,"2014-02-09","2014-02-10","2014-02-11","2014-02-12","2014-02-13","2014-02-14","2014-02-15",null,"2014-03-09","2014-03-10","2014-03-11","2014-03-12","2014-03-13","2014-03-14","2014-03-15",null,{"$f":"Y12+1","v":"2014-04-21"},"Lundi de Pâques"]
["2014-01-19","2014-01-20","2014-01-21","2014-01-22","2014-01-23","2014-01-24","2014-01-25",null,"2014-02-16","2014-02-17","2014-02-18","2014-02-19","2014-02-20","2014-02-21","2014-02-22",null,"2014-03-16","2014-03-17","2014-03-18","2014-03-19","2014-03-20","2014-03-21","2014-03-22",null,{"$f":"DATE(Année,5,1)","v":"2014-05-01"},"Fête du travail"]
["2014-01-26","2014-01-27","2014-01-28","2014-01-29","2014-01-30","2014-01-31","",null,"2014-02-23","2014-02-24","2014-02-25","2014-02-26","2014-02-27","2014-02-28","",null,"2014-03-23","2014-03-24","2014-03-25","2014-03-26","2014-03-27","2014-03-28","2014-03-29",null,{"$f":"DATE(Année,5,8)","v":"2014-05-08"},"Victoire 1945"]
["","","","","","","",null,"","","","","","","",null,"2014-03-30","2014-03-31","","","","","",null,{"$f":"Y12+39","v":"2014-05-29"},"Ascension"]
[null,null,null,null,null,null,null,null,null,null,null,null,null,null,null,null,null,null,null,null,null,null,null,null,{"$f":"Y12+50","v":"2014-06-09"},"Pentecôte"]
[{"$f":"DATE(YEAR(Q9),MONTH(Q9)+1,1)","v":"2014-04-01"},null,null,null,null,null,null,null,{"$f":"DATE(YEAR(A18),MONTH(A18)+1,1)","v":"2014-05-01"},null,null,null,null,null,null,null,{"$f":"DATE(YEAR(I18),MONTH(I18)+1,1)","v":"2014-06-01"},null,null,null,null,null,null,null,{"$f":"DATE(Année,7,14)","v":"2014-07-14"},"Fête nat."]
[{"$f":"$A$10","v":"di"},{"$f":"$B$10","v":"lu"},{"$f":"$C$10","v":"ma"},{"$f":"$D$10","v":"me"},{"$f":"$E$10","v":"je"},{"$f":"$F$10","v":"ve"},{"$f":"$G$10","v":"sa"},null,{"$f":"$A$10","v":"di"},{"$f":"$B$10","v":"lu"},{"$f":"$C$10","v":"ma"},{"$f":"$D$10","v":"me"},{"$f":"$E$10","v":"je"},{"$f":"$F$10","v":"ve"},{"$f":"$G$10","v":"sa"},null,{"$f":"$A$10","v":"di"},{"$f":"$B$10","v":"lu"},{"$f":"$C$10","v":"ma"},{"$f":"$D$10","v":"me"},{"$f":"$E$10","v":"je"},{"$f":"$F$10","v":"ve"},{"$f":"$G$10","v":"sa"},null,{"$f":"DATE(Année,8,15)","v":"2014-08-15"},"Assomption"]
[{"$f":"IF(MONTH($A$18)<>MONTH($A$18-(WEEKDAY($A$18,1)-($I$4-1))-IF((WEEKDAY($A$18,1)-($I$4-1))<=0,7,0)+(ROW(A20)-ROW($A$20))*7+(COLUMN(A20)-COLUMN($A$20)+1)),\"\",$A$18-(WEEKDAY($A$18,1)-($I$4-1))-IF((WEEKDAY($A$18,1)-($I$4-1))<=0,7,0)+(ROW(A20)-ROW($A$20))*7+(COLUMN(A20)-COLUMN($A$20)+1))","v":""},"","2014-04-01","2014-04-02","2014-04-03","2014-04-04","2014-04-05",null,{"$f":"IF(MONTH($I$18)<>MONTH($I$18-(WEEKDAY($I$18,1)-($I$4-1))-IF((WEEKDAY($I$18,1)-($I$4-1))<=0,7,0)+(ROW(I20)-ROW($I$20))*7+(COLUMN(I20)-COLUMN($I$20)+1)),\"\",$I$18-(WEEKDAY($I$18,1)-($I$4-1))-IF((WEEKDAY($I$18,1)-($I$4-1))<=0,7,0)+(ROW(I20)-ROW($I$20))*7+(COLUMN(I20)-COLUMN($I$20)+1))","v":""},{"$f":"IF(MONTH($I$18)<>MONTH($I$18-(WEEKDAY($I$18,1)-($I$4-1))-IF((WEEKDAY($I$18,1)-($I$4-1))<=0,7,0)+(ROW(J20)-ROW($I$20))*7+(COLUMN(J20)-COLUMN($I$20)+1)),\"\",$I$18-(WEEKDAY($I$18,1)-($I$4-1))-IF((WEEKDAY($I$18,1)-($I$4-1))<=0,7,0)+(ROW(J20)-ROW($I$20))*7+(COLUMN(J20)-COLUMN($I$20)+1))","v":""},"","","2014-05-01","2014-05-02","2014-05-03",null,{"$f":"IF(MONTH($Q$18)<>MONTH($Q$18-(WEEKDAY($Q$18,1)-($I$4-1))-IF((WEEKDAY($Q$18,1)-($I$4-1))<=0,7,0)+(ROW(Q20)-ROW($Q$20))*7+(COLUMN(Q20)-COLUMN($Q$20)+1)),\"\",$Q$18-(WEEKDAY($Q$18,1)-($I$4-1))-IF((WEEKDAY($Q$18,1)-($I$4-1))<=0,7,0)+(ROW(Q20)-ROW($Q$20))*7+(COLUMN(Q20)-COLUMN($Q$20)+1))","v":"2014-06-01"},"2014-06-02","2014-06-03","2014-06-04","2014-06-05","2014-06-06","2014-06-07",null,{"$f":"DATE(Année,11,1)","v":"2014-11-01"},"Toussaint"]
["2014-04-06","2014-04-07","2014-04-08","2014-04-09","2014-04-10","2014-04-11","2014-04-12",null,"2014-05-04","2014-05-05","2014-05-06","2014-05-07","2014-05-08","2014-05-09","2014-05-10",null,"2014-06-08","2014-06-09","2014-06-10","2014-06-11","2014-06-12","2014-06-13","2014-06-14",null,{"$f":"DATE(Année,11,11)","v":"2014-11-11"},"Armistice"]
["2014-04-13","2014-04-14","2014-04-15","2014-04-16","2014-04-17","2014-04-18","2014-04-19",null,"2014-05-11","2014-05-12","2014-05-13","2014-05-14","2014-05-15","2014-05-16","2014-05-17",null,"2014-06-15","2014-06-16","2014-06-17","2014-06-18","2014-06-19","2014-06-20","2014-06-21",null,{"$f":"DATE(Année,12,25)","v":"2014-12-25"},"Noël"]
["2014-04-20","2014-04-21","2014-04-22","2014-04-23","2014-04-24","2014-04-25","2014-04-26",null,"2014-05-18","2014-05-19","2014-05-20","2014-05-21","2014-05-22","2014-05-23","2014-05-24",null,"2014-06-22","2014-06-23","2014-06-24","2014-06-25","2014-06-26","2014-06-27","2014-06-28"]
["2014-04-27","2014-04-28","2014-04-29","2014-04-30","","","",null,"2014-05-25","2014-05-26","2014-05-27","2014-05-28","2014-05-29","2014-05-30","2014-05-31",null,"2014-06-29","2014-06-30","","","","",""]
["","","","","","","",null,"","","","","","","",null,"","","","","","",""]
[]
[{"$f":"DATE(YEAR(Q18),MONTH(Q18)+1,1)","v":"2014-07-01"},null,null,null,null,null,null,null,{"$f":"DATE(YEAR(A27),MONTH(A27)+1,1)","v":"2014-08-01"},null,null,null,null,null,null,null,{"$f":"DATE(YEAR(I27),MONTH(I27)+1,1)","v":"2014-09-01"}]
[{"$f":"$A$10","v":"di"},{"$f":"$B$10","v":"lu"},{"$f":"$C$10","v":"ma"},{"$f":"$D$10","v":"me"},{"$f":"$E$10","v":"je"},{"$f":"$F$10","v":"ve"},{"$f":"$G$10","v":"sa"},null,{"$f":"$A$10","v":"di"},{"$f":"$B$10","v":"lu"},{"$f":"$C$10","v":"ma"},{"$f":"$D$10","v":"me"},{"$f":"$E$10","v":"je"},{"$f":"$F$10","v":"ve"},{"$f":"$G$10","v":"sa"},null,{"$f":"$A$10","v":"di"},{"$f":"$B$10","v":"lu"},{"$f":"$C$10","v":"ma"},{"$f":"$D$10","v":"me"},{"$f":"$E$10","v":"je"},{"$f":"$F$10","v":"ve"},{"$f":"$G$10","v":"sa"}]
[{"$f":"IF(MONTH($A$27)<>MONTH($A$27-(WEEKDAY($A$27,1)-($I$4-1))-IF((WEEKDAY($A$27,1)-($I$4-1))<=0,7,0)+(ROW(A29)-ROW($A$29))*7+(COLUMN(A29)-COLUMN($A$29)+1)),\"\",$A$27-(WEEKDAY($A$27,1)-($I$4-1))-IF((WEEKDAY($A$27,1)-($I$4-1))<=0,7,0)+(ROW(A29)-ROW($A$29))*7+(COLUMN(A29)-COLUMN($A$29)+1))","v":""},"","2014-07-01","2014-07-02","2014-07-03","2014-07-04","2014-07-05",null,{"$f":"IF(MONTH($I$27)<>MONTH($I$27-(WEEKDAY($I$27,1)-($I$4-1))-IF((WEEKDAY($I$27,1)-($I$4-1))<=0,7,0)+(ROW(I29)-ROW($I$29))*7+(COLUMN(I29)-COLUMN($I$29)+1)),\"\",$I$27-(WEEKDAY($I$27,1)-($I$4-1))-IF((WEEKDAY($I$27,1)-($I$4-1))<=0,7,0)+(ROW(I29)-ROW($I$29))*7+(COLUMN(I29)-COLUMN($I$29)+1))","v":""},"","","","","2014-08-01","2014-08-02",null,{"$f":"IF(MONTH($Q$27)<>MONTH($Q$27-(WEEKDAY($Q$27,1)-($I$4-1))-IF((WEEKDAY($Q$27,1)-($I$4-1))<=0,7,0)+(ROW(Q29)-ROW($Q$29))*7+(COLUMN(Q29)-COLUMN($Q$29)+1)),\"\",$Q$27-(WEEKDAY($Q$27,1)-($I$4-1))-IF((WEEKDAY($Q$27,1)-($I$4-1))<=0,7,0)+(ROW(Q29)-ROW($Q$29))*7+(COLUMN(Q29)-COLUMN($Q$29)+1))","v":""},"2014-09-01","2014-09-02","2014-09-03","2014-09-04","2014-09-05","2014-09-06"]
["2014-07-06","2014-07-07","2014-07-08","2014-07-09","2014-07-10","2014-07-11","2014-07-12",null,"2014-08-03","2014-08-04","2014-08-05","2014-08-06","2014-08-07","2014-08-08","2014-08-09",null,"2014-09-07","2014-09-08","2014-09-09","2014-09-10","2014-09-11","2014-09-12","2014-09-13"]
["2014-07-13","2014-07-14","2014-07-15","2014-07-16","2014-07-17","2014-07-18","2014-07-19",null,"2014-08-10","2014-08-11","2014-08-12","2014-08-13","2014-08-14","2014-08-15","2014-08-16",null,"2014-09-14","2014-09-15","2014-09-16","2014-09-17","2014-09-18","2014-09-19","2014-09-20"]
["2014-07-20","2014-07-21","2014-07-22","2014-07-23","2014-07-24","2014-07-25","2014-07-26",null,"2014-08-17","2014-08-18","2014-08-19","2014-08-20","2014-08-21","2014-08-22","2014-08-23",null,"2014-09-21","2014-09-22","2014-09-23","2014-09-24","2014-09-25","2014-09-26","2014-09-27"]
["2014-07-27","2014-07-28","2014-07-29","2014-07-30","2014-07-31","","",null,"2014-08-24","2014-08-25","2014-08-26","2014-08-27","2014-08-28","2014-08-29","2014-08-30",null,"2014-09-28","2014-09-29","2014-09-30","","","",""]
["","","","","","","",null,"2014-08-31","","","","","","",null,"","","","","","",""]
[]
[{"$f":"DATE(YEAR(Q27),MONTH(Q27)+1,1)","v":"2014-10-01"},null,null,null,null,null,null,null,{"$f":"DATE(YEAR(A36),MONTH(A36)+1,1)","v":"2014-11-01"},null,null,null,null,null,null,null,{"$f":"DATE(YEAR(I36),MONTH(I36)+1,1)","v":"2014-12-01"},null,null,null,null,null,null,"[42]"]
[{"$f":"$A$10","v":"di"},{"$f":"$B$10","v":"lu"},{"$f":"$C$10","v":"ma"},{"$f":"$D$10","v":"me"},{"$f":"$E$10","v":"je"},{"$f":"$F$10","v":"ve"},{"$f":"$G$10","v":"sa"},null,{"$f":"$A$10","v":"di"},{"$f":"$B$10","v":"lu"},{"$f":"$C$10","v":"ma"},{"$f":"$D$10","v":"me"},{"$f":"$E$10","v":"je"},{"$f":"$F$10","v":"ve"},{"$f":"$G$10","v":"sa"},null,{"$f":"$A$10","v":"di"},{"$f":"$B$10","v":"lu"},{"$f":"$C$10","v":"ma"},{"$f":"$D$10","v":"me"},{"$f":"$E$10","v":"je"},{"$f":"$F$10","v":"ve"},{"$f":"$G$10","v":"sa"}]
[{"$f":"IF(MONTH($A$36)<>MONTH($A$36-(WEEKDAY($A$36,1)-($I$4-1))-IF((WEEKDAY($A$36,1)-($I$4-1))<=0,7,0)+(ROW(A38)-ROW($A$38))*7+(COLUMN(A38)-COLUMN($A$38)+1)),\"\",$A$36-(WEEKDAY($A$36,1)-($I$4-1))-IF((WEEKDAY($A$36,1)-($I$4-1))<=0,7,0)+(ROW(A38)-ROW($A$38))*7+(COLUMN(A38)-COLUMN($A$38)+1))","v":""},"","","2014-10-01","2014-10-02","2014-10-03","2014-10-04",null,{"$f":"IF(MONTH($I$36)<>MONTH($I$36-(WEEKDAY($I$36,1)-($I$4-1))-IF((WEEKDAY($I$36,1)-($I$4-1))<=0,7,0)+(ROW(I38)-ROW($I$38))*7+(COLUMN(I38)-COLUMN($I$38)+1)),\"\",$I$36-(WEEKDAY($I$36,1)-($I$4-1))-IF((WEEKDAY($I$36,1)-($I$4-1))<=0,7,0)+(ROW(I38)-ROW($I$38))*7+(COLUMN(I38)-COLUMN($I$38)+1))","v":""},"","","","","","2014-11-01",null,{"$f":"IF(MONTH($Q$36)<>MONTH($Q$36-(WEEKDAY($Q$36,1)-($I$4-1))-IF((WEEKDAY($Q$36,1)-($I$4-1))<=0,7,0)+(ROW(Q38)-ROW($Q$38))*7+(COLUMN(Q38)-COLUMN($Q$38)+1)),\"\",$Q$36-(WEEKDAY($Q$36,1)-($I$4-1))-IF((WEEKDAY($Q$36,1)-($I$4-1))<=0,7,0)+(ROW(Q38)-ROW($Q$38))*7+(COLUMN(Q38)-COLUMN($Q$38)+1))","v":""},"2014-12-01","2014-12-02","2014-12-03","2014-12-04","2014-12-05","2014-12-06"]
["2014-10-05","2014-10-06","2014-10-07","2014-10-08","2014-10-09","2014-10-10","2014-10-11",null,"2014-11-02","2014-11-03","2014-11-04","2014-11-05","2014-11-06","2014-11-07","2014-11-08",null,"2014-12-07","2014-12-08","2014-12-09","2014-12-10","2014-12-11","2014-12-12","2014-12-13"]
["2014-10-12","2014-10-13","2014-10-14","2014-10-15","2014-10-16","2014-10-17","2014-10-18",null,"2014-11-09","2014-11-10","2014-11-11","2014-11-12","2014-11-13","2014-11-14","2014-11-15",null,"2014-12-14","2014-12-15","2014-12-16","2014-12-17","2014-12-18","2014-12-19","2014-12-20"]
["2014-10-19","2014-10-20","2014-10-21","2014-10-22","2014-10-23","2014-10-24","2014-10-25",null,"2014-11-16","2014-11-17","2014-11-18","2014-11-19","2014-11-20","2014-11-21","2014-11-22",null,"2014-12-21","2014-12-22","2014-12-23","2014-12-24","2014-12-25","2014-12-26","2014-12-27"]
["2014-10-26","2014-10-27","2014-10-28","2014-10-29","2014-10-30","2014-10-31","",null,"2014-11-23","2014-11-24","2014-11-25","2014-11-26","2014-11-27","2014-11-28","2014-11-29",null,"2014-12-28","2014-12-29","2014-12-30","2014-12-31","","",""]
["","","","","","","",null,"2014-11-30","","","","","","",null,"","","","","","",""]

{"sheet":"Janvier","index":2,"n_rows":100,"n_cols":65,"rows_kept":100,"cut":false,"hidden":false,"merged":[[4,48,4,49],[4,50,4,51],[1,47,1,49],[1,55,1,59],[1,60,1,62],[1,16,1,20],[1,21,1,23],[1,29,1,33],[1,34,1,36],[4,52,4,53],[4,54,4,55],[4,56,4,57],[4,58,4,59],[4,28,4,29],[4,30,4,31],[4,16,4,17],[4,18,4,19],[4,20,4,21],[4,22,4,23],[4,24,4,25],[4,60,4,61],[4,62,4,63],[4,40,4,41],[4,42,4,43],[4,44,4,45],[4,46,4,47],[3,34,3,35],[3,36,3,37],[3,38,3,39],[3,40,3,41],[3,42,3,43],[3,28,3,29],[3,30,3,31],[3,32,3,33],[1,3,1,7],[1,8,1,10],[3,10,3,11],[3,2,3,3],[3,4,3,5],[3,6,3,7],[1,42,1,46],[3,58,3,59],[3,60,3,61],[3,8,3,9],[3,26,3,27],[3,12,3,13],[3,14,3,15],[3,16,3,17],[3,18,3,19],[3,20,3,21],[14,0,14,1],[15,0,15,1],[16,0,16,1],[3,62,3,63],[4,2,4,3],[4,4,4,5],[4,6,4,7],[4,8,4,9],[4,10,4,11],[4,12,4,13],[4,14,4,15],[3,46,3,47],[3,48,3,49],[3,50,3,51],[3,52,3,53],[3,54,3,55],[3,56,3,57],[3,44,3,45],[3,22,3,23],[3,24,3,25],[4,32,4,33],[4,34,4,35],[4,36,4,37],[4,38,4,39],[12,0,12,1],[13,0,13,1],[11,0,11,1],[10,0,10,1],[6,0,6,1],[7,0,7,1],[8,0,8,1],[9,0,9,1],[4,26,4,27],[17,0,17,1],[18,0,18,1],[19,0,19,1],[20,0,20,1],[21,0,21,1],[22,0,22,1],[34,0,34,1],[35,0,35,1],[36,0,36,1],[23,0,23,1],[24,0,24,1],[25,0,25,1],[26,0,26,1],[27,0,27,1],[28,0,28,1],[37,0,37,1],[38,0,38,1],[29,0,29,1],[30,0,30,1],[31,0,31,1],[32,0,32,1],[33,0,33,1],[44,0,44,1],[45,0,45,1],[46,0,46,1],[47,0,47,1],[48,0,48,1],[39,0,39,1],[40,0,40,1],[41,0,41,1],[42,0,42,1],[43,0,43,1],[54,0,54,1],[55,0,55,1],[56,0,56,1],[57,0,57,1],[58,0,58,1],[49,0,49,1],[50,0,50,1],[51,0,51,1],[52,0,52,1],[53,0,53,1],[64,0,64,1],[65,0,65,1],[66,0,66,1],[67,0,67,1],[68,0,68,1],[59,0,59,1],[60,0,60,1],[61,0,61,1],[62,0,62,1],[63,0,63,1],[74,0,74,1],[75,0,75,1],[76,0,76,1],[77,0,77,1],[78,0,78,1],[69,0,69,1],[70,0,70,1],[71,0,71,1],[72,0,72,1],[73,0,73,1],[84,0,84,1],[85,0,85,1],[86,0,86,1],[87,0,87,1],[88,0,88,1],[79,0,79,1],[80,0,80,1],[81,0,81,1],[82,0,82,1],[83,0,83,1],[99,0,99,1],[94,0,94,1],[95,0,95,1],[96,0,96,1],[97,0,97,1],[98,0,98,1],[89,0,89,1],[90,0,90,1],[91,0,91,1],[92,0,92,1],[93,0,93,1]]}
[30,{"$f":"C5","v":"2014-01-01"}]
[null,null,null,{"$f":"IF(An!$Q$4=\"\",\"\",An!$Q$4)","v":""},null,null,null,null,{"$f":"An!A9","v":"2014-01-01"},null,null,null,null,"ACCEUIL",null,null,{"$f":"IF(An!$Q$4=\"\",\"\",An!$Q$4)","v":""},null,null,null,null,{"$f":"An!A9","v":"2014-01-01"},null,null,null,null,"ACCEUIL",null,null,{"$f":"IF(An!$Q$4=\"\",\"\",An!$Q$4)","v":""},null,null,null,null,{"$f":"An!A9","v":"2014-01-01"},null,null,null,null,"ACCEUIL",null,null,{"$f":"IF(An!$Q$4=\"\",\"\",An!$Q$4)","v":""},null,null,null,null,{"$f":"An!A9","v":"2014-01-01"},null,null,null,null,"ACCEUIL",null,null,{"$f":"IF(An!$Q$4=\"\",\"\",An!$Q$4)","v":""},null,null,null,null,{"$f":"An!A9","v":"2014-01-01"},null,null,"ACCEUIL"]
[]
[null,null,{"$f":"IF(C5=\"\",\"\",IF(LOOKUP(C5,Fériés)=C5,CHOOSE(WEEKDAY(C5,1),\"Dimanche\",\"Lundi\",\"Mardi\",\"Mercredi\",\"Jeudi\",\"Vendredi\",\"Samedi\",\"\")))","v":"Mercredi"},null,{"$f":"IF(E5=\"\",\"\",IF(LOOKUP(E5,Fériés)=E5,\"\",CHOOSE(WEEKDAY(E5,1),\"Dimanche\",\"Lundi\",\"Mardi\",\"Mercredi\",\"Jeudi\",\"Vendredi\",\"Samedi\")))","v":"Jeudi"},null,"Vendredi",null,"Samedi",null,"Dimanche",null,"Lundi",null,"Mardi",null,"Mercredi",null,{"$f":"IF(S5=\"\",\"\",IF(LOOKUP(S5,Fériés)=S5,\"\",CHOOSE(WEEKDAY(S5,1),\"Dimanche\",\"Lundi\",\"Mardi\",\"Mercredi\",\"Jeudi\",\"Vendredi\",\"Samedi\")))","v":"Jeudi"},null,"Vendredi",null,"Samedi",null,"Dimanche",null,"Lundi",null,"Mardi",null,"Mercredi",null,{"$f":"IF(AG5=\"\",\"\",IF(LOOKUP(AG5,Fériés)=AG5,\"\",CHOOSE(WEEKDAY(AG5,1),\"Dimanche\",\"Lundi\",\"Mardi\",\"Mercredi\",\"Jeudi\",\"Vendredi\",\"Samedi\")))","v":"Jeudi"},null,{"$f":"IF(AI5=\"\",\"\",IF(LOOKUP(AI5,Fériés)=AI5,\"\",CHOOSE(WEEKDAY(AI5,1),\"Dimanche\",\"Lundi\",\"Mardi\",\"Mercredi\",\"Jeudi\",\"Vendredi\",\"Samedi\")))","v":"Vendredi"},null,"Samedi",null,"Dimanche",null,"Lundi",null,"Mardi",null,"Mercredi",null,"Jeudi",null,{"$f":"IF(AW5=\"\",\"\",IF(LOOKUP(AW5,Fériés)=AW5,\"\",CHOOSE(WEEKDAY(AW5,1),\"Dimanche\",\"Lundi\",\"Mardi\",\"Mercredi\",\"Jeudi\",\"Vendredi\",\"Samedi\")))","v":"Vendredi"},null,{"$f":"IF(AY5=\"\",\"\",IF(LOOKUP(AY5,Fériés)=AY5,\"\",CHOOSE(WEEKDAY(AY5,1),\"Dimanche\",\"Lundi\",\"Mardi\",\"Mercredi\",\"Jeudi\",\"Vendredi\",\"Samedi\")))","v":"Samedi"},null,"Dimanche",null,"Lundi",null,"Mardi",null,"Mercredi",null,"Jeudi",null,"Vendredi"]
[null,null,{"$f":"DATE(Année,1,1)","v":"2014-01-01"},null,{"$f":"IF(C5=\"\",\"\",IF(MONTH(C5+1)<>MONTH(C5),\"\",C5+1))","v":"2014-01-02"},null,{"$f":"IF(E5=\"\",\"\",IF(MONTH(E5+1)<>MONTH(E5),\"\",E5+1))","v":"2014-01-03"},null,{"$f":"IF(G5=\"\",\"\",IF(MONTH(G5+1)<>MONTH(G5),\"\",G5+1))","v":"2014-01-04"},null,{"$f":"IF(I5=\"\",\"\",IF(MONTH(I5+1)<>MONTH(I5),\"\",I5+1))","v":"2014-01-05"},null,{"$f":"IF(K5=\"\",\"\",IF(MONTH(K5+1)<>MONTH(K5),\"\",K5+1))","v":"2014-01-06"},null,{"$f":"IF(M5=\"\",\"\",IF(MONTH(M5+1)<>MONTH(M5),\"\",M5+1))","v":"2014-01-07"},null,{"$f":"IF(O5=\"\",\"\",IF(MONTH(O5+1)<>MONTH(O5),\"\",O5+1))","v":"2014-01-08"},null,{"$f":"IF(Q5=\"\",\"\",IF(MONTH(Q5+1)<>MONTH(Q5),\"\",Q5+1))","v":"2014-01-09"},null,{"$f":"IF(S5=\"\",\"\",IF(MONTH(S5+1)<>MONTH(S5),\"\",S5+1))","v":"2014-01-10"},null,{"$f":"IF(U5=\"\",\"\",IF(MONTH(U5+1)<>MONTH(U5),\"\",U5+1))","v":"2014-01-11"},null,{"$f":"IF(W5=\"\",\"\",IF(MONTH(W5+1)<>MONTH(W5),\"\",W5+1))","v":"2014-01-12"},null,{"$f":"IF(Y5=\"\",\"\",IF(MONTH(Y5+1)<>MONTH(Y5),\"\",Y5+1))","v":"2014-01-13"},null,{"$f":"IF(AA5=\"\",\"\",IF(MONTH(AA5+1)<>MONTH(AA5),\"\",AA5+1))","v":"2014-01-14"},null,{"$f":"IF(AC5=\"\",\"\",IF(MONTH(AC5+1)<>MONTH(AC5),\"\",AC5+1))","v":"2014-01-15"},null,{"$f":"IF(AE5=\"\",\"\",IF(MONTH(AE5+1)<>MONTH(AE5),\"\",AE5+1))","v":"2014-01-16"},null,{"$f":"IF(AG5=\"\",\"\",IF(MONTH(AG5+1)<>MONTH(AG5),\"\",AG5+1))","v":"2014-01-17"},null,{"$f":"IF(AI5=\"\",\"\",IF(MONTH(AI5+1)<>MONTH(AI5),\"\",AI5+1))","v":"2014-01-18"},null,{"$f":"IF(AK5=\"\",\"\",IF(MONTH(AK5+1)<>MONTH(AK5),\"\",AK5+1))","v":"2014-01-19"},null,{"$f":"IF(AM5=\"\",\"\",IF(MONTH(AM5+1)<>MONTH(AM5),\"\",AM5+1))","v":"2014-01-20"},null,{"$f":"IF(AO5=\"\",\"\",IF(MONTH(AO5+1)<>MONTH(AO5),\"\",AO5+1))","v":"2014-01-21"},null,{"$f":"IF(AQ5=\"\",\"\",IF(MONTH(AQ5+1)<>MONTH(AQ5),\"\",AQ5+1))","v":"2014-01-22"},null,{"$f":"IF(AS5=\"\",\"\",IF(MONTH(AS5+1)<>MONTH(AS5),\"\",AS5+1))","v":"2014-01-23"},null,{"$f":"IF(AU5=\"\",\"\",IF(MONTH(AU5+1)<>MONTH(AU5),\"\",AU5+1))","v":"2014-01-24"},null,{"$f":"IF(AW5=\"\",\"\",IF(MONTH(AW5+1)<>MONTH(AW5),\"\",AW5+1))","v":"2014-01-25"},null,{"$f":"IF(AY5=\"\",\"\",IF(MONTH(AY5+1)<>MONTH(AY5),\"\",AY5+1))","v":"2014-01-26"},null,{"$f":"IF(BA5=\"\",\"\",IF(MONTH(BA5+1)<>MONTH(BA5),\"\",BA5+1))","v":"2014-01-27"},null,{"$f":"IF(BC5=\"\",\"\",IF(MONTH(BC5+1)<>MONTH(BC5),\"\",BC5+1))","v":"2014-01-28"},null,{"$f":"IF(BE5=\"\",\"\",IF(MONTH(BE5+1)<>MONTH(BE5),\"\",BE5+1))","v":"2014-01-29"},null,{"$f":"IF(BG5=\"\",\"\",IF(MONTH(BG5+1)<>MONTH(BG5),\"\",BG5+1))","v":"2014-01-30"},null,{"$f":"IF(BI5=\"\",\"\",IF(MONTH(BI5+1)<>MONTH(BI5),\"\",BI5+1))","v":"2014-01-31"}]
[null,null,"Matin","Après midi","Matin","Après midi","Matin","Après midi","Matin","Après midi","Matin","Après midi","Matin","Après midi","Matin","Après midi","Matin","Après midi","Matin","Après midi","Matin","Après midi","Matin","Après midi","Matin","Après midi","Matin","Après midi","Matin","Après midi","Matin","Après midi","Matin","Après midi","Matin","Après midi","Matin","Après midi","Matin","Après midi","Matin","Après midi","Matin","Après midi","Matin","Après midi","Matin","Après midi","Matin","Après midi","Matin","Après midi","Matin","Après midi","Matin","Après midi","Matin","Après midi",{"$f":"IF(BG5=\"\",\"\",\"Matin\")","v":"Matin"},{"$f":"IF(BG5=\"\",\"\",\"Apres midi\")","v":"Apres midi"},{"$f":"IF(BI5=\"\",\"\",\"Matin\")","v":"Matin"},{"$f":"IF(BI5=\"\",\"\",\"Apres midi\")","v":"Apres midi"},{"$f":"IF(BK5=\"\",\"\",\"Matin\")","v":"Matin"},{"$f":"IF(BK5=\"\",\"\",\"Apres midi\")","v":"Apres midi"}]
[null,null,null,null,null,null,null,null,null,null,null,null,null,null,null,null,null,null,null,null,null,null,null,null,null,null,null,null,null,null,null,null,null,null,null,null,null,null,null,null,null,null,null,null,null,null,null,null,null,null,null,null,null,null,null,null,null,null,null,null,null,null,null,null,{"$f":"COUNTA(C7:BL7)/2","v":0}]
[null,null,null,null,null,null,null,null,null,null,null,null,null,null,null,null,null,null,null,null,null,null,null,null,null,null,null,null,null,null,null,null,null,null,null,null,null,null,null,null,null,null,null,null,null,null,null,null,null,null,null,null,null,null,null,null,null,null,null,null,null,null,null,null,{"$f":"COUNTA(C8:BL8)/2","v":0}]
[null,null,null,null,null,null,null,null,null,null,null,null,null,null,null,null,null,null,null,null,null,null,null,null,null,null,null,null,null,null,null,null,null,null,null,null,null,null,null,null,null,null,null,null,null,null,null,null,null,null,null,null,null,null,null,null,null,null,null,null,null,null,null,null,0]
[null,null,null,null,null,null,null,null,null,null,null,null,null,null,null,null,null,null,null,null,null,null,null,null,null,null,null,null,null,null,null,null,null,null,null,null,null,null,null,null,null,null,null,null,null,null,null,null,null,null,null,null,null,null,null,null,null,null,null,null,null,null,null,null,0]
[null,null,null,null,null,null,null,null,null,null,null,null,null,null,null,null,null,null,null,null,null,null,null,null,null,null,null,null,null,null,null,null,null,null,null,null,null,null,null,null,null,null,null,null,null,null,null,null,null,null,null,null,null,null,null,null,null,null,null,null,null,null,null,null,0]
[null,null,null,null,null,null,null,null,null,null,null,null,null,null,null,null,null,null,null,null,null,null,null,null,null,null,null,null,null,null,null,null,null,null,null,null,null,null,null,null,null,null,null,null,null,null,null,null,null,null,null,null,null,null,null,null,null,null,null,null,null,null,null,null,0]
[null,null,null,null,null,null,null,null,null,null,null,null,null,null,null,null,null,null,null,null,null,null,null,null,null,null,null,null,null,null,null,null,null,null,null,null,null,null,null,null,null,null,null,null,null,null,null,null,null,null,null,null,null,null,null,null,null,null,null,null,null,null,null,null,0]
[null,null,null,null,null,null,null,null,null,null,null,null,null,null,null,null,null,null,null,null,null,null,null,null,null,null,null,null,null,null,null,null,null,null,null,null,null,null,null,null,null,null,null,null,null,null,null,null,null,null,null,null,null,null,null,null,null,null,null,null,null,null,null,null,0]
[null,null,null,null,null,null,null,null,null,null,null,null,null,null,null,null,null,null,null,null,null,null,null,null,null,null,null,null,null,null,null,null,null,null,null,null,null,null,null,null,null,null,null,null,null,null,null,null,null,null,null,null,null,null,null,null,null,null,null,null,null,null,null,null,0]
[null,null,null,null,null,null,null,null,null,null,null,null,null,null,null,null,null,null,null,null,null,null,null,null,null,null,null,null,null,null,null,null,null,null,null,null,null,null,null,null,null,null,null,null,null,null,null,null,null,null,null,null,null,null,null,null,null,null,null,null,null,null,null,null,0]
[null,null,null,null,null,null,null,null,null,null,null,null,null,null,null,null,null,null,null,null,null,null,null,null,null,null,null,null,null,null,null,null,null,null,null,null,null,null,null,null,null,null,null,null,null,null,null,null,null,null,null,null,null,null,null,null,null,null,null,null,null,null,null,null,0]
[null,null,null,null,null,null,null,null,null,null,null,null,null,null,null,null,null,null,null,null,null,null,null,null,null,null,null,null,null,null,null,null,null,null,null,null,null,null,null,null,null,null,null,null,null,null,null,null,null,null,null,null,null,null,null,null,null,null,null,null,null,null,null,null,0]
[null,null,null,null,null,null,null,null,null,null,null,null,null,null,null,null,null,null,null,null,null,null,null,null,null,null,null,null,null,null,null,null,null,null,null,null,null,null,null,null,null,null,null,null,null,null,null,null,null,null,null,null,null,null,null,null,null,null,null,null,null,null,null,null,0]
[null,null,null,null,null,null,null,null,null,null,null,null,null,null,null,null,null,null,null,null,null,null,null,null,null,null,null,null,null,null,null,null,null,null,null,null,null,null,null,null,null,null,null,null,null,null,null,null,null,null,null,null,null,null,null,null,null,null,null,null,null,null,null,null,0]
[null,null,null,null,null,null,null,null,null,null,null,null,null,null,null,null,null,null,null,null,null,null,null,null,null,null,null,null,null,null,null,null,null,null,null,null,null,null,null,null,null,null,null,null,null,null,null,null,null,null,null,null,null,null,null,null,null,null,null,null,null,null,null,null,0]
[null,null,null,null,null,null,null,null,null,null,null,null,null,null,null,null,null,null,null,null,null,null,null,null,null,null,null,null,null,null,null,null,null,null,null,null,null,null,null,null,null,null,null,null,null,null,null,null,null,null,null,null,null,null,null,null,null,null,null,null,null,null,null,null,0]
[null,null,null,null,null,null,null,null,null,null,null,null,null,null,null,null,null,null,null,null,null,null,null,null,null,null,null,null,null,null,null,null,null,null,null,null,null,null,null,null,null,null,null,null,null,null,null,null,null,null,null,null,null,null,null,null,null,null,null,null,null,null,null,null,0]
[null,null,null,null,null,null,null,null,null,null,null,null,null,null,null,null,null,null,null,null,null,null,null,null,null,null,null,null,null,null,null,null,null,null,null,null,null,null,null,null,null,null,null,null,null,null,null,null,null,null,null,null,null,null,null,null,null,null,null,null,null,null,null,null,0]
[null,null,null,null,null,null,null,null,null,null,null,null,null,null,null,null,null,null,null,null,null,null,null,null,null,null,null,null,null,null,null,null,null,null,null,null,null,null,null,null,null,null,null,null,null,null,null,null,null,null,null,null,null,null,null,null,null,null,null,null,null,null,null,null,0]
[null,null,null,null,null,null,null,null,null,null,null,null,null,null,null,null,null,null,null,null,null,null,null,null,null,null,null,null,null,null,null,null,null,null,null,null,null,null,null,null,null,null,null,null,null,null,null,null,null,null,null,null,null,null,null,null,null,null,null,null,null,null,null,null,0]
[null,null,null,null,null,null,null,null,null,null,null,null,null,null,null,null,null,null,null,null,null,null,null,null,null,null,null,null,null,null,null,null,null,null,null,null,null,null,null,null,null,null,null,null,null,null,null,null,null,null,null,null,null,null,null,null,null,null,null,null,null,null,null,null,0]
[null,null,null,null,null,null,null,null,null,null,null,null,null,null,null,null,null,null,null,null,null,null,null,null,null,null,null,null,null,null,null,null,null,null,null,null,null,null,null,null,null,null,null,null,null,null,null,null,null,null,null,null,null,null,null,null,null,null,null,null,null,null,null,null,0]
[null,null,null,null,null,null,null,null,null,null,null,null,null,null,null,null,null,null,null,null,null,null,null,null,null,null,null,null,null,null,null,null,null,null,null,null,null,null,null,null,null,null,null,null,null,null,null,null,null,null,null,null,null,null,null,null,null,null,null,null,null,null,null,null,0]
[null,null,null,null,null,null,null,null,null,null,null,null,null,null,null,null,null,null,null,null,null,null,null,null,null,null,null,null,null,null,null,null,null,null,null,null,null,null,null,null,null,null,null,null,null,null,null,null,null,null,null,null,null,null,null,null,null,null,null,null,null,null,null,null,0]
[null,null,null,null,null,null,null,null,null,null,null,null,null,null,null,null,null,null,null,null,null,null,null,null,null,null,null,null,null,null,null,null,null,null,null,null,null,null,null,null,null,null,null,null,null,null,null,null,null,null,null,null,null,null,null,null,null,null,null,null,null,null,null,null,0]
[null,null,null,null,null,null,null,null,null,null,null,null,null,null,null,null,null,null,null,null,null,null,null,null,null,null,null,null,null,null,null,null,null,null,null,null,null,null,null,null,null,null,null,null,null,null,null,null,null,null,null,null,null,null,null,null,null,null,null,null,null,null,null,null,0]
[null,null,null,null,null,null,null,null,null,null,null,null,null,null,null,null,null,null,null,null,null,null,null,null,null,null,null,null,null,null,null,null,null,null,null,null,null,null,null,null,null,null,null,null,null,null,null,null,null,null,null,null,null,null,null,null,null,null,null,null,null,null,null,null,0]
[null,null,null,null,null,null,null,null,null,null,null,null,null,null,null,null,null,null,null,null,null,null,null,null,null,null,null,null,null,null,null,null,null,null,null,null,null,null,null,null,null,null,null,null,null,null,null,null,null,null,null,null,null,null,null,null,null,null,null,null,null,null,null,null,0]
[null,null,null,null,null,null,null,null,null,null,null,null,null,null,null,null,null,null,null,null,null,null,null,null,null,null,null,null,null,null,null,null,null,null,null,null,null,null,null,null,null,null,null,null,null,null,null,null,null,null,null,null,null,null,null,null,null,null,null,null,null,null,null,null,0]
[null,null,null,null,null,null,null,null,null,null,null,null,null,null,null,null,null,null,null,null,null,null,null,null,null,null,null,null,null,null,null,null,null,null,null,null,null,null,null,null,null,null,null,null,null,null,null,null,null,null,null,null,null,null,null,null,null,null,null,null,null,null,null,null,0]
[null,null,null,null,null,null,null,null,null,null,null,null,null,null,null,null,null,null,null,null,null,null,null,null,null,null,null,null,null,null,null,null,null,null,null,null,null,null,null,null,null,null,null,null,null,null,null,null,null,null,null,null,null,null,null,null,null,null,null,null,null,null,null,null,0]
[null,null,null,null,null,null,null,null,null,null,null,null,null,null,null,null,null,null,null,null,null,null,null,null,null,null,null,null,null,null,null,null,null,null,null,null,null,null,null,null,null,null,null,null,null,null,null,null,null,null,null,null,null,null,null,null,null,null,null,null,null,null,null,null,0]
[null,null,null,null,null,null,null,null,null,null,null,null,null,null,null,null,null,null,null,null,null,null,null,null,null,null,null,null,null,null,null,null,null,null,null,null,null,null,null,null,null,null,null,null,null,null,null,null,null,null,null,null,null,null,null,null,null,null,null,null,null,null,null,null,0]
[null,null,null,null,null,null,null,null,null,null,null,null,null,null,null,null,null,null,null,null,null,null,null,null,null,null,null,null,null,null,null,null,null,null,null,null,null,null,null,null,null,null,null,null,null,null,null,null,null,null,null,null,null,null,null,null,null,null,null,null,null,null,null,null,0]
[null,null,null,null,null,null,null,null,null,null,null,null,null,null,null,null,null,null,null,null,null,null,null,null,null,null,null,null,null,null,null,null,null,null,null,null,null,null,null,null,null,null,null,null,null,null,null,null,null,null,null,null,null,null,null,null,null,null,null,null,null,null,null,null,0]
[null,null,null,null,null,null,null,null,null,null,null,null,null,null,null,null,null,null,null,null,null,null,null,null,null,null,null,null,null,null,null,null,null,null,null,null,null,null,null,null,null,null,null,null,null,null,null,null,null,null,null,null,null,null,null,null,null,null,null,null,null,null,null,null,0]
[null,null,null,null,null,null,null,null,null,null,null,null,null,null,null,null,null,null,null,null,null,null,null,null,null,null,null,null,null,null,null,null,null,null,null,null,null,null,null,null,null,null,null,null,null,null,null,null,null,null,null,null,null,null,null,null,null,null,null,null,null,null,null,null,0]
[null,null,null,null,null,null,null,null,null,null,null,null,null,null,null,null,null,null,null,null,null,null,null,null,null,null,null,null,null,null,null,null,null,null,null,null,null,null,null,null,null,null,null,null,null,null,null,null,null,null,null,null,null,null,null,null,null,null,null,null,null,null,null,null,0]
[null,null,null,null,null,null,null,null,null,null,null,null,null,null,null,null,null,null,null,null,null,null,null,null,null,null,null,null,null,null,null,null,null,null,null,null,null,null,null,null,null,null,null,null,null,null,null,null,null,null,null,null,null,null,null,null,null,null,null,null,null,null,null,null,0]
[null,null,null,null,null,null,null,null,null,null,null,null,null,null,null,null,null,null,null,null,null,null,null,null,null,null,null,null,null,null,null,null,null,null,null,null,null,null,null,null,null,null,null,null,null,null,null,null,null,null,null,null,null,null,null,null,null,null,null,null,null,null,null,null,0]
[null,null,null,null,null,null,null,null,null,null,null,null,null,null,null,null,null,null,null,null,null,null,null,null,null,null,null,null,null,null,null,null,null,null,null,null,null,null,null,null,null,null,null,null,null,null,null,null,null,null,null,null,null,null,null,null,null,null,null,null,null,null,null,null,0]
[null,null,null,null,null,null,null,null,null,null,null,null,null,null,null,null,null,null,null,null,null,null,null,null,null,null,null,null,null,null,null,null,null,null,null,null,null,null,null,null,null,null,null,null,null,null,null,null,null,null,null,null,null,null,null,null,null,null,null,null,null,null,null,null,0]
[null,null,null,null,null,null,null,null,null,null,null,null,null,null,null,null,null,null,null,null,null,null,null,null,null,null,null,null,null,null,null,null,null,null,null,null,null,null,null,null,null,null,null,null,null,null,null,null,null,null,null,null,null,null,null,null,null,null,null,null,null,null,null,null,0]
[null,null,null,null,null,null,null,null,null,null,null,null,null,null,null,null,null,null,null,null,null,null,null,null,null,null,null,null,null,null,null,null,null,null,null,null,null,null,null,null,null,null,null,null,null,null,null,null,null,null,null,null,null,null,null,null,null,null,null,null,null,null,null,null,0]
[null,null,null,null,null,null,null,null,null,null,null,null,null,null,null,null,null,null,null,null,null,null,null,null,null,null,null,null,null,null,null,null,null,null,null,null,null,null,null,null,null,null,null,null,null,null,null,null,null,null,null,null,null,null,null,null,null,null,null,null,null,null,null,null,0]
[null,null,null,null,null,null,null,null,null,null,null,null,null,null,null,null,null,null,null,null,null,null,null,null,null,null,null,null,null,null,null,null,null,null,null,null,null,null,null,null,null,null,null,null,null,null,null,null,null,null,null,null,null,null,null,null,null,null,null,null,null,null,null,null,0]
[null,null,null,null,null,null,null,null,null,null,null,null,null,null,null,null,null,null,null,null,null,null,null,null,null,null,null,null,null,null,null,null,null,null,null,null,null,null,null,null,null,null,null,null,null,null,null,null,null,null,null,null,null,null,null,null,null,null,null,null,null,null,null,null,0]
[null,null,null,null,null,null,null,null,null,null,null,null,null,null,null,null,null,null,null,null,null,null,null,null,null,null,null,null,null,null,null,null,null,null,null,null,null,null,null,null,null,null,null,null,null,null,null,null,null,null,null,null,null,null,null,null,null,null,null,null,null,null,null,null,0]
[null,null,null,null,null,null,null,null,null,null,null,null,null,null,null,null,null,null,null,null,null,null,null,null,null,null,null,null,null,null,null,null,null,null,null,null,null,null,null,null,null,null,null,null,null,null,null,null,null,null,null,null,null,null,null,null,null,null,null,null,null,null,null,null,0]
[null,null,null,null,null,null,null,null,null,null,null,null,null,null,null,null,null,null,null,null,null,null,null,null,null,null,null,null,null,null,null,null,null,null,null,null,null,null,null,null,null,null,null,null,null,null,null,null,null,null,null,null,null,null,null,null,null,null,null,null,null,null,null,null,0]
[null,null,null,null,null,null,null,null,null,null,null,null,null,null,null,null,null,null,null,null,null,null,null,null,null,null,null,null,null,null,null,null,null,null,null,null,null,null,null,null,null,null,null,null,null,null,null,null,null,null,null,null,null,null,null,null,null,null,null,null,null,null,null,null,0]
[null,null,null,null,null,null,null,null,null,null,null,null,null,null,null,null,null,null,null,null,null,null,null,null,null,null,null,null,null,null,null,null,null,null,null,null,null,null,null,null,null,null,null,null,null,null,null,null,null,null,null,null,null,null,null,null,null,null,null,null,null,null,null,null,0]
[null,null,null,null,null,null,null,null,null,null,null,null,null,null,null,null,null,null,null,null,null,null,null,null,null,null,null,null,null,null,null,null,null,null,null,null,null,null,null,null,null,null,null,null,null,null,null,null,null,null,null,null,null,null,null,null,null,null,null,null,null,null,null,null,0]
[null,null,null,null,null,null,null,null,null,null,null,null,null,null,null,null,null,null,null,null,null,null,null,null,null,null,null,null,null,null,null,null,null,null,null,null,null,null,null,null,null,null,null,null,null,null,null,null,null,null,null,null,null,null,null,null,null,null,null,null,null,null,null,null,0]
[null,null,null,null,null,null,null,null,null,null,null,null,null,null,null,null,null,null,null,null,null,null,null,null,null,null,null,null,null,null,null,null,null,null,null,null,null,null,null,null,null,null,null,null,null,null,null,null,null,null,null,null,null,null,null,null,null,null,null,null,null,null,null,null,0]
[null,null,null,null,null,null,null,null,null,null,null,null,null,null,null,null,null,null,null,null,null,null,null,null,null,null,null,null,null,null,null,null,null,null,null,null,null,null,null,null,null,null,null,null,null,null,null,null,null,null,null,null,null,null,null,null,null,null,null,null,null,null,null,null,0]
[null,null,null,null,null,null,null,null,null,null,null,null,null,null,null,null,null,null,null,null,null,null,null,null,null,null,null,null,null,null,null,null,null,null,null,null,null,null,null,null,null,null,null,null,null,null,null,null,null,null,null,null,null,null,null,null,null,null,null,null,null,null,null,null,0]
[null,null,null,null,null,null,null,null,null,null,null,null,null,null,null,null,null,null,null,null,null,null,null,null,null,null,null,null,null,null,null,null,null,null,null,null,null,null,null,null,null,null,null,null,null,null,null,null,null,null,null,null,null,null,null,null,null,null,null,null,null,null,null,null,0]
[null,null,null,null,null,null,null,null,null,null,null,null,null,null,null,null,null,null,null,null,null,null,null,null,null,null,null,null,null,null,null,null,null,null,null,null,null,null,null,null,null,null,null,null,null,null,null,null,null,null,null,null,null,null,null,null,null,null,null,null,null,null,null,null,0]
[null,null,null,null,null,null,null,null,null,null,null,null,null,null,null,null,null,null,null,null,null,null,null,null,null,null,null,null,null,null,null,null,null,null,null,null,null,null,null,null,null,null,null,null,null,null,null,null,null,null,null,null,null,null,null,null,null,null,null,null,null,null,null,null,0]
[null,null,null,null,null,null,null,null,null,null,null,null,null,null,null,null,null,null,null,null,null,null,null,null,null,null,null,null,null,null,null,null,null,null,null,null,null,null,null,null,null,null,null,null,null,null,null,null,null,null,null,null,null,null,null,null,null,null,null,null,null,null,null,null,0]
[null,null,null,null,null,null,null,null,null,null,null,null,null,null,null,null,null,null,null,null,null,null,null,null,null,null,null,null,null,null,null,null,null,null,null,null,null,null,null,null,null,null,null,null,null,null,null,null,null,null,null,null,null,null,null,null,null,null,null,null,null,null,null,null,0]
[null,null,null,null,null,null,null,null,null,null,null,null,null,null,null,null,null,null,null,null,null,null,null,null,null,null,null,null,null,null,null,null,null,null,null,null,null,null,null,null,null,null,null,null,null,null,null,null,null,null,null,null,null,null,null,null,null,null,null,null,null,null,null,null,0]
[null,null,null,null,null,null,null,null,null,null,null,null,null,null,null,null,null,null,null,null,null,null,null,null,null,null,null,null,null,null,null,null,null,null,null,null,null,null,null,null,null,null,null,null,null,null,null,null,null,null,null,null,null,null,null,null,null,null,null,null,null,null,null,null,0]
[null,null,null,null,null,null,null,null,null,null,null,null,null,null,null,null,null,null,null,null,null,null,null,null,null,null,null,null,null,null,null,null,null,null,null,null,null,null,null,null,null,null,null,null,null,null,null,null,null,null,null,null,null,null,null,null,null,null,null,null,null,null,null,null,0]
[null,null,null,null,null,null,null,null,null,null,null,null,null,null,null,null,null,null,null,null,null,null,null,null,null,null,null,null,null,null,null,null,null,null,null,null,null,null,null,null,null,null,null,null,null,null,null,null,null,null,null,null,null,null,null,null,null,null,null,null,null,null,null,null,{"$f":"COUNTA(C72:BL72)/2","v":0}]
[null,null,null,null,null,null,null,null,null,null,null,null,null,null,null,null,null,null,null,null,null,null,null,null,null,null,null,null,null,null,null,null,null,null,null,null,null,null,null,null,null,null,null,null,null,null,null,null,null,null,null,null,null,null,null,null,null,null,null,null,null,null,null,null,0]
[null,null,null,null,null,null,null,null,null,null,null,null,null,null,null,null,null,null,null,null,null,null,null,null,null,null,null,null,null,null,null,null,null,null,null,null,null,null,null,null,null,null,null,null,null,null,null,null,null,null,null,null,null,null,null,null,null,null,null,null,null,null,null,null,0]
[null,null,null,null,null,null,null,null,null,null,null,null,null,null,null,null,null,null,null,null,null,null,null,null,null,null,null,null,null,null,null,null,null,null,null,null,null,null,null,null,null,null,null,null,null,null,null,null,null,null,null,null,null,null,null,null,null,null,null,null,null,null,null,null,0]
[null,null,null,null,null,null,null,null,null,null,null,null,null,null,null,null,null,null,null,null,null,null,null,null,null,null,null,null,null,null,null,null,null,null,null,null,null,null,null,null,null,null,null,null,null,null,null,null,null,null,null,null,null,null,null,null,null,null,null,null,null,null,null,null,0]
[null,null,null,null,null,null,null,null,null,null,null,null,null,null,null,null,null,null,null,null,null,null,null,null,null,null,null,null,null,null,null,null,null,null,null,null,null,null,null,null,null,null,null,null,null,null,null,null,null,null,null,null,null,null,null,null,null,null,null,null,null,null,null,null,0]
[null,null,null,null,null,null,null,null,null,null,null,null,null,null,null,null,null,null,null,null,null,null,null,null,null,null,null,null,null,null,null,null,null,null,null,null,null,null,null,null,null,null,null,null,null,null,null,null,null,null,null,null,null,null,null,null,null,null,null,null,null,null,null,null,0]
[null,null,null,null,null,null,null,null,null,null,null,null,null,null,null,null,null,null,null,null,null,null,null,null,null,null,null,null,null,null,null,null,null,null,null,null,null,null,null,null,null,null,null,null,null,null,null,null,null,null,null,null,null,null,null,null,null,null,null,null,null,null,null,null,0]
[null,null,null,null,null,null,null,null,null,null,null,null,null,null,null,null,null,null,null,null,null,null,null,null,null,null,null,null,null,null,null,null,null,null,null,null,null,null,null,null,null,null,null,null,null,null,null,null,null,null,null,null,null,null,null,null,null,null,null,null,null,null,null,null,0]
[null,null,null,null,null,null,null,null,null,null,null,null,null,null,null,null,null,null,null,null,null,null,null,null,null,null,null,null,null,null,null,null,null,null,null,null,null,null,null,null,null,null,null,null,null,null,null,null,null,null,null,null,null,null,null,null,null,null,null,null,null,null,null,null,0]
[null,null,null,null,null,null,null,null,null,null,null,null,null,null,null,null,null,null,null,null,null,null,null,null,null,null,null,null,null,null,null,null,null,null,null,null,null,null,null,null,null,null,null,null,null,null,null,null,null,null,null,null,null,null,null,null,null,null,null,null,null,null,null,null,0]
[null,null,null,null,null,null,null,null,null,null,null,null,null,null,null,null,null,null,null,null,null,null,null,null,null,null,null,null,null,null,null,null,null,null,null,null,null,null,null,null,null,null,null,null,null,null,null,null,null,null,null,null,null,null,null,null,null,null,null,null,null,null,null,null,0]
[null,null,null,null,null,null,null,null,null,null,null,null,null,null,null,null,null,null,null,null,null,null,null,null,null,null,null,null,null,null,null,null,null,null,null,null,null,null,null,null,null,null,null,null,null,null,null,null,null,null,null,null,null,null,null,null,null,null,null,null,null,null,null,null,0]
[null,null,null,null,null,null,null,null,null,null,null,null,null,null,null,null,null,null,null,null,null,null,null,null,null,null,null,null,null,null,null,null,null,null,null,null,null,null,null,null,null,null,null,null,null,null,null,null,null,null,null,null,null,null,null,null,null,null,null,null,null,null,null,null,0]
[null,null,null,null,null,null,null,null,null,null,null,null,null,null,null,null,null,null,null,null,null,null,null,null,null,null,null,null,null,null,null,null,null,null,null,null,null,null,null,null,null,null,null,null,null,null,null,null,null,null,null,null,null,null,null,null,null,null,null,null,null,null,null,null,0]
[null,null,null,null,null,null,null,null,null,null,null,null,null,null,null,null,null,null,null,null,null,null,null,null,null,null,null,null,null,null,null,null,null,null,null,null,null,null,null,null,null,null,null,null,null,null,null,null,null,null,null,null,null,null,null,null,null,null,null,null,null,null,null,null,0]
[null,null,null,null,null,null,null,null,null,null,null,null,null,null,null,null,null,null,null,null,null,null,null,null,null,null,null,null,null,null,null,null,null,null,null,null,null,null,null,null,null,null,null,null,null,null,null,null,null,null,null,null,null,null,null,null,null,null,null,null,null,null,null,null,0]
[null,null,null,null,null,null,null,null,null,null,null,null,null,null,null,null,null,null,null,null,null,null,null,null,null,null,null,null,null,null,null,null,null,null,null,null,null,null,null,null,null,null,null,null,null,null,null,null,null,null,null,null,null,null,null,null,null,null,null,null,null,null,null,null,0]
[null,null,null,null,null,null,null,null,null,null,null,null,null,null,null,null,null,null,null,null,null,null,null,null,null,null,null,null,null,null,null,null,null,null,null,null,null,null,null,null,null,null,null,null,null,null,null,null,null,null,null,null,null,null,null,null,null,null,null,null,null,null,null,null,0]
[null,null,null,null,null,null,null,null,null,null,null,null,null,null,null,null,null,null,null,null,null,null,null,null,null,null,null,null,null,null,null,null,null,null,null,null,null,null,null,null,null,null,null,null,null,null,null,null,null,null,null,null,null,null,null,null,null,null,null,null,null,null,null,null,0]
[null,null,null,null,null,null,null,null,null,null,null,null,null,null,null,null,null,null,null,null,null,null,null,null,null,null,null,null,null,null,null,null,null,null,null,null,null,null,null,null,null,null,null,null,null,null,null,null,null,null,null,null,null,null,null,null,null,null,null,null,null,null,null,null,0]
[null,null,null,null,null,null,null,null,null,null,null,null,null,null,null,null,null,null,null,null,null,null,null,null,null,null,null,null,null,null,null,null,null,null,null,null,null,null,null,null,null,null,null,null,null,null,null,null,null,null,null,null,null,null,null,null,null,null,null,null,null,null,null,null,0]
[null,null,null,null,null,null,null,null,null,null,null,null,null,null,null,null,null,null,null,null,null,null,null,null,null,null,null,null,null,null,null,null,null,null,null,null,null,null,null,null,null,null,null,null,null,null,null,null,null,null,null,null,null,null,null,null,null,null,null,null,null,null,null,null,0]
[null,null,null,null,null,null,null,null,null,null,null,null,null,null,null,null,null,null,null,null,null,null,null,null,null,null,null,null,null,null,null,null,null,null,null,null,null,null,null,null,null,null,null,null,null,null,null,null,null,null,null,null,null,null,null,null,null,null,null,null,null,null,null,null,0]
[null,null,null,null,null,null,null,null,null,null,null,null,null,null,null,null,null,null,null,null,null,null,null,null,null,null,null,null,null,null,null,null,null,null,null,null,null,null,null,null,null,null,null,null,null,null,null,null,null,null,null,null,null,null,null,null,null,null,null,null,null,null,null,null,0]
[null,null,null,null,null,null,null,null,null,null,null,null,null,null,null,null,null,null,null,null,null,null,null,null,null,null,null,null,null,null,null,null,null,null,null,null,null,null,null,null,null,null,null,null,null,null,null,null,null,null,null,null,null,null,null,null,null,null,null,null,null,null,null,null,0]
[null,null,null,null,null,null,null,null,null,null,null,null,null,null,null,null,null,null,null,null,null,null,null,null,null,null,null,null,null,null,null,null,null,null,null,null,null,null,null,null,null,null,null,null,null,null,null,null,null,null,null,null,null,null,null,null,null,null,null,null,null,null,null,null,0]
[null,null,null,null,null,null,null,null,null,null,null,null,null,null,null,null,null,null,null,null,null,null,null,null,null,null,null,null,null,null,null,null,null,null,null,null,null,null,null,null,null,null,null,null,null,null,null,null,null,null,null,null,null,null,null,null,null,null,null,null,null,null,null,null,0]
[null,null,null,null,null,null,null,null,null,null,null,null,null,null,null,null,null,null,null,null,null,null,null,null,null,null,null,null,null,null,null,null,null,null,null,null,null,null,null,null,null,null,null,null,null,null,null,null,null,null,null,null,null,null,null,null,null,null,null,null,null,null,null,null,0]

{"sheet":"Février","index":3,"n_rows":100,"n_cols":65,"rows_kept":100,"cut":false,"hidden":false,"merged":[[17,0,17,1],[18,0,18,1],[19,0,19,1],[20,0,20,1],[13,0,13,1],[8,0,8,1],[9,0,9,1],[12,0,12,1],[10,0,10,1],[11,0,11,1],[14,0,14,1],[15,0,15,1],[16,0,16,1],[7,0,7,1],[4,44,4,45],[4,32,4,33],[4,34,4,35],[4,36,4,37],[4,38,4,39],[4,40,4,41],[4,42,4,43],[4,20,4,21],[4,14,4,15],[4,16,4,17],[4,18,4,19],[4,2,4,3],[4,4,4,5],[4,6,4,7],[4,8,4,9],[4,62,4,63],[6,0,6,1],[4,52,4,53],[4,54,4,55],[4,30,4,31],[4,58,4,59],[4,60,4,61],[4,22,4,23],[4,24,4,25],[4,26,4,27],[4,28,4,29],[4,56,4,57],[4,46,4,47],[4,48,4,49],[4,50,4,51],[4,12,4,13],[4,10,4,11],[1,42,1,46],[3,32,3,33],[3,34,3,35],[3,36,3,37],[3,50,3,51],[3,48,3,49],[3,26,3,27],[3,28,3,29],[3,22,3,23],[3,24,3,25],[3,38,3,39],[3,40,3,41],[3,42,3,43],[3,44,3,45],[3,46,3,47],[3,30,3,31],[1,47,1,49],[1,55,1,59],[1,60,1,62],[3,2,3,3],[3,4,3,5],[3,6,3,7],[3,8,3,9],[3,10,3,11],[3,12,3,13],[1,3,1,7],[1,8,1,10],[1,16,1,20],[1,21,1,23],[1,29,1,33],[1,34,1,36],[3,14,3,15],[3,62,3,63],[3,52,3,53],[3,54,3,55],[3,56,3,57],[3,58,3,59],[3,60,3,61],[3,16,3,17],[3,18,3,19],[3,20,3,21],[26,0,26,1],[27,0,27,1],[28,0,28,1],[29,0,29,1],[30,0,30,1],[21,0,21,1],[22,0,22,1],[23,0,23,1],[24,0,24,1],[25,0,25,1],[36,0,36,1],[37,0,37,1],[38,0,38,1],[39,0,39,1],[40,0,40,1],[31,0,31,1],[32,0,32,1],[33,0,33,1],[34,0,34,1],[35,0,35,1],[46,0,46,1],[47,0,47,1],[48,0,48,1],[49,0,49,1],[50,0,50,1],[41,0,41,1],[42,0,42,1],[43,0,43,1],[44,0,44,1],[45,0,45,1],[56,0,56,1],[57,0,57,1],[58,0,58,1],[59,0,59,1],[60,0,60,1],[51,0,51,1],[52,0,52,1],[53,0,53,1],[54,0,54,1],[55,0,55,1],[66,0,66,1],[67,0,67,1],[68,0,68,1],[69,0,69,1],[70,0,70,1],[61,0,61,1],[62,0,62,1],[63,0,63,1],[64,0,64,1],[65,0,65,1],[76,0,76,1],[77,0,77,1],[78,0,78,1],[79,0,79,1],[80,0,80,1],[71,0,71,1],[72,0,72,1],[73,0,73,1],[74,0,74,1],[75,0,75,1],[86,0,86,1],[87,0,87,1],[88,0,88,1],[89,0,89,1],[90,0,90,1],[81,0,81,1],[82,0,82,1],[83,0,83,1],[84,0,84,1],[85,0,85,1],[96,0,96,1],[97,0,97,1],[98,0,98,1],[99,0,99,1],[91,0,91,1],[92,0,92,1],[93,0,93,1],[94,0,94,1],[95,0,95,1]]}
[3,{"$f":"C5","v":"2014-02-01"}]
[null,null,null,{"$f":"IF(An!$Q$4=\"\",\"\",An!$Q$4)","v":""},null,null,null,null,{"$f":"C5","v":"2014-02-01"},null,null,null,null,"ACCEUIL",null,null,{"$f":"IF(An!$Q$4=\"\",\"\",An!$Q$4)","v":""},null,null,null,null,{"$f":"C5","v":"2014-02-01"},null,null,null,null,"ACCEUIL",null,null,{"$f":"IF(An!$Q$4=\"\",\"\",An!$Q$4)","v":""},null,null,null,null,{"$f":"C5","v":"2014-02-01"},null,null,null,null,"ACCEUIL",null,null,{"$f":"IF(An!$Q$4=\"\",\"\",An!$Q$4)","v":""},null,null,null,null,{"$f":"C5","v":"2014-02-01"},null,null,null,null,"ACCEUIL",null,null,{"$f":"IF(An!$Q$4=\"\",\"\",An!$Q$4)","v":""},null,null,null,null,{"$f":"C5","v":"2014-02-01"},null,null,"ACCEUIL"]
[]
[null,null,{"$f":"IF(C5=\"\",\"\",IF(LOOKUP(C5,Fériés)=C5,\"\",CHOOSE(WEEKDAY(C5,1),\"Dimanche\",\"Lundi\",\"Mardi\",\"Mercredi\",\"Jeudi\",\"Vendredi\",\"Samedi\")))","v":"Samedi"},null,"Dimanche",null,"Lundi",null,"Mardi",null,"Mercredi",null,"Jeudi",null,"Vendredi",null,"Samedi",null,{"$f":"IF(S5=\"\",\"\",IF(LOOKUP(S5,Fériés)=S5,\"\",CHOOSE(WEEKDAY(S5,1),\"Dimanche\",\"Lundi\",\"Mardi\",\"Mercredi\",\"Jeudi\",\"Vendredi\",\"Samedi\")))","v":"Dimanche"},null,"Lundi",null,"Mardi",null,"Mercredi",null,"Jeudi",null,"Vendredi",null,"Samedi",null,{"$f":"IF(AG5=\"\",\"\",IF(LOOKUP(AG5,Fériés)=AG5,\"\",CHOOSE(WEEKDAY(AG5,1),\"Dimanche\",\"Lundi\",\"Mardi\",\"Mercredi\",\"Jeudi\",\"Vendredi\",\"Samedi\")))","v":"Dimanche"},null,{"$f":"IF(AI5=\"\",\"\",IF(LOOKUP(AI5,Fériés)=AI5,\"\",CHOOSE(WEEKDAY(AI5,1),\"Dimanche\",\"Lundi\",\"Mardi\",\"Mercredi\",\"Jeudi\",\"Vendredi\",\"Samedi\")))","v":"Lundi"},null,"Mardi",null,"Mercredi",null,"Jeudi",null,"Vendredi",null,"Samedi",null,"Dimanche",null,{"$f":"IF(AW5=\"\",\"\",IF(LOOKUP(AW5,Fériés)=AW5,\"\",CHOOSE(WEEKDAY(AW5,1),\"Dimanche\",\"Lundi\",\"Mardi\",\"Mercredi\",\"Jeudi\",\"Vendredi\",\"Samedi\")))","v":"Lundi"},null,{"$f":"IF(AY5=\"\",\"\",IF(LOOKUP(AY5,Fériés)=AY5,\"\",CHOOSE(WEEKDAY(AY5,1),\"Dimanche\",\"Lundi\",\"Mardi\",\"Mercredi\",\"Jeudi\",\"Vendredi\",\"Samedi\")))","v":"Mardi"},null,"Mercredi",null,"Jeudi",null,"Vendredi",null,"",null,"",null,""]
[null,null,{"$f":"DATE(Année,2,1)","v":"2014-02-01"},null,{"$f":"IF(C5=\"\",\"\",IF(MONTH(C5+1)<>MONTH(C5),\"\",C5+1))","v":"2014-02-02"},null,{"$f":"IF(E5=\"\",\"\",IF(MONTH(E5+1)<>MONTH(E5),\"\",E5+1))","v":"2014-02-03"},null,{"$f":"IF(G5=\"\",\"\",IF(MONTH(G5+1)<>MONTH(G5),\"\",G5+1))","v":"2014-02-04"},null,{"$f":"IF(I5=\"\",\"\",IF(MONTH(I5+1)<>MONTH(I5),\"\",I5+1))","v":"2014-02-05"},null,{"$f":"IF(K5=\"\",\"\",IF(MONTH(K5+1)<>MONTH(K5),\"\",K5+1))","v":"2014-02-06"},null,{"$f":"IF(M5=\"\",\"\",IF(MONTH(M5+1)<>MONTH(M5),\"\",M5+1))","v":"2014-02-07"},null,{"$f":"IF(O5=\"\",\"\",IF(MONTH(O5+1)<>MONTH(O5),\"\",O5+1))","v":"2014-02-08"},null,{"$f":"IF(Q5=\"\",\"\",IF(MONTH(Q5+1)<>MONTH(Q5),\"\",Q5+1))","v":"2014-02-09"},null,{"$f":"IF(S5=\"\",\"\",IF(MONTH(S5+1)<>MONTH(S5),\"\",S5+1))","v":"2014-02-10"},null,{"$f":"IF(U5=\"\",\"\",IF(MONTH(U5+1)<>MONTH(U5),\"\",U5+1))","v":"2014-02-11"},null,{"$f":"IF(W5=\"\",\"\",IF(MONTH(W5+1)<>MONTH(W5),\"\",W5+1))","v":"2014-02-12"},null,{"$f":"IF(Y5=\"\",\"\",IF(MONTH(Y5+1)<>MONTH(Y5),\"\",Y5+1))","v":"2014-02-13"},null,{"$f":"IF(AA5=\"\",\"\",IF(MONTH(AA5+1)<>MONTH(AA5),\"\",AA5+1))","v":"2014-02-14"},null,{"$f":"IF(AC5=\"\",\"\",IF(MONTH(AC5+1)<>MONTH(AC5),\"\",AC5+1))","v":"2014-02-15"},null,{"$f":"IF(AE5=\"\",\"\",IF(MONTH(AE5+1)<>MONTH(AE5),\"\",AE5+1))","v":"2014-02-16"},null,{"$f":"IF(AG5=\"\",\"\",IF(MONTH(AG5+1)<>MONTH(AG5),\"\",AG5+1))","v":"2014-02-17"},null,{"$f":"IF(AI5=\"\",\"\",IF(MONTH(AI5+1)<>MONTH(AI5),\"\",AI5+1))","v":"2014-02-18"},null,{"$f":"IF(AK5=\"\",\"\",IF(MONTH(AK5+1)<>MONTH(AK5),\"\",AK5+1))","v":"2014-02-19"},null,{"$f":"IF(AM5=\"\",\"\",IF(MONTH(AM5+1)<>MONTH(AM5),\"\",AM5+1))","v":"2014-02-20"},null,{"$f":"IF(AO5=\"\",\"\",IF(MONTH(AO5+1)<>MONTH(AO5),\"\",AO5+1))","v":"2014-02-21"},null,{"$f":"IF(AQ5=\"\",\"\",IF(MONTH(AQ5+1)<>MONTH(AQ5),\"\",AQ5+1))","v":"2014-02-22"},null,{"$f":"IF(AS5=\"\",\"\",IF(MONTH(AS5+1)<>MONTH(AS5),\"\",AS5+1))","v":"2014-02-23"},null,{"$f":"IF(AU5=\"\",\"\",IF(MONTH(AU5+1)<>MONTH(AU5),\"\",AU5+1))","v":"2014-02-24"},null,{"$f":"IF(AW5=\"\",\"\",IF(MONTH(AW5+1)<>MONTH(AW5),\"\",AW5+1))","v":"2014-02-25"},null,{"$f":"IF(AY5=\"\",\"\",IF(MONTH(AY5+1)<>MONTH(AY5),\"\",AY5+1))","v":"2014-02-26"},null,{"$f":"IF(BA5=\"\",\"\",IF(MONTH(BA5+1)<>MONTH(BA5),\"\",BA5+1))","v":"2014-02-27"},null,{"$f":"IF(BC5=\"\",\"\",IF(MONTH(BC5+1)<>MONTH(BC5),\"\",BC5+1))","v":"2014-02-28"},null,{"$f":"IF(BE5=\"\",\"\",IF(MONTH(BE5+1)<>MONTH(BE5),\"\",BE5+1))","v":""},null,{"$f":"IF(BG5=\"\",\"\",IF(MONTH(BG5+1)<>MONTH(BG5),\"\",BG5+1))","v":""},null,{"$f":"IF(BI5=\"\",\"\",IF(MONTH(BI5+1)<>MONTH(BI5),\"\",BI5+1))","v":""}]
[null,null,"Matin","Après midi","Matin","Après midi","Matin","Après midi","Matin","Après midi","Matin","Après midi","Matin","Après midi","Matin","Après midi","Matin","Après midi","Matin","Après midi","Matin","Après midi","Matin","Après midi","Matin","Après midi","Matin","Après midi","Matin","Après midi","Matin","Après midi","Matin","Après midi","Matin","Après midi","Matin","Après midi","Matin","Après midi","Matin","Après midi","Matin","Après midi","Matin","Après midi","Matin","Après midi","Matin","Après midi","Matin","Après midi","Matin","Après midi","Matin","Après midi","Matin","Après midi",{"$f":"IF(BG5=\"\",\"\",\"Matin\")","v":""},{"$f":"IF(BG5=\"\",\"\",\"Apres midi\")","v":""},{"$f":"IF(BI5=\"\",\"\",\"Matin\")","v":""},{"$f":"IF(BI5=\"\",\"\",\"Apres midi\")","v":""},{"$f":"IF(BK5=\"\",\"\",\"Matin\")","v":""},{"$f":"IF(BK5=\"\",\"\",\"Apres midi\")","v":""}]
["MARCEL",null,null,null,null,null,null,null,null,null,null,null,null,null,null,null,null,null,null,null,null,null,null,null,null,null,null,null,null,null,null,null,null,null,null,null,null,null,null,null,null,null,null,null,null,null,null,null,null,null,null,null,null,null,null,null,null,null,null,null,null,null,null,null,{"$f":"COUNTA(C7:BL7)/2","v":0}]
["GERAC",null,null,null,null,null,null,null,null,null,null,null,null,null,null,null,null,null,null,null,null,null,null,null,null,null,null,null,null,null,null,null,null,null,null,null,null,null,null,null,null,null,null,null,null,null,null,null,null,null,null,null,null,null,null,null,null,null,null,null,null,null,null,null,{"$f":"COUNTA(C8:BL8)/2","v":0}]
[null,null,null,null,null,null,null,null,null,null,null,null,null,null,null,null,null,null,null,null,null,null,null,null,null,null,null,null,null,null,null,null,null,null,null,null,null,null,null,null,null,null,null,null,null,null,null,null,null,null,null,null,null,null,null,null,null,null,null,null,null,null,null,null,0]
[null,null,null,null,null,null,null,null,null,null,null,null,null,null,null,null,null,null,null,null,null,null,null,null,null,null,null,null,null,null,null,null,null,null,null,null,null,null,null,null,null,null,null,null,null,null,null,null,null,null,null,null,null,null,null,null,null,null,null,null,null,null,null,null,0]
[null,null,null,null,null,null,null,null,null,null,null,null,null,null,null,null,null,null,null,null,null,null,null,null,null,null,null,null,null,null,null,null,null,null,null,null,null,null,null,null,null,null,null,null,null,null,null,null,null,null,null,null,null,null,null,null,null,null,null,null,null,null,null,null,0]
[null,null,null,null,null,null,null,null,null,null,null,null,null,null,null,null,null,null,null,null,null,null,null,null,null,null,null,null,null,null,null,null,null,null,null,null,null,null,null,null,null,null,null,null,null,null,null,null,null,null,null,null,null,null,null,null,null,null,null,null,null,null,null,null,0]
[null,null,null,null,null,null,null,null,null,null,null,null,null,null,null,null,null,null,null,null,null,null,null,null,null,null,null,null,null,null,null,null,null,null,null,null,null,null,null,null,null,null,null,null,null,null,null,null,null,null,null,null,null,null,null,null,null,null,null,null,null,null,null,null,0]
[null,null,null,null,null,null,null,null,null,null,null,null,null,null,null,null,null,null,null,null,null,null,null,null,null,null,null,null,null,null,null,null,null,null,null,null,null,null,null,null,null,null,null,null,null,null,null,null,null,null,null,null,null,null,null,null,null,null,null,null,null,null,null,null,0]
[null,null,null,null,null,null,null,null,null,null,null,null,null,null,null,null,null,null,null,null,null,null,null,null,null,null,null,null,null,null,null,null,null,null,null,null,null,null,null,null,null,null,null,null,null,null,null,null,null,null,null,null,null,null,null,null,null,null,null,null,null,null,null,null,0]
[null,null,null,null,null,null,null,null,null,null,null,null,null,null,null,null,null,null,null,null,null,null,null,null,null,null,null,null,null,null,null,null,null,null,null,null,null,null,null,null,null,null,null,null,null,null,null,null,null,null,null,null,null,null,null,null,null,null,null,null,null,null,null,null,0]
[null,null,null,null,null,null,null,null,null,null,null,null,null,null,null,null,null,null,null,null,null,null,null,null,null,null,null,null,null,null,null,null,null,null,null,null,null,null,null,null,null,null,null,null,null,null,null,null,null,null,null,null,null,null,null,null,null,null,null,null,null,null,null,null,0]
[null,null,null,null,null,null,null,null,null,null,null,null,null,null,null,null,null,null,null,null,null,null,null,null,null,null,null,null,null,null,null,null,null,null,null,null,null,null,null,null,null,null,null,null,null,null,null,null,null,null,null,null,null,null,null,null,null,null,null,null,null,null,null,null,0]
[null,null,null,null,null,null,null,null,null,null,null,null,null,null,null,null,null,null,null,null,null,null,null,null,null,null,null,null,null,null,null,null,null,null,null,null,null,null,null,null,null,null,null,null,null,null,null,null,null,null,null,null,null,null,null,null,null,null,null,null,null,null,null,null,0]
[null,null,null,null,null,null,null,null,null,null,null,null,null,null,null,null,null,null,null,null,null,null,null,null,null,null,null,null,null,null,null,null,null,null,null,null,null,null,null,null,null,null,null,null,null,null,null,null,null,null,null,null,null,null,null,null,null,null,null,null,null,null,null,null,0]
[null,null,null,null,null,null,null,null,null,null,null,null,null,null,null,null,null,null,null,null,null,null,null,null,null,null,null,null,null,null,null,null,null,null,null,null,null,null,null,null,null,null,null,null,null,null,null,null,null,null,null,null,null,null,null,null,null,null,null,null,null,null,null,null,0]
[null,null,null,null,null,null,null,null,null,null,null,null,null,null,null,null,null,null,null,null,null,null,null,null,null,null,null,null,null,null,null,null,null,null,null,null,null,null,null,null,null,null,null,null,null,null,null,null,null,null,null,null,null,null,null,null,null,null,null,null,null,null,null,null,0]
[null,null,null,null,null,null,null,null,null,null,null,null,null,null,null,null,null,null,null,null,null,null,null,null,null,null,null,null,null,null,null,null,null,null,null,null,null,null,null,null,null,null,null,null,null,null,null,null,null,null,null,null,null,null,null,null,null,null,null,null,null,null,null,null,0]
[null,null,null,null,null,null,null,null,null,null,null,null,null,null,null,null,null,null,null,null,null,null,null,null,null,null,null,null,null,null,null,null,null,null,null,null,null,null,null,null,null,null,null,null,null,null,null,null,null,null,null,null,null,null,null,null,null,null,null,null,null,null,null,null,0]
[null,null,null,null,null,null,null,null,null,null,null,null,null,null,null,null,null,null,null,null,null,null,null,null,null,null,null,null,null,null,null,null,null,null,null,null,null,null,null,null,null,null,null,null,null,null,null,null,null,null,null,null,null,null,null,null,null,null,null,null,null,null,null,null,0]
[null,null,null,null,null,null,null,null,null,null,null,null,null,null,null,null,null,null,null,null,null,null,null,null,null,null,null,null,null,null,null,null,null,null,null,null,null,null,null,null,null,null,null,null,null,null,null,null,null,null,null,null,null,null,null,null,null,null,null,null,null,null,null,null,0]
[null,null,null,null,null,null,null,null,null,null,null,null,null,null,null,null,null,null,null,null,null,null,null,null,null,null,null,null,null,null,null,null,null,null,null,null,null,null,null,null,null,null,null,null,null,null,null,null,null,null,null,null,null,null,null,null,null,null,null,null,null,null,null,null,0]
[null,null,null,null,null,null,null,null,null,null,null,null,null,null,null,null,null,null,null,null,null,null,null,null,null,null,null,null,null,null,null,null,null,null,null,null,null,null,null,null,null,null,null,null,null,null,null,null,null,null,null,null,null,null,null,null,null,null,null,null,null,null,null,null,0]
[null,null,null,null,null,null,null,null,null,null,null,null,null,null,null,null,null,null,null,null,null,null,null,null,null,null,null,null,null,null,null,null,null,null,null,null,null,null,null,null,null,null,null,null,null,null,null,null,null,null,null,null,null,null,null,null,null,null,null,null,null,null,null,null,0]
[null,null,null,null,null,null,null,null,null,null,null,null,null,null,null,null,null,null,null,null,null,null,null,null,null,null,null,null,null,null,null,null,null,null,null,null,null,null,null,null,null,null,null,null,null,null,null,null,null,null,null,null,null,null,null,null,null,null,null,null,null,null,null,null,0]
[null,null,null,null,null,null,null,null,null,null,null,null,null,null,null,null,null,null,null,null,null,null,null,null,null,null,null,null,null,null,null,null,null,null,null,null,null,null,null,null,null,null,null,null,null,null,null,null,null,null,null,null,null,null,null,null,null,null,null,null,null,null,null,null,0]
[null,null,null,null,null,null,null,null,null,null,null,null,null,null,null,null,null,null,null,null,null,null,null,null,null,null,null,null,null,null,null,null,null,null,null,null,null,null,null,null,null,null,null,null,null,null,null,null,null,null,null,null,null,null,null,null,null,null,null,null,null,null,null,null,0]
[null,null,null,null,null,null,null,null,null,null,null,null,null,null,null,null,null,null,null,null,null,null,null,null,null,null,null,null,null,null,null,null,null,null,null,null,null,null,null,null,null,null,null,null,null,null,null,null,null,null,null,null,null,null,null,null,null,null,null,null,null,null,null,null,0]
[null,null,null,null,null,null,null,null,null,null,null,null,null,null,null,null,null,null,null,null,null,null,null,null,null,null,null,null,null,null,null,null,null,null,null,null,null,null,null,null,null,null,null,null,null,null,null,null,null,null,null,null,null,null,null,null,null,null,null,null,null,null,null,null,0]
[null,null,null,null,null,null,null,null,null,null,null,null,null,null,null,null,null,null,null,null,null,null,null,null,null,null,null,null,null,null,null,null,null,null,null,null,null,null,null,null,null,null,null,null,null,null,null,null,null,null,null,null,null,null,null,null,null,null,null,null,null,null,null,null,0]
[null,null,null,null,null,null,null,null,null,null,null,null,null,null,null,null,null,null,null,null,null,null,null,null,null,null,null,null,null,null,null,null,null,null,null,null,null,null,null,null,null,null,null,null,null,null,null,null,null,null,null,null,null,null,null,null,null,null,null,null,null,null,null,null,0]
[null,null,null,null,null,null,null,null,null,null,null,null,null,null,null,null,null,null,null,null,null,null,null,null,null,null,null,null,null,null,null,null,null,null,null,null,null,null,null,null,null,null,null,null,null,null,null,null,null,null,null,null,null,null,null,null,null,null,null,null,null,null,null,null,0]
[null,null,null,null,null,null,null,null,null,null,null,null,null,null,null,null,null,null,null,null,null,null,null,null,null,null,null,null,null,null,null,null,null,null,null,null,null,null,null,null,null,null,null,null,null,null,null,null,null,null,null,null,null,null,null,null,null,null,null,null,null,null,null,null,0]
[null,null,null,null,null,null,null,null,null,null,null,null,null,null,null,null,null,null,null,null,null,null,null,null,null,null,null,null,null,null,null,null,null,null,null,null,null,null,null,null,null,null,null,null,null,null,null,null,null,null,null,null,null,null,null,null,null,null,null,null,null,null,null,null,0]
[null,null,null,null,null,null,null,null,null,null,null,null,null,null,null,null,null,null,null,null,null,null,null,null,null,null,null,null,null,null,null,null,null,null,null,null,null,null,null,null,null,null,null,null,null,null,null,null,null,null,null,null,null,null,null,null,null,null,null,null,null,null,null,null,0]
[null,null,null,null,null,null,null,null,null,null,null,null,null,null,null,null,null,null,null,null,null,null,null,null,null,null,null,null,null,null,null,null,null,null,null,null,null,null,null,null,null,null,null,null,null,null,null,null,null,null,null,null,null,null,null,null,null,null,null,null,null,null,null,null,0]
[null,null,null,null,null,null,null,null,null,null,null,null,null,null,null,null,null,null,null,null,null,null,null,null,null,null,null,null,null,null,null,null,null,null,null,null,null,null,null,null,null,null,null,null,null,null,null,null,null,null,null,null,null,null,null,null,null,null,null,null,null,null,null,null,0]
[null,null,null,null,null,null,null,null,null,null,null,null,null,null,null,null,null,null,null,null,null,null,null,null,null,null,null,null,null,null,null,null,null,null,null,null,null,null,null,null,null,null,null,null,null,null,null,null,null,null,null,null,null,null,null,null,null,null,null,null,null,null,null,null,0]
[null,null,null,null,null,null,null,null,null,null,null,null,null,null,null,null,null,null,null,null,null,null,null,null,null,null,null,null,null,null,null,null,null,null,null,null,null,null,null,null,null,null,null,null,null,null,null,null,null,null,null,null,null,null,null,null,null,null,null,null,null,null,null,null,0]
[null,null,null,null,null,null,null,null,null,null,null,null,null,null,null,null,null,null,null,null,null,null,null,null,null,null,null,null,null,null,null,null,null,null,null,null,null,null,null,null,null,null,null,null,null,null,null,null,null,null,null,null,null,null,null,null,null,null,null,null,null,null,null,null,0]
[null,null,null,null,null,null,null,null,null,null,null,null,null,null,null,null,null,null,null,null,null,null,null,null,null,null,null,null,null,null,null,null,null,null,null,null,null,null,null,null,null,null,null,null,null,null,null,null,null,null,null,null,null,null,null,null,null,null,null,null,null,null,null,null,0]
[null,null,null,null,null,null,null,null,null,null,null,null,null,null,null,null,null,null,null,null,null,null,null,null,null,null,null,null,null,null,null,null,null,null,null,null,null,null,null,null,null,null,null,null,null,null,null,null,null,null,null,null,null,null,null,null,null,null,null,null,null,null,null,null,0]
[null,null,null,null,null,null,null,null,null,null,null,null,null,null,null,null,null,null,null,null,null,null,null,null,null,null,null,null,null,null,null,null,null,null,null,null,null,null,null,null,null,null,null,null,null,null,null,null,null,null,null,null,null,null,null,null,null,null,null,null,null,null,null,null,0]
[null,null,null,null,null,null,null,null,null,null,null,null,null,null,null,null,null,null,null,null,null,null,null,null,null,null,null,null,null,null,null,null,null,null,null,null,null,null,null,null,null,null,null,null,null,null,null,null,null,null,null,null,null,null,null,null,null,null,null,null,null,null,null,null,0]
[null,null,null,null,null,null,null,null,null,null,null,null,null,null,null,null,null,null,null,null,null,null,null,null,null,null,null,null,null,null,null,null,null,null,null,null,null,null,null,null,null,null,null,null,null,null,null,null,null,null,null,null,null,null,null,null,null,null,null,null,null,null,null,null,0]
[null,null,null,null,null,null,null,null,null,null,null,null,null,null,null,null,null,null,null,null,null,null,null,null,null,null,null,null,null,null,null,null,null,null,null,null,null,null,null,null,null,null,null,null,null,null,null,null,null,null,null,null,null,null,null,null,null,null,null,null,null,null,null,null,0]
[null,null,null,null,null,null,null,null,null,null,null,null,null,null,null,null,null,null,null,null,null,null,null,null,null,null,null,null,null,null,null,null,null,null,null,null,null,null,null,null,null,null,null,null,null,null,null,null,null,null,null,null,null,null,null,null,null,null,null,null,null,null,null,null,0]
[null,null,null,null,null,null,null,null,null,null,null,null,null,null,null,null,null,null,null,null,null,null,null,null,null,null,null,null,null,null,null,null,null,null,null,null,null,null,null,null,null,null,null,null,null,null,null,null,null,null,null,null,null,null,null,null,null,null,null,null,null,null,null,null,0]
[null,null,null,null,null,null,null,null,null,null,null,null,null,null,null,null,null,null,null,null,null,null,null,null,null,null,null,null,null,null,null,null,null,null,null,null,null,null,null,null,null,null,null,null,null,null,null,null,null,null,null,null,null,null,null,null,null,null,null,null,null,null,null,null,0]
[null,null,null,null,null,null,null,null,null,null,null,null,null,null,null,null,null,null,null,null,null,null,null,null,null,null,null,null,null,null,null,null,null,null,null,null,null,null,null,null,null,null,null,null,null,null,null,null,null,null,null,null,null,null,null,null,null,null,null,null,null,null,null,null,0]
[null,null,null,null,null,null,null,null,null,null,null,null,null,null,null,null,null,null,null,null,null,null,null,null,null,null,null,null,null,null,null,null,null,null,null,null,null,null,null,null,null,null,null,null,null,null,null,null,null,null,null,null,null,null,null,null,null,null,null,null,null,null,null,null,0]
[null,null,null,null,null,null,null,null,null,null,null,null,null,null,null,null,null,null,null,null,null,null,null,null,null,null,null,null,null,null,null,null,null,null,null,null,null,null,null,null,null,null,null,null,null,null,null,null,null,null,null,null,null,null,null,null,null,null,null,null,null,null,null,null,0]
[null,null,null,null,null,null,null,null,null,null,null,null,null,null,null,null,null,null,null,null,null,null,null,null,null,null,null,null,null,null,null,null,null,null,null,null,null,null,null,null,null,null,null,null,null,null,null,null,null,null,null,null,null,null,null,null,null,null,null,null,null,null,null,null,0]
[null,null,null,null,null,null,null,null,null,null,null,null,null,null,null,null,null,null,null,null,null,null,null,null,null,null,null,null,null,null,null,null,null,null,null,null,null,null,null,null,null,null,null,null,null,null,null,null,null,null,null,null,null,null,null,null,null,null,null,null,null,null,null,null,0]
[null,null,null,null,null,null,null,null,null,null,null,null,null,null,null,null,null,null,null,null,null,null,null,null,null,null,null,null,null,null,null,null,null,null,null,null,null,null,null,null,null,null,null,null,null,null,null,null,null,null,null,null,null,null,null,null,null,null,null,null,null,null,null,null,0]
[null,null,null,null,null,null,null,null,null,null,null,null,null,null,null,null,null,null,null,null,null,null,null,null,null,null,null,null,null,null,null,null,null,null,null,null,null,null,null,null,null,null,null,null,null,null,null,null,null,null,null,null,null,null,null,null,null,null,null,null,null,null,null,null,0]
[null,null,null,null,null,null,null,null,null,null,null,null,null,null,null,null,null,null,null,null,null,null,null,null,null,null,null,null,null,null,null,null,null,null,null,null,null,null,null,null,null,null,null,null,null,null,null,null,null,null,null,null,null,null,null,null,null,null,null,null,null,null,null,null,0]
[null,null,null,null,null,null,null,null,null,null,null,null,null,null,null,null,null,null,null,null,null,null,null,null,null,null,null,null,null,null,null,null,null,null,null,null,null,null,null,null,null,null,null,null,null,null,null,null,null,null,null,null,null,null,null,null,null,null,null,null,null,null,null,null,0]
[null,null,null,null,null,null,null,null,null,null,null,null,null,null,null,null,null,null,null,null,null,null,null,null,null,null,null,null,null,null,null,null,null,null,null,null,null,null,null,null,null,null,null,null,null,null,null,null,null,null,null,null,null,null,null,null,null,null,null,null,null,null,null,null,0]
[null,null,null,null,null,null,null,null,null,null,null,null,null,null,null,null,null,null,null,null,null,null,null,null,null,null,null,null,null,null,null,null,null,null,null,null,null,null,null,null,null,null,null,null,null,null,null,null,null,null,null,null,null,null,null,null,null,null,null,null,null,null,null,null,0]
[null,null,null,null,null,null,null,null,null,null,null,null,null,null,null,null,null,null,null,null,null,null,null,null,null,null,null,null,null,null,null,null,null,null,null,null,null,null,null,null,null,null,null,null,null,null,null,null,null,null,null,null,null,null,null,null,null,null,null,null,null,null,null,null,0]
[null,null,null,null,null,null,null,null,null,null,null,null,null,null,null,null,null,null,null,null,null,null,null,null,null,null,null,null,null,null,null,null,null,null,null,null,null,null,null,null,null,null,null,null,null,null,null,null,null,null,null,null,null,null,null,null,null,null,null,null,null,null,null,null,0]
[null,null,null,null,null,null,null,null,null,null,null,null,null,null,null,null,null,null,null,null,null,null,null,null,null,null,null,null,null,null,null,null,null,null,null,null,null,null,null,null,null,null,null,null,null,null,null,null,null,null,null,null,null,null,null,null,null,null,null,null,null,null,null,null,0]
[null,null,null,null,null,null,null,null,null,null,null,null,null,null,null,null,null,null,null,null,null,null,null,null,null,null,null,null,null,null,null,null,null,null,null,null,null,null,null,null,null,null,null,null,null,null,null,null,null,null,null,null,null,null,null,null,null,null,null,null,null,null,null,null,0]
[null,null,null,null,null,null,null,null,null,null,null,null,null,null,null,null,null,null,null,null,null,null,null,null,null,null,null,null,null,null,null,null,null,null,null,null,null,null,null,null,null,null,null,null,null,null,null,null,null,null,null,null,null,null,null,null,null,null,null,null,null,null,null,null,0]
[null,null,null,null,null,null,null,null,null,null,null,null,null,null,null,null,null,null,null,null,null,null,null,null,null,null,null,null,null,null,null,null,null,null,null,null,null,null,null,null,null,null,null,null,null,null,null,null,null,null,null,null,null,null,null,null,null,null,null,null,null,null,null,null,0]
[null,null,null,null,null,null,null,null,null,null,null,null,null,null,null,null,null,null,null,null,null,null,null,null,null,null,null,null,null,null,null,null,null,null,null,null,null,null,null,null,null,null,null,null,null,null,null,null,null,null,null,null,null,null,null,null,null,null,null,null,null,null,null,null,{"$f":"COUNTA(C72:BL72)/2","v":0}]
[null,null,null,null,null,null,null,null,null,null,null,null,null,null,null,null,null,null,null,null,null,null,null,null,null,null,null,null,null,null,null,null,null,null,null,null,null,null,null,null,null,null,null,null,null,null,null,null,null,null,null,null,null,null,null,null,null,null,null,null,null,null,null,null,0]
[null,null,null,null,null,null,null,null,null,null,null,null,null,null,null,null,null,null,null,null,null,null,null,null,null,null,null,null,null,null,null,null,null,null,null,null,null,null,null,null,null,null,null,null,null,null,null,null,null,null,null,null,null,null,null,null,null,null,null,null,null,null,null,null,0]
[null,null,null,null,null,null,null,null,null,null,null,null,null,null,null,null,null,null,null,null,null,null,null,null,null,null,null,null,null,null,null,null,null,null,null,null,null,null,null,null,null,null,null,null,null,null,null,null,null,null,null,null,null,null,null,null,null,null,null,null,null,null,null,null,0]
[null,null,null,null,null,null,null,null,null,null,null,null,null,null,null,null,null,null,null,null,null,null,null,null,null,null,null,null,null,null,null,null,null,null,null,null,null,null,null,null,null,null,null,null,null,null,null,null,null,null,null,null,null,null,null,null,null,null,null,null,null,null,null,null,0]
[null,null,null,null,null,null,null,null,null,null,null,null,null,null,null,null,null,null,null,null,null,null,null,null,null,null,null,null,null,null,null,null,null,null,null,null,null,null,null,null,null,null,null,null,null,null,null,null,null,null,null,null,null,null,null,null,null,null,null,null,null,null,null,null,0]
[null,null,null,null,null,null,null,null,null,null,null,null,null,null,null,null,null,null,null,null,null,null,null,null,null,null,null,null,null,null,null,null,null,null,null,null,null,null,null,null,null,null,null,null,null,null,null,null,null,null,null,null,null,null,null,null,null,null,null,null,null,null,null,null,0]
[null,null,null,null,null,null,null,null,null,null,null,null,null,null,null,null,null,null,null,null,null,null,null,null,null,null,null,null,null,null,null,null,null,null,null,null,null,null,null,null,null,null,null,null,null,null,null,null,null,null,null,null,null,null,null,null,null,null,null,null,null,null,null,null,0]
[null,null,null,null,null,null,null,null,null,null,null,null,null,null,null,null,null,null,null,null,null,null,null,null,null,null,null,null,null,null,null,null,null,null,null,null,null,null,null,null,null,null,null,null,null,null,null,null,null,null,null,null,null,null,null,null,null,null,null,null,null,null,null,null,0]
[null,null,null,null,null,null,null,null,null,null,null,null,null,null,null,null,null,null,null,null,null,null,null,null,null,null,null,null,null,null,null,null,null,null,null,null,null,null,null,null,null,null,null,null,null,null,null,null,null,null,null,null,null,null,null,null,null,null,null,null,null,null,null,null,0]
[null,null,null,null,null,null,null,null,null,null,null,null,null,null,null,null,null,null,null,null,null,null,null,null,null,null,null,null,null,null,null,null,null,null,null,null,null,null,null,null,null,null,null,null,null,null,null,null,null,null,null,null,null,null,null,null,null,null,null,null,null,null,null,null,0]
[null,null,null,null,null,null,null,null,null,null,null,null,null,null,null,null,null,null,null,null,null,null,null,null,null,null,null,null,null,null,null,null,null,null,null,null,null,null,null,null,null,null,null,null,null,null,null,null,null,null,null,null,null,null,null,null,null,null,null,null,null,null,null,null,0]
[null,null,null,null,null,null,null,null,null,null,null,null,null,null,null,null,null,null,null,null,null,null,null,null,null,null,null,null,null,null,null,null,null,null,null,null,null,null,null,null,null,null,null,null,null,null,null,null,null,null,null,null,null,null,null,null,null,null,null,null,null,null,null,null,0]
[null,null,null,null,null,null,null,null,null,null,null,null,null,null,null,null,null,null,null,null,null,null,null,null,null,null,null,null,null,null,null,null,null,null,null,null,null,null,null,null,null,null,null,null,null,null,null,null,null,null,null,null,null,null,null,null,null,null,null,null,null,null,null,null,0]
[null,null,null,null,null,null,null,null,null,null,null,null,null,null,null,null,null,null,null,null,null,null,null,null,null,null,null,null,null,null,null,null,null,null,null,null,null,null,null,null,null,null,null,null,null,null,null,null,null,null,null,null,null,null,null,null,null,null,null,null,null,null,null,null,0]
[null,null,null,null,null,null,null,null,null,null,null,null,null,null,null,null,null,null,null,null,null,null,null,null,null,null,null,null,null,null,null,null,null,null,null,null,null,null,null,null,null,null,null,null,null,null,null,null,null,null,null,null,null,null,null,null,null,null,null,null,null,null,null,null,0]
[null,null,null,null,null,null,null,null,null,null,null,null,null,null,null,null,null,null,null,null,null,null,null,null,null,null,null,null,null,null,null,null,null,null,null,null,null,null,null,null,null,null,null,null,null,null,null,null,null,null,null,null,null,null,null,null,null,null,null,null,null,null,null,null,0]
[null,null,null,null,null,null,null,null,null,null,null,null,null,null,null,null,null,null,null,null,null,null,null,null,null,null,null,null,null,null,null,null,null,null,null,null,null,null,null,null,null,null,null,null,null,null,null,null,null,null,null,null,null,null,null,null,null,null,null,null,null,null,null,null,0]
[null,null,null,null,null,null,null,null,null,null,null,null,null,null,null,null,null,null,null,null,null,null,null,null,null,null,null,null,null,null,null,null,null,null,null,null,null,null,null,null,null,null,null,null,null,null,null,null,null,null,null,null,null,null,null,null,null,null,null,null,null,null,null,null,0]
[null,null,null,null,null,null,null,null,null,null,null,null,null,null,null,null,null,null,null,null,null,null,null,null,null,null,null,null,null,null,null,null,null,null,null,null,null,null,null,null,null,null,null,null,null,null,null,null,null,null,null,null,null,null,null,null,null,null,null,null,null,null,null,null,0]
[null,null,null,null,null,null,null,null,null,null,null,null,null,null,null,null,null,null,null,null,null,null,null,null,null,null,null,null,null,null,null,null,null,null,null,null,null,null,null,null,null,null,null,null,null,null,null,null,null,null,null,null,null,null,null,null,null,null,null,null,null,null,null,null,0]
[null,null,null,null,null,null,null,null,null,null,null,null,null,null,null,null,null,null,null,null,null,null,null,null,null,null,null,null,null,null,null,null,null,null,null,null,null,null,null,null,null,null,null,null,null,null,null,null,null,null,null,null,null,null,null,null,null,null,null,null,null,null,null,null,0]
[null,null,null,null,null,null,null,null,null,null,null,null,null,null,null,null,null,null,null,null,null,null,null,null,null,null,null,null,null,null,null,null,null,null,null,null,null,null,null,null,null,null,null,null,null,null,null,null,null,null,null,null,null,null,null,null,null,null,null,null,null,null,null,null,0]
[null,null,null,null,null,null,null,null,null,null,null,null,null,null,null,null,null,null,null,null,null,null,null,null,null,null,null,null,null,null,null,null,null,null,null,null,null,null,null,null,null,null,null,null,null,null,null,null,null,null,null,null,null,null,null,null,null,null,null,null,null,null,null,null,0]
[null,null,null,null,null,null,null,null,null,null,null,null,null,null,null,null,null,null,null,null,null,null,null,null,null,null,null,null,null,null,null,null,null,null,null,null,null,null,null,null,null,null,null,null,null,null,null,null,null,null,null,null,null,null,null,null,null,null,null,null,null,null,null,null,0]
[null,null,null,null,null,null,null,null,null,null,null,null,null,null,null,null,null,null,null,null,null,null,null,null,null,null,null,null,null,null,null,null,null,null,null,null,null,null,null,null,null,null,null,null,null,null,null,null,null,null,null,null,null,null,null,null,null,null,null,null,null,null,null,null,0]
[null,null,null,null,null,null,null,null,null,null,null,null,null,null,null,null,null,null,null,null,null,null,null,null,null,null,null,null,null,null,null,null,null,null,null,null,null,null,null,null,null,null,null,null,null,null,null,null,null,null,null,null,null,null,null,null,null,null,null,null,null,null,null,null,0]
[null,null,null,null,null,null,null,null,null,null,null,null,null,null,null,null,null,null,null,null,null,null,null,null,null,null,null,null,null,null,null,null,null,null,null,null,null,null,null,null,null,null,null,null,null,null,null,null,null,null,null,null,null,null,null,null,null,null,null,null,null,null,null,null,0]
[null,null,null,null,null,null,null,null,null,null,null,null,null,null,null,null,null,null,null,null,null,null,null,null,null,null,null,null,null,null,null,null,null,null,null,null,null,null,null,null,null,null,null,null,null,null,null,null,null,null,null,null,null,null,null,null,null,null,null,null,null,null,null,null,0]

{"sheet":"Mars","index":4,"n_rows":100,"n_cols":65,"rows_kept":100,"cut":false,"hidden":false,"merged":[[21,0,21,1],[22,0,22,1],[23,0,23,1],[24,0,24,1],[13,0,13,1],[11,0,11,1],[14,0,14,1],[15,0,15,1],[16,0,16,1],[17,0,17,1],[18,0,18,1],[19,0,19,1],[20,0,20,1],[12,0,12,1],[10,0,10,1],[7,0,7,1],[4,44,4,45],[4,46,4,47],[4,48,4,49],[4,50,4,51],[4,32,4,33],[4,34,4,35],[4,36,4,37],[4,38,4,39],[4,40,4,41],[4,42,4,43],[6,0,6,1],[4,30,4,31],[4,26,4,27],[4,28,4,29],[3,22,3,23],[3,24,3,25],[3,38,3,39],[3,40,3,41],[8,0,8,1],[9,0,9,1],[4,56,4,57],[4,52,4,53],[4,54,4,55],[3,62,3,63],[4,2,4,3],[4,4,4,5],[4,6,4,7],[4,8,4,9],[4,10,4,11],[4,12,4,13],[4,14,4,15],[4,16,4,17],[4,18,4,19],[3,50,3,51],[3,52,3,53],[3,54,3,55],[3,56,3,57],[3,58,3,59],[3,48,3,49],[4,62,4,63],[4,58,4,59],[4,60,4,61],[3,42,3,43],[3,44,3,45],[4,20,4,21],[4,22,4,23],[4,24,4,25],[1,42,1,46],[3,60,3,61],[3,30,3,31],[3,32,3,33],[3,34,3,35],[3,36,3,37],[3,46,3,47],[3,26,3,27],[3,28,3,29],[25,0,25,1],[26,0,26,1],[27,0,27,1],[28,0,28,1],[29,0,29,1],[1,47,1,49],[1,55,1,59],[1,60,1,62],[3,2,3,3],[3,4,3,5],[3,6,3,7],[3,8,3,9],[3,10,3,11],[3,12,3,13],[1,3,1,7],[1,8,1,10],[1,16,1,20],[1,21,1,23],[1,29,1,33],[1,34,1,36],[3,14,3,15],[3,16,3,17],[3,18,3,19],[3,20,3,21],[35,0,35,1],[36,0,36,1],[37,0,37,1],[38,0,38,1],[39,0,39,1],[30,0,30,1],[31,0,31,1],[32,0,32,1],[33,0,33,1],[34,0,34,1],[45,0,45,1],[46,0,46,1],[47,0,47,1],[48,0,48,1],[49,0,49,1],[40,0,40,1],[41,0,41,1],[42,0,42,1],[43,0,43,1],[44,0,44,1],[55,0,55,1],[56,0,56,1],[57,0,57,1],[58,0,58,1],[59,0,59,1],[50,0,50,1],[51,0,51,1],[52,0,52,1],[53,0,53,1],[54,0,54,1],[65,0,65,1],[66,0,66,1],[67,0,67,1],[68,0,68,1],[69,0,69,1],[60,0,60,1],[61,0,61,1],[62,0,62,1],[63,0,63,1],[64,0,64,1],[75,0,75,1],[76,0,76,1],[77,0,77,1],[78,0,78,1],[79,0,79,1],[70,0,70,1],[71,0,71,1],[72,0,72,1],[73,0,73,1],[74,0,74,1],[85,0,85,1],[86,0,86,1],[87,0,87,1],[88,0,88,1],[89,0,89,1],[80,0,80,1],[81,0,81,1],[82,0,82,1],[83,0,83,1],[84,0,84,1],[95,0,95,1],[96,0,96,1],[97,0,97,1],[98,0,98,1],[99,0,99,1],[90,0,90,1],[91,0,91,1],[92,0,92,1],[93,0,93,1],[94,0,94,1]]}
[6,{"$f":"C5","v":"2014-03-01"}]
[null,null,null,{"$f":"IF(An!$Q$4=\"\",\"\",An!$Q$4)","v":""},null,null,null,null,{"$f":"C5","v":"2014-03-01"},null,null,null,null,"ACCEUIL",null,null,{"$f":"IF(An!$Q$4=\"\",\"\",An!$Q$4)","v":""},null,null,null,null,{"$f":"C5","v":"2014-03-01"},null,null,null,null,"ACCEUIL",null,null,{"$f":"IF(An!$Q$4=\"\",\"\",An!$Q$4)","v":""},null,null,null,null,{"$f":"C5","v":"2014-03-01"},null,null,null,null,"ACCEUIL",null,null,{"$f":"IF(An!$Q$4=\"\",\"\",An!$Q$4)","v":""},null,null,null,null,{"$f":"C5","v":"2014-03-01"},null,null,null,null,"ACCEUIL",null,null,{"$f":"IF(An!$Q$4=\"\",\"\",An!$Q$4)","v":""},null,null,null,null,{"$f":"C5","v":"2014-03-01"},null,null,"ACCEUIL"]
[]
[null,null,{"$f":"IF(C5=\"\",\"\",IF(LOOKUP(C5,Fériés)=C5,\"\",CHOOSE(WEEKDAY(C5,1),\"Dimanche\",\"Lundi\",\"Mardi\",\"Mercredi\",\"Jeudi\",\"Vendredi\",\"Samedi\")))","v":"Samedi"},null,"Dimanche",null,"Lundi",null,"Mardi",null,"Mercredi",null,"Jeudi",null,"Vendredi",null,"Samedi",null,{"$f":"IF(S5=\"\",\"\",IF(LOOKUP(S5,Fériés)=S5,\"\",CHOOSE(WEEKDAY(S5,1),\"Dimanche\",\"Lundi\",\"Mardi\",\"Mercredi\",\"Jeudi\",\"Vendredi\",\"Samedi\")))","v":"Dimanche"},null,"Lundi",null,"Mardi",null,"Mercredi",null,"Jeudi",null,"Vendredi",null,"Samedi",null,{"$f":"IF(AG5=\"\",\"\",IF(LOOKUP(AG5,Fériés)=AG5,\"\",CHOOSE(WEEKDAY(AG5,1),\"Dimanche\",\"Lundi\",\"Mardi\",\"Mercredi\",\"Jeudi\",\"Vendredi\",\"Samedi\")))","v":"Dimanche"},null,{"$f":"IF(AI5=\"\",\"\",IF(LOOKUP(AI5,Fériés)=AI5,\"\",CHOOSE(WEEKDAY(AI5,1),\"Dimanche\",\"Lundi\",\"Mardi\",\"Mercredi\",\"Jeudi\",\"Vendredi\",\"Samedi\")))","v":"Lundi"},null,"Mardi",null,"Mercredi",null,"Jeudi",null,"Vendredi",null,"Samedi",null,"Dimanche",null,{"$f":"IF(AW5=\"\",\"\",IF(LOOKUP(AW5,Fériés)=AW5,\"\",CHOOSE(WEEKDAY(AW5,1),\"Dimanche\",\"Lundi\",\"Mardi\",\"Mercredi\",\"Jeudi\",\"Vendredi\",\"Samedi\")))","v":"Lundi"},null,{"$f":"IF(AY5=\"\",\"\",IF(LOOKUP(AY5,Fériés)=AY5,\"\",CHOOSE(WEEKDAY(AY5,1),\"Dimanche\",\"Lundi\",\"Mardi\",\"Mercredi\",\"Jeudi\",\"Vendredi\",\"Samedi\")))","v":"Mardi"},null,"Mercredi",null,"Jeudi",null,"Vendredi",null,"Samedi",null,"Dimanche",null,"Lundi"]
[null,null,{"$f":"DATE(Année,3,1)","v":"2014-03-01"},null,{"$f":"IF(C5=\"\",\"\",IF(MONTH(C5+1)<>MONTH(C5),\"\",C5+1))","v":"2014-03-02"},null,{"$f":"IF(E5=\"\",\"\",IF(MONTH(E5+1)<>MONTH(E5),\"\",E5+1))","v":"2014-03-03"},null,{"$f":"IF(G5=\"\",\"\",IF(MONTH(G5+1)<>MONTH(G5),\"\",G5+1))","v":"2014-03-04"},null,{"$f":"IF(I5=\"\",\"\",IF(MONTH(I5+1)<>MONTH(I5),\"\",I5+1))","v":"2014-03-05"},null,{"$f":"IF(K5=\"\",\"\",IF(MONTH(K5+1)<>MONTH(K5),\"\",K5+1))","v":"2014-03-06"},null,{"$f":"IF(M5=\"\",\"\",IF(MONTH(M5+1)<>MONTH(M5),\"\",M5+1))","v":"2014-03-07"},null,{"$f":"IF(O5=\"\",\"\",IF(MONTH(O5+1)<>MONTH(O5),\"\",O5+1))","v":"2014-03-08"},null,{"$f":"IF(Q5=\"\",\"\",IF(MONTH(Q5+1)<>MONTH(Q5),\"\",Q5+1))","v":"2014-03-09"},null,{"$f":"IF(S5=\"\",\"\",IF(MONTH(S5+1)<>MONTH(S5),\"\",S5+1))","v":"2014-03-10"},null,{"$f":"IF(U5=\"\",\"\",IF(MONTH(U5+1)<>MONTH(U5),\"\",U5+1))","v":"2014-03-11"},null,{"$f":"IF(W5=\"\",\"\",IF(MONTH(W5+1)<>MONTH(W5),\"\",W5+1))","v":"2014-03-12"},null,{"$f":"IF(Y5=\"\",\"\",IF(MONTH(Y5+1)<>MONTH(Y5),\"\",Y5+1))","v":"2014-03-13"},null,{"$f":"IF(AA5=\"\",\"\",IF(MONTH(AA5+1)<>MONTH(AA5),\"\",AA5+1))","v":"2014-03-14"},null,{"$f":"IF(AC5=\"\",\"\",IF(MONTH(AC5+1)<>MONTH(AC5),\"\",AC5+1))","v":"2014-03-15"},null,{"$f":"IF(AE5=\"\",\"\",IF(MONTH(AE5+1)<>MONTH(AE5),\"\",AE5+1))","v":"2014-03-16"},null,{"$f":"IF(AG5=\"\",\"\",IF(MONTH(AG5+1)<>MONTH(AG5),\"\",AG5+1))","v":"2014-03-17"},null,{"$f":"IF(AI5=\"\",\"\",IF(MONTH(AI5+1)<>MONTH(AI5),\"\",AI5+1))","v":"2014-03-18"},null,{"$f":"IF(AK5=\"\",\"\",IF(MONTH(AK5+1)<>MONTH(AK5),\"\",AK5+1))","v":"2014-03-19"},null,{"$f":"IF(AM5=\"\",\"\",IF(MONTH(AM5+1)<>MONTH(AM5),\"\",AM5+1))","v":"2014-03-20"},null,{"$f":"IF(AO5=\"\",\"\",IF(MONTH(AO5+1)<>MONTH(AO5),\"\",AO5+1))","v":"2014-03-21"},null,{"$f":"IF(AQ5=\"\",\"\",IF(MONTH(AQ5+1)<>MONTH(AQ5),\"\",AQ5+1))","v":"2014-03-22"},null,{"$f":"IF(AS5=\"\",\"\",IF(MONTH(AS5+1)<>MONTH(AS5),\"\",AS5+1))","v":"2014-03-23"},null,{"$f":"IF(AU5=\"\",\"\",IF(MONTH(AU5+1)<>MONTH(AU5),\"\",AU5+1))","v":"2014-03-24"},null,{"$f":"IF(AW5=\"\",\"\",IF(MONTH(AW5+1)<>MONTH(AW5),\"\",AW5+1))","v":"2014-03-25"},null,{"$f":"IF(AY5=\"\",\"\",IF(MONTH(AY5+1)<>MONTH(AY5),\"\",AY5+1))","v":"2014-03-26"},null,{"$f":"IF(BA5=\"\",\"\",IF(MONTH(BA5+1)<>MONTH(BA5),\"\",BA5+1))","v":"2014-03-27"},null,{"$f":"IF(BC5=\"\",\"\",IF(MONTH(BC5+1)<>MONTH(BC5),\"\",BC5+1))","v":"2014-03-28"},null,{"$f":"IF(BE5=\"\",\"\",IF(MONTH(BE5+1)<>MONTH(BE5),\"\",BE5+1))","v":"2014-03-29"},null,{"$f":"IF(BG5=\"\",\"\",IF(MONTH(BG5+1)<>MONTH(BG5),\"\",BG5+1))","v":"2014-03-30"},null,{"$f":"IF(BI5=\"\",\"\",IF(MONTH(BI5+1)<>MONTH(BI5),\"\",BI5+1))","v":"2014-03-31"}]
[null,null,"Matin","Après midi","Matin","Après midi","Matin","Après midi","Matin","Après midi","Matin","Après midi","Matin","Après midi","Matin","Après midi","Matin","Après midi","Matin","Après midi","Matin","Après midi","Matin","Après midi","Matin","Après midi","Matin","Après midi","Matin","Après midi","Matin","Après midi","Matin","Après midi","Matin","Après midi","Matin","Après midi","Matin","Après midi","Matin","Après midi","Matin","Après midi","Matin","Après midi","Matin","Après midi","Matin","Après midi","Matin","Après midi","Matin","Après midi","Matin","Après midi","Matin","Après midi",{"$f":"IF(BG5=\"\",\"\",\"Matin\")","v":"Matin"},{"$f":"IF(BG5=\"\",\"\",\"Apres midi\")","v":"Apres midi"},{"$f":"IF(BI5=\"\",\"\",\"Matin\")","v":"Matin"},{"$f":"IF(BI5=\"\",\"\",\"Apres midi\")","v":"Apres midi"},{"$f":"IF(BK5=\"\",\"\",\"Matin\")","v":"Matin"},{"$f":"IF(BK5=\"\",\"\",\"Apres midi\")","v":"Apres midi"}]
[null,null,null,null,null,null,null,null,null,null,null,null,null,null,null,null,null,null,null,null,null,null,null,null,null,null,null,null,null,null,null,null,null,null,null,null,null,null,null,null,null,null,null,null,null,null,null,null,null,null,null,null,null,null,null,null,null,null,null,null,null,null,null,null,{"$f":"COUNTA(C7:BL7)/2","v":0}]
[null,null,null,null,null,null,null,null,null,null,null,null,null,null,null,null,null,null,null,null,null,null,null,null,null,null,null,null,null,null,null,null,null,null,null,null,null,null,null,null,null,null,null,null,null,null,null,null,null,null,null,null,null,null,null,null,null,null,null,null,null,null,null,null,{"$f":"COUNTA(C8:BL8)/2","v":0}]
[null,null,null,null,null,null,null,null,null,null,null,null,null,null,null,null,null,null,null,null,null,null,null,null,null,null,null,null,null,null,null,null,null,null,null,null,null,null,null,null,null,null,null,null,null,null,null,null,null,null,null,null,null,null,null,null,null,null,null,null,null,null,null,null,0]
[null,null,null,null,null,null,null,null,null,null,null,null,null,null,null,null,null,null,null,null,null,null,null,null,null,null,null,null,null,null,null,null,null,null,null,null,null,null,null,null,null,null,null,null,null,null,null,null,null,null,null,null,null,null,null,null,null,null,null,null,null,null,null,null,0]
[null,null,null,null,null,null,null,null,null,null,null,null,null,null,null,null,null,null,null,null,null,null,null,null,null,null,null,null,null,null,null,null,null,null,null,null,null,null,null,null,null,null,null,null,null,null,null,null,null,null,null,null,null,null,null,null,null,null,null,null,null,null,null,null,0]
[null,null,null,null,null,null,null,null,null,null,null,null,null,null,null,null,null,null,null,null,null,null,null,null,null,null,null,null,null,null,null,null,null,null,null,null,null,null,null,null,null,null,null,null,null,null,null,null,null,null,null,null,null,null,null,null,null,null,null,null,null,null,null,null,0]
[null,null,null,null,null,null,null,null,null,null,null,null,null,null,null,null,null,null,null,null,null,null,null,null,null,null,null,null,null,null,null,null,null,null,null,null,null,null,null,null,null,null,null,null,null,null,null,null,null,null,null,null,null,null,null,null,null,null,null,null,null,null,null,null,0]
[null,null,null,null,null,null,null,null,null,null,null,null,null,null,null,null,null,null,null,null,null,null,null,null,null,null,null,null,null,null,null,null,null,null,null,null,null,null,null,null,null,null,null,null,null,null,null,null,null,null,null,null,null,null,null,null,null,null,null,null,null,null,null,null,0]
[null,null,null,null,null,null,null,null,null,null,null,null,null,null,null,null,null,null,null,null,null,null,null,null,null,null,null,null,null,null,null,null,null,null,null,null,null,null,null,null,null,null,null,null,null,null,null,null,null,null,null,null,null,null,null,null,null,null,null,null,null,null,null,null,0]
[null,null,null,null,null,null,null,null,null,null,null,null,null,null,null,null,null,null,null,null,null,null,null,null,null,null,null,null,null,null,null,null,null,null,null,null,null,null,null,null,null,null,null,null,null,null,null,null,null,null,null,null,null,null,null,null,null,null,null,null,null,null,null,null,0]
[null,null,null,null,null,null,null,null,null,null,null,null,null,null,null,null,null,null,null,null,null,null,null,null,null,null,null,null,null,null,null,null,null,null,null,null,null,null,null,null,null,null,null,null,null,null,null,null,null,null,null,null,null,null,null,null,null,null,null,null,null,null,null,null,0]
[null,null,null,null,null,null,null,null,null,null,null,null,null,null,null,null,null,null,null,null,null,null,null,null,null,null,null,null,null,null,null,null,null,null,null,null,null,null,null,null,null,null,null,null,null,null,null,null,null,null,null,null,null,null,null,null,null,null,null,null,null,null,null,null,0]
[null,null,null,null,null,null,null,null,null,null,null,null,null,null,null,null,null,null,null,null,null,null,null,null,null,null,null,null,null,null,null,null,null,null,null,null,null,null,null,null,null,null,null,null,null,null,null,null,null,null,null,null,null,null,null,null,null,null,null,null,null,null,null,null,0]
[null,null,null,null,null,null,null,null,null,null,null,null,null,null,null,null,null,null,null,null,null,null,null,null,null,null,null,null,null,null,null,null,null,null,null,null,null,null,null,null,null,null,null,null,null,null,null,null,null,null,null,null,null,null,null,null,null,null,null,null,null,null,null,null,0]
[null,null,null,null,null,null,null,null,null,null,null,null,null,null,null,null,null,null,null,null,null,null,null,null,null,null,null,null,null,null,null,null,null,null,null,null,null,null,null,null,null,null,null,null,null,null,null,null,null,null,null,null,null,null,null,null,null,null,null,null,null,null,null,null,0]
[null,null,null,null,null,null,null,null,null,null,null,null,null,null,null,null,null,null,null,null,null,null,null,null,null,null,null,null,null,null,null,null,null,null,null,null,null,null,null,null,null,null,null,null,null,null,null,null,null,null,null,null,null,null,null,null,null,null,null,null,null,null,null,null,0]
[null,null,null,null,null,null,null,null,null,null,null,null,null,null,null,null,null,null,null,null,null,null,null,null,null,null,null,null,null,null,null,null,null,null,null,null,null,null,null,null,null,null,null,null,null,null,null,null,null,null,null,null,null,null,null,null,null,null,null,null,null,null,null,null,0]
[null,null,null,null,null,null,null,null,null,null,null,null,null,null,null,null,null,null,null,null,null,null,null,null,null,null,null,null,null,null,null,null,null,null,null,null,null,null,null,null,null,null,null,null,null,null,null,null,null,null,null,null,null,null,null,null,null,null,null,null,null,null,null,null,0]
[null,null,null,null,null,null,null,null,null,null,null,null,null,null,null,null,null,null,null,null,null,null,null,null,null,null,null,null,null,null,null,null,null,null,null,null,null,null,null,null,null,null,null,null,null,null,null,null,null,null,null,null,null,null,null,null,null,null,null,null,null,null,null,null,0]
[null,null,null,null,null,null,null,null,null,null,null,null,null,null,null,null,null,null,null,null,null,null,null,null,null,null,null,null,null,null,null,null,null,null,null,null,null,null,null,null,null,null,null,null,null,null,null,null,null,null,null,null,null,null,null,null,null,null,null,null,null,null,null,null,0]
[null,null,null,null,null,null,null,null,null,null,null,null,null,null,null,null,null,null,null,null,null,null,null,null,null,null,null,null,null,null,null,null,null,null,null,null,null,null,null,null,null,null,null,null,null,null,null,null,null,null,null,null,null,null,null,null,null,null,null,null,null,null,null,null,0]
[null,null,null,null,null,null,null,null,null,null,null,null,null,null,null,null,null,null,null,null,null,null,null,null,null,null,null,null,null,null,null,null,null,null,null,null,null,null,null,null,null,null,null,null,null,null,null,null,null,null,null,null,null,null,null,null,null,null,null,null,null,null,null,null,0]
[null,null,null,null,null,null,null,null,null,null,null,null,null,null,null,null,null,null,null,null,null,null,null,null,null,null,null,null,null,null,null,null,null,null,null,null,null,null,null,null,null,null,null,null,null,null,null,null,null,null,null,null,null,null,null,null,null,null,null,null,null,null,null,null,0]
[null,null,null,null,null,null,null,null,null,null,null,null,null,null,null,null,null,null,null,null,null,null,null,null,null,null,null,null,null,null,null,null,null,null,null,null,null,null,null,null,null,null,null,null,null,null,null,null,null,null,null,null,null,null,null,null,null,null,null,null,null,null,null,null,0]
[null,null,null,null,null,null,null,null,null,null,null,null,null,null,null,null,null,null,null,null,null,null,null,null,null,null,null,null,null,null,null,null,null,null,null,null,null,null,null,null,null,null,null,null,null,null,null,null,null,null,null,null,null,null,null,null,null,null,null,null,null,null,null,null,0]
[null,null,null,null,null,null,null,null,null,null,null,null,null,null,null,null,null,null,null,null,null,null,null,null,null,null,null,null,null,null,null,null,null,null,null,null,null,null,null,null,null,null,null,null,null,null,null,null,null,null,null,null,null,null,null,null,null,null,null,null,null,null,null,null,0]
[null,null,null,null,null,null,null,null,null,null,null,null,null,null,null,null,null,null,null,null,null,null,null,null,null,null,null,null,null,null,null,null,null,null,null,null,null,null,null,null,null,null,null,null,null,null,null,null,null,null,null,null,null,null,null,null,null,null,null,null,null,null,null,null,0]
[null,null,null,null,null,null,null,null,null,null,null,null,null,null,null,null,null,null,null,null,null,null,null,null,null,null,null,null,null,null,null,null,null,null,null,null,null,null,null,null,null,null,null,null,null,null,null,null,null,null,null,null,null,null,null,null,null,null,null,null,null,null,null,null,0]
[null,null,null,null,null,null,null,null,null,null,null,null,null,null,null,null,null,null,null,null,null,null,null,null,null,null,null,null,null,null,null,null,null,null,null,null,null,null,null,null,null,null,null,null,null,null,null,null,null,null,null,null,null,null,null,null,null,null,null,null,null,null,null,null,0]
[null,null,null,null,null,null,null,null,null,null,null,null,null,null,null,null,null,null,null,null,null,null,null,null,null,null,null,null,null,null,null,null,null,null,null,null,null,null,null,null,null,null,null,null,null,null,null,null,null,null,null,null,null,null,null,null,null,null,null,null,null,null,null,null,0]
[null,null,null,null,null,null,null,null,null,null,null,null,null,null,null,null,null,null,null,null,null,null,null,null,null,null,null,null,null,null,null,null,null,null,null,null,null,null,null,null,null,null,null,null,null,null,null,null,null,null,null,null,null,null,null,null,null,null,null,null,null,null,null,null,0]
[null,null,null,null,null,null,null,null,null,null,null,null,null,null,null,null,null,null,null,null,null,null,null,null,null,null,null,null,null,null,null,null,null,null,null,null,null,null,null,null,null,null,null,null,null,null,null,null,null,null,null,null,null,null,null,null,null,null,null,null,null,null,null,null,0]
[null,null,null,null,null,null,null,null,null,null,null,null,null,null,null,null,null,null,null,null,null,null,null,null,null,null,null,null,null,null,null,null,null,null,null,null,null,null,null,null,null,null,null,null,null,null,null,null,null,null,null,null,null,null,null,null,null,null,null,null,null,null,null,null,0]
[null,null,null,null,null,null,null,null,null,null,null,null,null,null,null,null,null,null,null,null,null,null,null,null,null,null,null,null,null,null,null,null,null,null,null,null,null,null,null,null,null,null,null,null,null,null,null,null,null,null,null,null,null,null,null,null,null,null,null,null,null,null,null,null,0]
[null,null,null,null,null,null,null,null,null,null,null,null,null,null,null,null,null,null,null,null,null,null,null,null,null,null,null,null,null,null,null,null,null,null,null,null,null,null,null,null,null,null,null,null,null,null,null,null,null,null,null,null,null,null,null,null,null,null,null,null,null,null,null,null,0]
[null,null,null,null,null,null,null,null,null,null,null,null,null,null,null,null,null,null,null,null,null,null,null,null,null,null,null,null,null,null,null,null,null,null,null,null,null,null,null,null,null,null,null,null,null,null,null,null,null,null,null,null,null,null,null,null,null,null,null,null,null,null,null,null,0]
[null,null,null,null,null,null,null,null,null,null,null,null,null,null,null,null,null,null,null,null,null,null,null,null,null,null,null,null,null,null,null,null,null,null,null,null,null,null,null,null,null,null,null,null,null,null,null,null,null,null,null,null,null,null,null,null,null,null,null,null,null,null,null,null,0]
[null,null,null,null,null,null,null,null,null,null,null,null,null,null,null,null,null,null,null,null,null,null,null,null,null,null,null,null,null,null,null,null,null,null,null,null,null,null,null,null,null,null,null,null,null,null,null,null,null,null,null,null,null,null,null,null,null,null,null,null,null,null,null,null,0]
[null,null,null,null,null,null,null,null,null,null,null,null,null,null,null,null,null,null,null,null,null,null,null,null,null,null,null,null,null,null,null,null,null,null,null,null,null,null,null,null,null,null,null,null,null,null,null,null,null,null,null,null,null,null,null,null,null,null,null,null,null,null,null,null,0]
[null,null,null,null,null,null,null,null,null,null,null,null,null,null,null,null,null,null,null,null,null,null,null,null,null,null,null,null,null,null,null,null,null,null,null,null,null,null,null,null,null,null,null,null,null,null,null,null,null,null,null,null,null,null,null,null,null,null,null,null,null,null,null,null,0]
[null,null,null,null,null,null,null,null,null,null,null,null,null,null,null,null,null,null,null,null,null,null,null,null,null,null,null,null,null,null,null,null,null,null,null,null,null,null,null,null,null,null,null,null,null,null,null,null,null,null,null,null,null,null,null,null,null,null,null,null,null,null,null,null,0]
[null,null,null,null,null,null,null,null,null,null,null,null,null,null,null,null,null,null,null,null,null,null,null,null,null,null,null,null,null,null,null,null,null,null,null,null,null,null,null,null,null,null,null,null,null,null,null,null,null,null,null,null,null,null,null,null,null,null,null,null,null,null,null,null,0]
[null,null,null,null,null,null,null,null,null,null,null,null,null,null,null,null,null,null,null,null,null,null,null,null,null,null,null,null,null,null,null,null,null,null,null,null,null,null,null,null,null,null,null,null,null,null,null,null,null,null,null,null,null,null,null,null,null,null,null,null,null,null,null,null,0]
[null,null,null,null,null,null,null,null,null,null,null,null,null,null,null,null,null,null,null,null,null,null,null,null,null,null,null,null,null,null,null,null,null,null,null,null,null,null,null,null,null,null,null,null,null,null,null,null,null,null,null,null,null,null,null,null,null,null,null,null,null,null,null,null,0]
[null,null,null,null,null,null,null,null,null,null,null,null,null,null,null,null,null,null,null,null,null,null,null,null,null,null,null,null,null,null,null,null,null,null,null,null,null,null,null,null,null,null,null,null,null,null,null,null,null,null,null,null,null,null,null,null,null,null,null,null,null,null,null,null,0]
[null,null,null,null,null,null,null,null,null,null,null,null,null,null,null,null,null,null,null,null,null,null,null,null,null,null,null,null,null,null,null,null,null,null,null,null,null,null,null,null,null,null,null,null,null,null,null,null,null,null,null,null,null,null,null,null,null,null,null,null,null,null,null,null,0]
[null,null,null,null,null,null,null,null,null,null,null,null,null,null,null,null,null,null,null,null,null,null,null,null,null,null,null,null,null,null,null,null,null,null,null,null,null,null,null,null,null,null,null,null,null,null,null,null,null,null,null,null,null,null,null,null,null,null,null,null,null,null,null,null,0]
[null,null,null,null,null,null,null,null,null,null,null,null,null,null,null,null,null,null,null,null,null,null,null,null,null,null,null,null,null,null,null,null,null,null,null,null,null,null,null,null,null,null,null,null,null,null,null,null,null,null,null,null,null,null,null,null,null,null,null,null,null,null,null,null,0]
[null,null,null,null,null,null,null,null,null,null,null,null,null,null,null,null,null,null,null,null,null,null,null,null,null,null,null,null,null,null,null,null,null,null,null,null,null,null,null,null,null,null,null,null,null,null,null,null,null,null,null,null,null,null,null,null,null,null,null,null,null,null,null,null,0]
[null,null,null,null,null,null,null,null,null,null,null,null,null,null,null,null,null,null,null,null,null,null,null,null,null,null,null,null,null,null,null,null,null,null,null,null,null,null,null,null,null,null,null,null,null,null,null,null,null,null,null,null,null,null,null,null,null,null,null,null,null,null,null,null,0]
[null,null,null,null,null,null,null,null,null,null,null,null,null,null,null,null,null,null,null,null,null,null,null,null,null,null,null,null,null,null,null,null,null,null,null,null,null,null,null,null,null,null,null,null,null,null,null,null,null,null,null,null,null,null,null,null,null,null,null,null,null,null,null,null,0]
[null,null,null,null,null,null,null,null,null,null,null,null,null,null,null,null,null,null,null,null,null,null,null,null,null,null,null,null,null,null,null,null,null,null,null,null,null,null,null,null,null,null,null,null,null,null,null,null,null,null,null,null,null,null,null,null,null,null,null,null,null,null,null,null,0]
[null,null,null,null,null,null,null,null,null,null,null,null,null,null,null,null,null,null,null,null,null,null,null,null,null,null,null,null,null,null,null,null,null,null,null,null,null,null,null,null,null,null,null,null,null,null,null,null,null,null,null,null,null,null,null,null,null,null,null,null,null,null,null,null,0]
[null,null,null,null,null,null,null,null,null,null,null,null,null,null,null,null,null,null,null,null,null,null,null,null,null,null,null,null,null,null,null,null,null,null,null,null,null,null,null,null,null,null,null,null,null,null,null,null,null,null,null,null,null,null,null,null,null,null,null,null,null,null,null,null,0]
[null,null,null,null,null,null,null,null,null,null,null,null,null,null,null,null,null,null,null,null,null,null,null,null,null,null,null,null,null,null,null,null,null,null,null,null,null,null,null,null,null,null,null,null,null,null,null,null,null,null,null,null,null,null,null,null,null,null,null,null,null,null,null,null,0]
[null,null,null,null,null,null,null,null,null,null,null,null,null,null,null,null,null,null,null,null,null,null,null,null,null,null,null,null,null,null,null,null,null,null,null,null,null,null,null,null,null,null,null,null,null,null,null,null,null,null,null,null,null,null,null,null,null,null,null,null,null,null,null,null,0]
[null,null,null,null,null,null,null,null,null,null,null,null,null,null,null,null,null,null,null,null,null,null,null,null,null,null,null,null,null,null,null,null,null,null,null,null,null,null,null,null,null,null,null,null,null,null,null,null,null,null,null,null,null,null,null,null,null,null,null,null,null,null,null,null,0]
[null,null,null,null,null,null,null,null,null,null,null,null,null,null,null,null,null,null,null,null,null,null,null,null,null,null,null,null,null,null,null,null,null,null,null,null,null,null,null,null,null,null,null,null,null,null,null,null,null,null,null,null,null,null,null,null,null,null,null,null,null,null,null,null,0]
[null,null,null,null,null,null,null,null,null,null,null,null,null,null,null,null,null,null,null,null,null,null,null,null,null,null,null,null,null,null,null,null,null,null,null,null,null,null,null,null,null,null,null,null,null,null,null,null,null,null,null,null,null,null,null,null,null,null,null,null,null,null,null,null,0]
[null,null,null,null,null,null,null,null,null,null,null,null,null,null,null,null,null,null,null,null,null,null,null,null,null,null,null,null,null,null,null,null,null,null,null,null,null,null,null,null,null,null,null,null,null,null,null,null,null,null,null,null,null,null,null,null,null,null,null,null,null,null,null,null,0]
[null,null,null,null,null,null,null,null,null,null,null,null,null,null,null,null,null,null,null,null,null,null,null,null,null,null,null,null,null,null,null,null,null,null,null,null,null,null,null,null,null,null,null,null,null,null,null,null,null,null,null,null,null,null,null,null,null,null,null,null,null,null,null,null,0]
[null,null,null,null,null,null,null,null,null,null,null,null,null,null,null,null,null,null,null,null,null,null,null,null,null,null,null,null,null,null,null,null,null,null,null,null,null,null,null,null,null,null,null,null,null,null,null,null,null,null,null,null,null,null,null,null,null,null,null,null,null,null,null,null,0]
[null,null,null,null,null,null,null,null,null,null,null,null,null,null,null,null,null,null,null,null,null,null,null,null,null,null,null,null,null,null,null,null,null,null,null,null,null,null,null,null,null,null,null,null,null,null,null,null,null,null,null,null,null,null,null,null,null,null,null,null,null,null,null,null,0]
[null,null,null,null,null,null,null,null,null,null,null,null,null,null,null,null,null,null,null,null,null,null,null,null,null,null,null,null,null,null,null,null,null,null,null,null,null,null,null,null,null,null,null,null,null,null,null,null,null,null,null,null,null,null,null,null,null,null,null,null,null,null,null,null,0]
[null,null,null,null,null,null,null,null,null,null,null,null,null,null,null,null,null,null,null,null,null,null,null,null,null,null,null,null,null,null,null,null,null,null,null,null,null,null,null,null,null,null,null,null,null,null,null,null,null,null,null,null,null,null,null,null,null,null,null,null,null,null,null,null,0]
[null,null,null,null,null,null,null,null,null,null,null,null,null,null,null,null,null,null,null,null,null,null,null,null,null,null,null,null,null,null,null,null,null,null,null,null,null,null,null,null,null,null,null,null,null,null,null,null,null,null,null,null,null,null,null,null,null,null,null,null,null,null,null,null,{"$f":"COUNTA(C72:BL72)/2","v":0}]
[null,null,null,null,null,null,null,null,null,null,null,null,null,null,null,null,null,null,null,null,null,null,null,null,null,null,null,null,null,null,null,null,null,null,null,null,null,null,null,null,null,null,null,null,null,null,null,null,null,null,null,null,null,null,null,null,null,null,null,null,null,null,null,null,0]
[null,null,null,null,null,null,null,null,null,null,null,null,null,null,null,null,null,null,null,null,null,null,null,null,null,null,null,null,null,null,null,null,null,null,null,null,null,null,null,null,null,null,null,null,null,null,null,null,null,null,null,null,null,null,null,null,null,null,null,null,null,null,null,null,0]
[null,null,null,null,null,null,null,null,null,null,null,null,null,null,null,null,null,null,null,null,null,null,null,null,null,null,null,null,null,null,null,null,null,null,null,null,null,null,null,null,null,null,null,null,null,null,null,null,null,null,null,null,null,null,null,null,null,null,null,null,null,null,null,null,0]
[null,null,null,null,null,null,null,null,null,null,null,null,null,null,null,null,null,null,null,null,null,null,null,null,null,null,null,null,null,null,null,null,null,null,null,null,null,null,null,null,null,null,null,null,null,null,null,null,null,null,null,null,null,null,null,null,null,null,null,null,null,null,null,null,0]
[null,null,null,null,null,null,null,null,null,null,null,null,null,null,null,null,null,null,null,null,null,null,null,null,null,null,null,null,null,null,null,null,null,null,null,null,null,null,null,null,null,null,null,null,null,null,null,null,null,null,null,null,null,null,null,null,null,null,null,null,null,null,null,null,0]
[null,null,null,null,null,null,null,null,null,null,null,null,null,null,null,null,null,null,null,null,null,null,null,null,null,null,null,null,null,null,null,null,null,null,null,null,null,null,null,null,null,null,null,null,null,null,null,null,null,null,null,null,null,null,null,null,null,null,null,null,null,null,null,null,0]
[null,null,null,null,null,null,null,null,null,null,null,null,null,null,null,null,null,null,null,null,null,null,null,null,null,null,null,null,null,null,null,null,null,null,null,null,null,null,null,null,null,null,null,null,null,null,null,null,null,null,null,null,null,null,null,null,null,null,null,null,null,null,null,null,0]
[null,null,null,null,null,null,null,null,null,null,null,null,null,null,null,null,null,null,null,null,null,null,null,null,null,null,null,null,null,null,null,null,null,null,null,null,null,null,null,null,null,null,null,null,null,null,null,null,null,null,null,null,null,null,null,null,null,null,null,null,null,null,null,null,0]
[null,null,null,null,null,null,null,null,null,null,null,null,null,null,null,null,null,null,null,null,null,null,null,null,null,null,null,null,null,null,null,null,null,null,null,null,null,null,null,null,null,null,null,null,null,null,null,null,null,null,null,null,null,null,null,null,null,null,null,null,null,null,null,null,0]
[null,null,null,null,null,null,null,null,null,null,null,null,null,null,null,null,null,null,null,null,null,null,null,null,null,null,null,null,null,null,null,null,null,null,null,null,null,null,null,null,null,null,null,null,null,null,null,null,null,null,null,null,null,null,null,null,null,null,null,null,null,null,null,null,0]
[null,null,null,null,null,null,null,null,null,null,null,null,null,null,null,null,null,null,null,null,null,null,null,null,null,null,null,null,null,null,null,null,null,null,null,null,null,null,null,null,null,null,null,null,null,null,null,null,null,null,null,null,null,null,null,null,null,null,null,null,null,null,null,null,0]
[null,null,null,null,null,null,null,null,null,null,null,null,null,null,null,null,null,null,null,null,null,null,null,null,null,null,null,null,null,null,null,null,null,null,null,null,null,null,null,null,null,null,null,null,null,null,null,null,null,null,null,null,null,null,null,null,null,null,null,null,null,null,null,null,0]
[null,null,null,null,null,null,null,null,null,null,null,null,null,null,null,null,null,null,null,null,null,null,null,null,null,null,null,null,null,null,null,null,null,null,null,null,null,null,null,null,null,null,null,null,null,null,null,null,null,null,null,null,null,null,null,null,null,null,null,null,null,null,null,null,0]
[null,null,null,null,null,null,null,null,null,null,null,null,null,null,null,null,null,null,null,null,null,null,null,null,null,null,null,null,null,null,null,null,null,null,null,null,null,null,null,null,null,null,null,null,null,null,null,null,null,null,null,null,null,null,null,null,null,null,null,null,null,null,null,null,0]
[null,null,null,null,null,null,null,null,null,null,null,null,null,null,null,null,null,null,null,null,null,null,null,null,null,null,null,null,null,null,null,null,null,null,null,null,null,null,null,null,null,null,null,null,null,null,null,null,null,null,null,null,null,null,null,null,null,null,null,null,null,null,null,null,0]
[null,null,null,null,null,null,null,null,null,null,null,null,null,null,null,null,null,null,null,null,null,null,null,null,null,null,null,null,null,null,null,null,null,null,null,null,null,null,null,null,null,null,null,null,null,null,null,null,null,null,null,null,null,null,null,null,null,null,null,null,null,null,null,null,0]
[null,null,null,null,null,null,null,null,null,null,null,null,null,null,null,null,null,null,null,null,null,null,null,null,null,null,null,null,null,null,null,null,null,null,null,null,null,null,null,null,null,null,null,null,null,null,null,null,null,null,null,null,null,null,null,null,null,null,null,null,null,null,null,null,0]
[null,null,null,null,null,null,null,null,null,null,null,null,null,null,null,null,null,null,null,null,null,null,null,null,null,null,null,null,null,null,null,null,null,null,null,null,null,null,null,null,null,null,null,null,null,null,null,null,null,null,null,null,null,null,null,null,null,null,null,null,null,null,null,null,0]
[null,null,null,null,null,null,null,null,null,null,null,null,null,null,null,null,null,null,null,null,null,null,null,null,null,null,null,null,null,null,null,null,null,null,null,null,null,null,null,null,null,null,null,null,null,null,null,null,null,null,null,null,null,null,null,null,null,null,null,null,null,null,null,null,0]
[null,null,null,null,null,null,null,null,null,null,null,null,null,null,null,null,null,null,null,null,null,null,null,null,null,null,null,null,null,null,null,null,null,null,null,null,null,null,null,null,null,null,null,null,null,null,null,null,null,null,null,null,null,null,null,null,null,null,null,null,null,null,null,null,0]
[null,null,null,null,null,null,null,null,null,null,null,null,null,null,null,null,null,null,null,null,null,null,null,null,null,null,null,null,null,null,null,null,null,null,null,null,null,null,null,null,null,null,null,null,null,null,null,null,null,null,null,null,null,null,null,null,null,null,null,null,null,null,null,null,0]
[null,null,null,null,null,null,null,null,null,null,null,null,null,null,null,null,null,null,null,null,null,null,null,null,null,null,null,null,null,null,null,null,null,null,null,null,null,null,null,null,null,null,null,null,null,null,null,null,null,null,null,null,null,null,null,null,null,null,null,null,null,null,null,null,0]
[null,null,null,null,null,null,null,null,null,null,null,null,null,null,null,null,null,null,null,null,null,null,null,null,null,null,null,null,null,null,null,null,null,null,null,null,null,null,null,null,null,null,null,null,null,null,null,null,null,null,null,null,null,null,null,null,null,null,null,null,null,null,null,null,0]
[null,null,null,null,null,null,null,null,null,null,null,null,null,null,null,null,null,null,null,null,null,null,null,null,null,null,null,null,null,null,null,null,null,null,null,null,null,null,null,null,null,null,null,null,null,null,null,null,null,null,null,null,null,null,null,null,null,null,null,null,null,null,null,null,0]
[null,null,null,null,null,null,null,null,null,null,null,null,null,null,null,null,null,null,null,null,null,null,null,null,null,null,null,null,null,null,null,null,null,null,null,null,null,null,null,null,null,null,null,null,null,null,null,null,null,null,null,null,null,null,null,null,null,null,null,null,null,null,null,null,0]
[null,null,null,null,null,null,null,null,null,null,null,null,null,null,null,null,null,null,null,null,null,null,null,null,null,null,null,null,null,null,null,null,null,null,null,null,null,null,null,null,null,null,null,null,null,null,null,null,null,null,null,null,null,null,null,null,null,null,null,null,null,null,null,null,0]
[null,null,null,null,null,null,null,null,null,null,null,null,null,null,null,null,null,null,null,null,null,null,null,null,null,null,null,null,null,null,null,null,null,null,null,null,null,null,null,null,null,null,null,null,null,null,null,null,null,null,null,null,null,null,null,null,null,null,null,null,null,null,null,null,0]
[null,null,null,null,null,null,null,null,null,null,null,null,null,null,null,null,null,null,null,null,null,null,null,null,null,null,null,null,null,null,null,null,null,null,null,null,null,null,null,null,null,null,null,null,null,null,null,null,null,null,null,null,null,null,null,null,null,null,null,null,null,null,null,null,0]

{"sheet":"Avril","index":5,"n_rows":100,"n_cols":65,"rows_kept":100,"cut":false,"hidden":false,"merged":[[17,0,17,1],[18,0,18,1],[19,0,19,1],[20,0,20,1],[13,0,13,1],[8,0,8,1],[9,0,9,1],[12,0,12,1],[10,0,10,1],[11,0,11,1],[14,0,14,1],[15,0,15,1],[16,0,16,1],[7,0,7,1],[4,44,4,45],[4,32,4,33],[4,34,4,35],[4,36,4,37],[4,38,4,39],[4,40,4,41],[4,42,4,43],[4,20,4,21],[4,14,4,15],[4,16,4,17],[4,18,4,19],[4,2,4,3],[4,4,4,5],[4,6,4,7],[4,8,4,9],[4,62,4,63],[6,0,6,1],[4,52,4,53],[4,54,4,55],[4,30,4,31],[4,58,4,59],[4,60,4,61],[4,22,4,23],[4,24,4,25],[4,26,4,27],[4,28,4,29],[4,56,4,57],[4,46,4,47],[4,48,4,49],[4,50,4,51],[4,12,4,13],[4,10,4,11],[1,42,1,46],[3,32,3,33],[3,34,3,35],[3,36,3,37],[3,50,3,51],[3,48,3,49],[3,26,3,27],[3,28,3,29],[3,22,3,23],[3,24,3,25],[3,38,3,39],[3,40,3,41],[3,42,3,43],[3,44,3,45],[3,46,3,47],[3,30,3,31],[1,47,1,49],[1,55,1,59],[1,60,1,62],[3,2,3,3],[3,4,3,5],[3,6,3,7],[3,8,3,9],[3,10,3,11],[3,12,3,13],[1,3,1,7],[1,8,1,10],[1,16,1,20],[1,21,1,23],[1,29,1,33],[1,34,1,36],[3,14,3,15],[3,62,3,63],[3,52,3,53],[3,54,3,55],[3,56,3,57],[3,58,3,59],[3,60,3,61],[3,16,3,17],[3,18,3,19],[3,20,3,21],[26,0,26,1],[27,0,27,1],[28,0,28,1],[29,0,29,1],[30,0,30,1],[21,0,21,1],[22,0,22,1],[23,0,23,1],[24,0,24,1],[25,0,25,1],[36,0,36,1],[37,0,37,1],[38,0,38,1],[39,0,39,1],[40,0,40,1],[31,0,31,1],[32,0,32,1],[33,0,33,1],[34,0,34,1],[35,0,35,1],[46,0,46,1],[47,0,47,1],[48,0,48,1],[49,0,49,1],[50,0,50,1],[41,0,41,1],[42,0,42,1],[43,0,43,1],[44,0,44,1],[45,0,45,1],[56,0,56,1],[57,0,57,1],[58,0,58,1],[59,0,59,1],[60,0,60,1],[51,0,51,1],[52,0,52,1],[53,0,53,1],[54,0,54,1],[55,0,55,1],[66,0,66,1],[67,0,67,1],[68,0,68,1],[69,0,69,1],[70,0,70,1],[61,0,61,1],[62,0,62,1],[63,0,63,1],[64,0,64,1],[65,0,65,1],[76,0,76,1],[77,0,77,1],[78,0,78,1],[79,0,79,1],[80,0,80,1],[71,0,71,1],[72,0,72,1],[73,0,73,1],[74,0,74,1],[75,0,75,1],[86,0,86,1],[87,0,87,1],[88,0,88,1],[89,0,89,1],[90,0,90,1],[81,0,81,1],[82,0,82,1],[83,0,83,1],[84,0,84,1],[85,0,85,1],[96,0,96,1],[97,0,97,1],[98,0,98,1],[99,0,99,1],[91,0,91,1],[92,0,92,1],[93,0,93,1],[94,0,94,1],[95,0,95,1]]}
[28,{"$f":"C5","v":"2014-04-01"}]
[null,null,null,{"$f":"IF(An!$Q$4=\"\",\"\",An!$Q$4)","v":""},null,null,null,null,{"$f":"C5","v":"2014-04-01"},null,null,null,null,"ACCEUIL",null,null,{"$f":"IF(An!$Q$4=\"\",\"\",An!$Q$4)","v":""},null,null,null,null,{"$f":"C5","v":"2014-04-01"},null,null,null,null,"ACCEUIL",null,null,{"$f":"IF(An!$Q$4=\"\",\"\",An!$Q$4)","v":""},null,null,null,null,{"$f":"C5","v":"2014-04-01"},null,null,null,null,"ACCEUIL",null,null,{"$f":"IF(An!$Q$4=\"\",\"\",An!$Q$4)","v":""},null,null,null,null,{"$f":"C5","v":"2014-04-01"},null,null,null,null,"ACCEUIL",null,null,{"$f":"IF(An!$Q$4=\"\",\"\",An!$Q$4)","v":""},null,null,null,null,{"$f":"C5","v":"2014-04-01"},null,null,"ACCEUIL"]
[]
[null,null,{"$f":"IF(C5=\"\",\"\",IF(LOOKUP(C5,Fériés)=C5,\"\",CHOOSE(WEEKDAY(C5,1),\"Dimanche\",\"Lundi\",\"Mardi\",\"Mercredi\",\"Jeudi\",\"Vendredi\",\"Samedi\")))","v":"Mardi"},null,"Mercredi",null,"Jeudi",null,"Vendredi",null,"Samedi",null,"Dimanche",null,"Lundi",null,{"$f":"IF(Q5=\"\",\"\",IF(LOOKUP(Q5,Fériés)=Q5,CHOOSE(WEEKDAY(Q5,1),\"Dimanche\",\"Lundi\",\"Mardi\",\"Mercredi\",\"Jeudi\",\"Vendredi\",\"Samedi\",\"\")))","v":false},null,{"$f":"IF(S5=\"\",\"\",IF(LOOKUP(S5,Fériés)=S5,CHOOSE(WEEKDAY(S5,1),\"Dimanche\",\"Lundi\",\"Mardi\",\"Mercredi\",\"Jeudi\",\"Vendredi\",\"Samedi\",\"\")))","v":false},null,{"$f":"IF(U5=\"\",\"\",IF(LOOKUP(U5,Fériés)=U5,\"\",CHOOSE(WEEKDAY(U5,1),\"Dimanche\",\"Lundi\",\"Mardi\",\"Mercredi\",\"Jeudi\",\"Vendredi\",\"Samedi\")))","v":"Jeudi"},null,"Vendredi",null,"Samedi",null,"Dimanche",null,"Lundi",null,"Mardi",null,{"$f":"IF(AG5=\"\",\"\",IF(LOOKUP(AG5,Fériés)=AG5,\"\",CHOOSE(WEEKDAY(AG5,1),\"Dimanche\",\"Lundi\",\"Mardi\",\"Mercredi\",\"Jeudi\",\"Vendredi\",\"Samedi\")))","v":"Mercredi"},null,{"$f":"IF(AI5=\"\",\"\",IF(LOOKUP(AI5,Fériés)=AI5,\"\",CHOOSE(WEEKDAY(AI5,1),\"Dimanche\",\"Lundi\",\"Mardi\",\"Mercredi\",\"Jeudi\",\"Vendredi\",\"Samedi\")))","v":"Jeudi"},null,"Vendredi",null,"Samedi",null,"",null,"",null,"Mardi",null,"Mercredi",null,{"$f":"IF(AW5=\"\",\"\",IF(LOOKUP(AW5,Fériés)=AW5,\"\",CHOOSE(WEEKDAY(AW5,1),\"Dimanche\",\"Lundi\",\"Mardi\",\"Mercredi\",\"Jeudi\",\"Vendredi\",\"Samedi\")))","v":"Jeudi"},null,{"$f":"IF(AY5=\"\",\"\",IF(LOOKUP(AY5,Fériés)=AY5,\"\",CHOOSE(WEEKDAY(AY5,1),\"Dimanche\",\"Lundi\",\"Mardi\",\"Mercredi\",\"Jeudi\",\"Vendredi\",\"Samedi\")))","v":"Vendredi"},null,"Samedi",null,"Dimanche",null,"Lundi",null,"Mardi",null,"Mercredi",null,""]
[null,null,{"$f":"DATE(Année,4,1)","v":"2014-04-01"},null,{"$f":"IF(C5=\"\",\"\",IF(MONTH(C5+1)<>MONTH(C5),\"\",C5+1))","v":"2014-04-02"},null,{"$f":"IF(E5=\"\",\"\",IF(MONTH(E5+1)<>MONTH(E5),\"\",E5+1))","v":"2014-04-03"},null,{"$f":"IF(G5=\"\",\"\",IF(MONTH(G5+1)<>MONTH(G5),\"\",G5+1))","v":"2014-04-04"},null,{"$f":"IF(I5=\"\",\"\",IF(MONTH(I5+1)<>MONTH(I5),\"\",I5+1))","v":"2014-04-05"},null,{"$f":"IF(K5=\"\",\"\",IF(MONTH(K5+1)<>MONTH(K5),\"\",K5+1))","v":"2014-04-06"},null,{"$f":"IF(M5=\"\",\"\",IF(MONTH(M5+1)<>MONTH(M5),\"\",M5+1))","v":"2014-04-07"},null,{"$f":"IF(O5=\"\",\"\",IF(MONTH(O5+1)<>MONTH(O5),\"\",O5+1))","v":"2014-04-08"},null,{"$f":"IF(Q5=\"\",\"\",IF(MONTH(Q5+1)<>MONTH(Q5),\"\",Q5+1))","v":"2014-04-09"},null,{"$f":"IF(S5=\"\",\"\",IF(MONTH(S5+1)<>MONTH(S5),\"\",S5+1))","v":"2014-04-10"},null,{"$f":"IF(U5=\"\",\"\",IF(MONTH(U5+1)<>MONTH(U5),\"\",U5+1))","v":"2014-04-11"},null,{"$f":"IF(W5=\"\",\"\",IF(MONTH(W5+1)<>MONTH(W5),\"\",W5+1))","v":"2014-04-12"},null,{"$f":"IF(Y5=\"\",\"\",IF(MONTH(Y5+1)<>MONTH(Y5),\"\",Y5+1))","v":"2014-04-13"},null,{"$f":"IF(AA5=\"\",\"\",IF(MONTH(AA5+1)<>MONTH(AA5),\"\",AA5+1))","v":"2014-04-14"},null,{"$f":"IF(AC5=\"\",\"\",IF(MONTH(AC5+1)<>MONTH(AC5),\"\",AC5+1))","v":"2014-04-15"},null,{"$f":"IF(AE5=\"\",\"\",IF(MONTH(AE5+1)<>MONTH(AE5),\"\",AE5+1))","v":"2014-04-16"},null,{"$f":"IF(AG5=\"\",\"\",IF(MONTH(AG5+1)<>MONTH(AG5),\"\",AG5+1))","v":"2014-04-17"},null,{"$f":"IF(AI5=\"\",\"\",IF(MONTH(AI5+1)<>MONTH(AI5),\"\",AI5+1))","v":"2014-04-18"},null,{"$f":"IF(AK5=\"\",\"\",IF(MONTH(AK5+1)<>MONTH(AK5),\"\",AK5+1))","v":"2014-04-19"},null,{"$f":"IF(AM5=\"\",\"\",IF(MONTH(AM5+1)<>MONTH(AM5),\"\",AM5+1))","v":"2014-04-20"},null,{"$f":"IF(AO5=\"\",\"\",IF(MONTH(AO5+1)<>MONTH(AO5),\"\",AO5+1))","v":"2014-04-21"},null,{"$f":"IF(AQ5=\"\",\"\",IF(MONTH(AQ5+1)<>MONTH(AQ5),\"\",AQ5+1))","v":"2014-04-22"},null,{"$f":"IF(AS5=\"\",\"\",IF(MONTH(AS5+1)<>MONTH(AS5),\"\",AS5+1))","v":"2014-04-23"},null,{"$f":"IF(AU5=\"\",\"\",IF(MONTH(AU5+1)<>MONTH(AU5),\"\",AU5+1))","v":"2014-04-24"},null,{"$f":"IF(AW5=\"\",\"\",IF(MONTH(AW5+1)<>MONTH(AW5),\"\",AW5+1))","v":"2014-04-25"},null,{"$f":"IF(AY5=\"\",\"\",IF(MONTH(AY5+1)<>MONTH(AY5),\"\",AY5+1))","v":"2014-04-26"},null,{"$f":"IF(BA5=\"\",\"\",IF(MONTH(BA5+1)<>MONTH(BA5),\"\",BA5+1))","v":"2014-04-27"},null,{"$f":"IF(BC5=\"\",\"\",IF(MONTH(BC5+1)<>MONTH(BC5),\"\",BC5+1))","v":"2014-04-28"},null,{"$f":"IF(BE5=\"\",\"\",IF(MONTH(BE5+1)<>MONTH(BE5),\"\",BE5+1))","v":"2014-04-29"},null,{"$f":"IF(BG5=\"\",\"\",IF(MONTH(BG5+1)<>MONTH(BG5),\"\",BG5+1))","v":"2014-04-30"},null,{"$f":"IF(BI5=\"\",\"\",IF(MONTH(BI5+1)<>MONTH(BI5),\"\",BI5+1))","v":""}]
[null,null,"Matin","Après midi","Matin","Après midi","Matin","Après midi","Matin","Après midi","Matin","Après midi","Matin","Après midi","Matin","Après midi","Matin","Après midi","Matin","Après midi","Matin","Après midi","Matin","Après midi","Matin","Après midi","Matin","Après midi","Matin","Après midi","Matin","Après midi","Matin","Après midi","Matin","Après midi","Matin","Après midi","Matin","Après midi","Matin","Après midi","Matin","Après midi","Matin","Après midi","Matin","Après midi","Matin","Après midi","Matin","Après midi","Matin","Après midi","Matin","Après midi","Matin","Après midi",{"$f":"IF(BG5=\"\",\"\",\"Matin\")","v":"Matin"},{"$f":"IF(BG5=\"\",\"\",\"Apres midi\")","v":"Apres midi"},{"$f":"IF(BI5=\"\",\"\",\"Matin\")","v":"Matin"},{"$f":"IF(BI5=\"\",\"\",\"Apres midi\")","v":"Apres midi"},{"$f":"IF(BK5=\"\",\"\",\"Matin\")","v":""},{"$f":"IF(BK5=\"\",\"\",\"Apres midi\")","v":""}]
[null,null,null,null,null,null,null,null,null,null,null,null,null,null,null,null,null,null,null,null,null,null,null,null,null,null,null,null,null,null,null,null,null,null,null,null,null,null,null,null,null,null,null,null,null,null,null,null,null,null,null,null,null,null,null,null,null,null,null,null,null,null,null,null,{"$f":"COUNTA(C7:BL7)/2","v":0}]
[null,null,null,null,null,null,null,null,null,null,null,null,null,null,null,null,null,null,null,null,null,null,null,null,null,null,null,null,null,null,null,null,null,null,null,null,null,null,null,null,null,null,null,null,null,null,null,null,null,null,null,null,null,null,null,null,null,null,null,null,null,null,null,null,{"$f":"COUNTA(C8:BL8)/2","v":0}]
[null,null,null,null,null,null,null,null,null,null,null,null,null,null,null,null,null,null,null,null,null,null,null,null,null,null,null,null,null,null,null,null,null,null,null,null,null,null,null,null,null,null,null,null,null,null,null,null,null,null,null,null,null,null,null,null,null,null,null,null,null,null,null,null,0]
[null,null,null,null,null,null,null,null,null,null,null,null,null,null,null,null,null,null,null,null,null,null,null,null,null,null,null,null,null,null,null,null,null,null,null,null,null,null,null,null,null,null,null,null,null,null,null,null,null,null,null,null,null,null,null,null,null,null,null,null,null,null,null,null,0]
[null,null,null,null,null,null,null,null,null,null,null,null,null,null,null,null,null,null,null,null,null,null,null,null,null,null,null,null,null,null,null,null,null,null,null,null,null,null,null,null,null,null,null,null,null,null,null,null,null,null,null,null,null,null,null,null,null,null,null,null,null,null,null,null,0]
[null,null,null,null,null,null,null,null,null,null,null,null,null,null,null,null,null,null,null,null,null,null,null,null,null,null,null,null,null,null,null,null,null,null,null,null,null,null,null,null,null,null,null,null,null,null,null,null,null,null,null,null,null,null,null,null,null,null,null,null,null,null,null,null,0]
[null,null,null,null,null,null,null,null,null,null,null,null,null,null,null,null,null,null,null,null,null,null,null,null,null,null,null,null,null,null,null,null,null,null,null,null,null,null,null,null,null,null,null,null,null,null,null,null,null,null,null,null,null,null,null,null,null,null,null,null,null,null,null,null,0]
[null,null,null,null,null,null,null,null,null,null,null,null,null,null,null,null,null,null,null,null,null,null,null,null,null,null,null,null,null,null,null,null,null,null,null,null,null,null,null,null,null,null,null,null,null,null,null,null,null,null,null,null,null,null,null,null,null,null,null,null,null,null,null,null,0]
[null,null,null,null,null,null,null,null,null,null,null,null,null,null,null,null,null,null,null,null,null,null,null,null,null,null,null,null,null,null,null,null,null,null,null,null,null,null,null,null,null,null,null,null,null,null,null,null,null,null,null,null,null,null,null,null,null,null,null,null,null,null,null,null,0]
[null,null,null,null,null,null,null,null,null,null,null,null,null,null,null,null,null,null,null,null,null,null,null,null,null,null,null,null,null,null,null,null,null,null,null,null,null,null,null,null,null,null,null,null,null,null,null,null,null,null,null,null,null,null,null,null,null,null,null,null,null,null,null,null,0]
[null,null,null,null,null,null,null,null,null,null,null,null,null,null,null,null,null,null,null,null,null,null,null,null,null,null,null,null,null,null,null,null,null,null,null,null,null,null,null,null,null,null,null,null,null,null,null,null,null,null,null,null,null,null,null,null,null,null,null,null,null,null,null,null,0]
[null,null,null,null,null,null,null,null,null,null,null,null,null,null,null,null,null,null,null,null,null,null,null,null,null,null,null,null,null,null,null,null,null,null,null,null,null,null,null,null,null,null,null,null,null,null,null,null,null,null,null,null,null,null,null,null,null,null,null,null,null,null,null,null,0]
[null,null,null,null,null,null,null,null,null,null,null,null,null,null,null,null,null,null,null,null,null,null,null,null,null,null,null,null,null,null,null,null,null,null,null,null,null,null,null,null,null,null,null,null,null,null,null,null,null,null,null,null,null,null,null,null,null,null,null,null,null,null,null,null,0]
[null,null,null,null,null,null,null,null,null,null,null,null,null,null,null,null,null,null,null,null,null,null,null,null,null,null,null,null,null,null,null,null,null,null,null,null,null,null,null,null,null,null,null,null,null,null,null,null,null,null,null,null,null,null,null,null,null,null,null,null,null,null,null,null,0]
[null,null,null,null,null,null,null,null,null,null,null,null,null,null,null,null,null,null,null,null,null,null,null,null,null,null,null,null,null,null,null,null,null,null,null,null,null,null,null,null,null,null,null,null,null,null,null,null,null,null,null,null,null,null,null,null,null,null,null,null,null,null,null,null,0]
[null,null,null,null,null,null,null,null,null,null,null,null,null,null,null,null,null,null,null,null,null,null,null,null,null,null,null,null,null,null,null,null,null,null,null,null,null,null,null,null,null,null,null,null,null,null,null,null,null,null,null,null,null,null,null,null,null,null,null,null,null,null,null,null,0]
[null,null,null,null,null,null,null,null,null,null,null,null,null,null,null,null,null,null,null,null,null,null,null,null,null,null,null,null,null,null,null,null,null,null,null,null,null,null,null,null,null,null,null,null,null,null,null,null,null,null,null,null,null,null,null,null,null,null,null,null,null,null,null,null,0]
[null,null,null,null,null,null,null,null,null,null,null,null,null,null,null,null,null,null,null,null,null,null,null,null,null,null,null,null,null,null,null,null,null,null,null,null,null,null,null,null,null,null,null,null,null,null,null,null,null,null,null,null,null,null,null,null,null,null,null,null,null,null,null,null,0]
[null,null,null,null,null,null,null,null,null,null,null,null,null,null,null,null,null,null,null,null,null,null,null,null,null,null,null,null,null,null,null,null,null,null,null,null,null,null,null,null,null,null,null,null,null,null,null,null,null,null,null,null,null,null,null,null,null,null,null,null,null,null,null,null,0]
[null,null,null,null,null,null,null,null,null,null,null,null,null,null,null,null,null,null,null,null,null,null,null,null,null,null,null,null,null,null,null,null,null,null,null,null,null,null,null,null,null,null,null,null,null,null,null,null,null,null,null,null,null,null,null,null,null,null,null,null,null,null,null,null,0]
[null,null,null,null,null,null,null,null,null,null,null,null,null,null,null,null,null,null,null,null,null,null,null,null,null,null,null,null,null,null,null,null,null,null,null,null,null,null,null,null,null,null,null,null,null,null,null,null,null,null,null,null,null,null,null,null,null,null,null,null,null,null,null,null,0]
[null,null,null,null,null,null,null,null,null,null,null,null,null,null,null,null,null,null,null,null,null,null,null,null,null,null,null,null,null,null,null,null,null,null,null,null,null,null,null,null,null,null,null,null,null,null,null,null,null,null,null,null,null,null,null,null,null,null,null,null,null,null,null,null,0]
[null,null,null,null,null,null,null,null,null,null,null,null,null,null,null,null,null,null,null,null,null,null,null,null,null,null,null,null,null,null,null,null,null,null,null,null,null,null,null,null,null,null,null,null,null,null,null,null,null,null,null,null,null,null,null,null,null,null,null,null,null,null,null,null,0]
[null,null,null,null,null,null,null,null,null,null,null,null,null,null,null,null,null,null,null,null,null,null,null,null,null,null,null,null,null,null,null,null,null,null,null,null,null,null,null,null,null,null,null,null,null,null,null,null,null,null,null,null,null,null,null,null,null,null,null,null,null,null,null,null,0]
[null,null,null,null,null,null,null,null,null,null,null,null,null,null,null,null,null,null,null,null,null,null,null,null,null,null,null,null,null,null,null,null,null,null,null,null,null,null,null,null,null,null,null,null,null,null,null,null,null,null,null,null,null,null,null,null,null,null,null,null,null,null,null,null,0]
[null,null,null,null,null,null,null,null,null,null,null,null,null,null,null,null,null,null,null,null,null,null,null,null,null,null,null,null,null,null,null,null,null,null,null,null,null,null,null,null,null,null,null,null,null,null,null,null,null,null,null,null,null,null,null,null,null,null,null,null,null,null,null,null,0]
[null,null,null,null,null,null,null,null,null,null,null,null,null,null,null,null,null,null,null,null,null,null,null,null,null,null,null,null,null,null,null,null,null,null,null,null,null,null,null,null,null,null,null,null,null,null,null,null,null,null,null,null,null,null,null,null,null,null,null,null,null,null,null,null,0]
[null,null,null,null,null,null,null,null,null,null,null,null,null,null,null,null,null,null,null,null,null,null,null,null,null,null,null,null,null,null,null,null,null,null,null,null,null,null,null,null,null,null,null,null,null,null,null,null,null,null,null,null,null,null,null,null,null,null,null,null,null,null,null,null,0]
[null,null,null,null,null,null,null,null,null,null,null,null,null,null,null,null,null,null,null,null,null,null,null,null,null,null,null,null,null,null,null,null,null,null,null,null,null,null,null,null,null,null,null,null,null,null,null,null,null,null,null,null,null,null,null,null,null,null,null,null,null,null,null,null,0]
[null,null,null,null,null,null,null,null,null,null,null,null,null,null,null,null,null,null,null,null,null,null,null,null,null,null,null,null,null,null,null,null,null,null,null,null,null,null,null,null,null,null,null,null,null,null,null,null,null,null,null,null,null,null,null,null,null,null,null,null,null,null,null,null,0]
[null,null,null,null,null,null,null,null,null,null,null,null,null,null,null,null,null,null,null,null,null,null,null,null,null,null,null,null,null,null,null,null,null,null,null,null,null,null,null,null,null,null,null,null,null,null,null,null,null,null,null,null,null,null,null,null,null,null,null,null,null,null,null,null,0]
[null,null,null,null,null,null,null,null,null,null,null,null,null,null,null,null,null,null,null,null,null,null,null,null,null,null,null,null,null,null,null,null,null,null,null,null,null,null,null,null,null,null,null,null,null,null,null,null,null,null,null,null,null,null,null,null,null,null,null,null,null,null,null,null,0]
[null,null,null,null,null,null,null,null,null,null,null,null,null,null,null,null,null,null,null,null,null,null,null,null,null,null,null,null,null,null,null,null,null,null,null,null,null,null,null,null,null,null,null,null,null,null,null,null,null,null,null,null,null,null,null,null,null,null,null,null,null,null,null,null,0]
[null,null,null,null,null,null,null,null,null,null,null,null,null,null,null,null,null,null,null,null,null,null,null,null,null,null,null,null,null,null,null,null,null,null,null,null,null,null,null,null,null,null,null,null,null,null,null,null,null,null,null,null,null,null,null,null,null,null,null,null,null,null,null,null,0]
[null,null,null,null,null,null,null,null,null,null,null,null,null,null,null,null,null,null,null,null,null,null,null,null,null,null,null,null,null,null,null,null,null,null,null,null,null,null,null,null,null,null,null,null,null,null,null,null,null,null,null,null,null,null,null,null,null,null,null,null,null,null,null,null,0]
[null,null,null,null,null,null,null,null,null,null,null,null,null,null,null,null,null,null,null,null,null,null,null,null,null,null,null,null,null,null,null,null,null,null,null,null,null,null,null,null,null,null,null,null,null,null,null,null,null,null,null,null,null,null,null,null,null,null,null,null,null,null,null,null,0]
[null,null,null,null,null,null,null,null,null,null,null,null,null,null,null,null,null,null,null,null,null,null,null,null,null,null,null,null,null,null,null,null,null,null,null,null,null,null,null,null,null,null,null,null,null,null,null,null,null,null,null,null,null,null,null,null,null,null,null,null,null,null,null,null,0]
[null,null,null,null,null,null,null,null,null,null,null,null,null,null,null,null,null,null,null,null,null,null,null,null,null,null,null,null,null,null,null,null,null,null,null,null,null,null,null,null,null,null,null,null,null,null,null,null,null,null,null,null,null,null,null,null,null,null,null,null,null,null,null,null,0]
[null,null,null,null,null,null,null,null,null,null,null,null,null,null,null,null,null,null,null,null,null,null,null,null,null,null,null,null,null,null,null,null,null,null,null,null,null,null,null,null,null,null,null,null,null,null,null,null,null,null,null,null,null,null,null,null,null,null,null,null,null,null,null,null,0]
[null,null,null,null,null,null,null,null,null,null,null,null,null,null,null,null,null,null,null,null,null,null,null,null,null,null,null,null,null,null,null,null,null,null,null,null,null,null,null,null,null,null,null,null,null,null,null,null,null,null,null,null,null,null,null,null,null,null,null,null,null,null,null,null,0]
[null,null,null,null,null,null,null,null,null,null,null,null,null,null,null,null,null,null,null,null,null,null,null,null,null,null,null,null,null,null,null,null,null,null,null,null,null,null,null,null,null,null,null,null,null,null,null,null,null,null,null,null,null,null,null,null,null,null,null,null,null,null,null,null,0]
[null,null,null,null,null,null,null,null,null,null,null,null,null,null,null,null,null,null,null,null,null,null,null,null,null,null,null,null,null,null,null,null,null,null,null,null,null,null,null,null,null,null,null,null,null,null,null,null,null,null,null,null,null,null,null,null,null,null,null,null,null,null,null,null,0]
[null,null,null,null,null,null,null,null,null,null,null,null,null,null,null,null,null,null,null,null,null,null,null,null,null,null,null,null,null,null,null,null,null,null,null,null,null,null,null,null,null,null,null,null,null,null,null,null,null,null,null,null,null,null,null,null,null,null,null,null,null,null,null,null,0]
[null,null,null,null,null,null,null,null,null,null,null,null,null,null,null,null,null,null,null,null,null,null,null,null,null,null,null,null,null,null,null,null,null,null,null,null,null,null,null,null,null,null,null,null,null,null,null,null,null,null,null,null,null,null,null,null,null,null,null,null,null,null,null,null,0]
[null,null,null,null,null,null,null,null,null,null,null,null,null,null,null,null,null,null,null,null,null,null,null,null,null,null,null,null,null,null,null,null,null,null,null,null,null,null,null,null,null,null,null,null,null,null,null,null,null,null,null,null,null,null,null,null,null,null,null,null,null,null,null,null,0]
[null,null,null,null,null,null,null,null,null,null,null,null,null,null,null,null,null,null,null,null,null,null,null,null,null,null,null,null,null,null,null,null,null,null,null,null,null,null,null,null,null,null,null,null,null,null,null,null,null,null,null,null,null,null,null,null,null,null,null,null,null,null,null,null,0]
[null,null,null,null,null,null,null,null,null,null,null,null,null,null,null,null,null,null,null,null,null,null,null,null,null,null,null,null,null,null,null,null,null,null,null,null,null,null,null,null,null,null,null,null,null,null,null,null,null,null,null,null,null,null,null,null,null,null,null,null,null,null,null,null,0]
[null,null,null,null,null,null,null,null,null,null,null,null,null,null,null,null,null,null,null,null,null,null,null,null,null,null,null,null,null,null,null,null,null,null,null,null,null,null,null,null,null,null,null,null,null,null,null,null,null,null,null,null,null,null,null,null,null,null,null,null,null,null,null,null,0]
[null,null,null,null,null,null,null,null,null,null,null,null,null,null,null,null,null,null,null,null,null,null,null,null,null,null,null,null,null,null,null,null,null,null,null,null,null,null,null,null,null,null,null,null,null,null,null,null,null,null,null,null,null,null,null,null,null,null,null,null,null,null,null,null,0]
[null,null,null,null,null,null,null,null,null,null,null,null,null,null,null,null,null,null,null,null,null,null,null,null,null,null,null,null,null,null,null,null,null,null,null,null,null,null,null,null,null,null,null,null,null,null,null,null,null,null,null,null,null,null,null,null,null,null,null,null,null,null,null,null,0]
[null,null,null,null,null,null,null,null,null,null,null,null,null,null,null,null,null,null,null,null,null,null,null,null,null,null,null,null,null,null,null,null,null,null,null,null,null,null,null,null,null,null,null,null,null,null,null,null,null,null,null,null,null,null,null,null,null,null,null,null,null,null,null,null,0]
[null,null,null,null,null,null,null,null,null,null,null,null,null,null,null,null,null,null,null,null,null,null,null,null,null,null,null,null,null,null,null,null,null,null,null,null,null,null,null,null,null,null,null,null,null,null,null,null,null,null,null,null,null,null,null,null,null,null,null,null,null,null,null,null,0]
[null,null,null,null,null,null,null,null,null,null,null,null,null,null,null,null,null,null,null,null,null,null,null,null,null,null,null,null,null,null,null,null,null,null,null,null,null,null,null,null,null,null,null,null,null,null,null,null,null,null,null,null,null,null,null,null,null,null,null,null,null,null,null,null,0]
[null,null,null,null,null,null,null,null,null,null,null,null,null,null,null,null,null,null,null,null,null,null,null,null,null,null,null,null,null,null,null,null,null,null,null,null,null,null,null,null,null,null,null,null,null,null,null,null,null,null,null,null,null,null,null,null,null,null,null,null,null,null,null,null,0]
[null,null,null,null,null,null,null,null,null,null,null,null,null,null,null,null,null,null,null,null,null,null,null,null,null,null,null,null,null,null,null,null,null,null,null,null,null,null,null,null,null,null,null,null,null,null,null,null,null,null,null,null,null,null,null,null,null,null,null,null,null,null,null,null,0]
[null,null,null,null,null,null,null,null,null,null,null,null,null,null,null,null,null,null,null,null,null,null,null,null,null,null,null,null,null,null,null,null,null,null,null,null,null,null,null,null,null,null,null,null,null,null,null,null,null,null,null,null,null,null,null,null,null,null,null,null,null,null,null,null,0]
[null,null,null,null,null,null,null,null,null,null,null,null,null,null,null,null,null,null,null,null,null,null,null,null,null,null,null,null,null,null,null,null,null,null,null,null,null,null,null,null,null,null,null,null,null,null,null,null,null,null,null,null,null,null,null,null,null,null,null,null,null,null,null,null,0]
[null,null,null,null,null,null,null,null,null,null,null,null,null,null,null,null,null,null,null,null,null,null,null,null,null,null,null,null,null,null,null,null,null,null,null,null,null,null,null,null,null,null,null,null,null,null,null,null,null,null,null,null,null,null,null,null,null,null,null,null,null,null,null,null,0]
[null,null,null,null,null,null,null,null,null,null,null,null,null,null,null,null,null,null,null,null,null,null,null,null,null,null,null,null,null,null,null,null,null,null,null,null,null,null,null,null,null,null,null,null,null,null,null,null,null,null,null,null,null,null,null,null,null,null,null,null,null,null,null,null,0]
[null,null,null,null,null,null,null,null,null,null,null,null,null,null,null,null,null,null,null,null,null,null,null,null,null,null,null,null,null,null,null,null,null,null,null,null,null,null,null,null,null,null,null,null,null,null,null,null,null,null,null,null,null,null,null,null,null,null,null,null,null,null,null,null,0]
[null,null,null,null,null,null,null,null,null,null,null,null,null,null,null,null,null,null,null,null,null,null,null,null,null,null,null,null,null,null,null,null,null,null,null,null,null,null,null,null,null,null,null,null,null,null,null,null,null,null,null,null,null,null,null,null,null,null,null,null,null,null,null,null,0]
[null,null,null,null,null,null,null,null,null,null,null,null,null,null,null,null,null,null,null,null,null,null,null,null,null,null,null,null,null,null,null,null,null,null,null,null,null,null,null,null,null,null,null,null,null,null,null,null,null,null,null,null,null,null,null,null,null,null,null,null,null,null,null,null,0]
[null,null,null,null,null,null,null,null,null,null,null,null,null,null,null,null,null,null,null,null,null,null,null,null,null,null,null,null,null,null,null,null,null,null,null,null,null,null,null,null,null,null,null,null,null,null,null,null,null,null,null,null,null,null,null,null,null,null,null,null,null,null,null,null,0]
[null,null,null,null,null,null,null,null,null,null,null,null,null,null,null,null,null,null,null,null,null,null,null,null,null,null,null,null,null,null,null,null,null,null,null,null,null,null,null,null,null,null,null,null,null,null,null,null,null,null,null,null,null,null,null,null,null,null,null,null,null,null,null,null,0]
[null,null,null,null,null,null,null,null,null,null,null,null,null,null,null,null,null,null,null,null,null,null,null,null,null,null,null,null,null,null,null,null,null,null,null,null,null,null,null,null,null,null,null,null,null,null,null,null,null,null,null,null,null,null,null,null,null,null,null,null,null,null,null,null,0]
[null,null,null,null,null,null,null,null,null,null,null,null,null,null,null,null,null,null,null,null,null,null,null,null,null,null,null,null,null,null,null,null,null,null,null,null,null,null,null,null,null,null,null,null,null,null,null,null,null,null,null,null,null,null,null,null,null,null,null,null,null,null,null,null,{"$f":"COUNTA(C72:BL72)/2","v":0}]
[null,null,null,null,null,null,null,null,null,null,null,null,null,null,null,null,null,null,null,null,null,null,null,null,null,null,null,null,null,null,null,null,null,null,null,null,null,null,null,null,null,null,null,null,null,null,null,null,null,null,null,null,null,null,null,null,null,null,null,null,null,null,null,null,0]
[null,null,null,null,null,null,null,null,null,null,null,null,null,null,null,null,null,null,null,null,null,null,null,null,null,null,null,null,null,null,null,null,null,null,null,null,null,null,null,null,null,null,null,null,null,null,null,null,null,null,null,null,null,null,null,null,null,null,null,null,null,null,null,null,0]
[null,null,null,null,null,null,null,null,null,null,null,null,null,null,null,null,null,null,null,null,null,null,null,null,null,null,null,null,null,null,null,null,null,null,null,null,null,null,null,null,null,null,null,null,null,null,null,null,null,null,null,null,null,null,null,null,null,null,null,null,null,null,null,null,0]
[null,null,null,null,null,null,null,null,null,null,null,null,null,null,null,null,null,null,null,null,null,null,null,null,null,null,null,null,null,null,null,null,null,null,null,null,null,null,null,null,null,null,null,null,null,null,null,null,null,null,null,null,null,null,null,null,null,null,null,null,null,null,null,null,0]
[null,null,null,null,null,null,null,null,null,null,null,null,null,null,null,null,null,null,null,null,null,null,null,null,null,null,null,null,null,null,null,null,null,null,null,null,null,null,null,null,null,null,null,null,null,null,null,null,null,null,null,null,null,null,null,null,null,null,null,null,null,null,null,null,0]
[null,null,null,null,null,null,null,null,null,null,null,null,null,null,null,null,null,null,null,null,null,null,null,null,null,null,null,null,null,null,null,null,null,null,null,null,null,null,null,null,null,null,null,null,null,null,null,null,null,null,null,null,null,null,null,null,null,null,null,null,null,null,null,null,0]
[null,null,null,null,null,null,null,null,null,null,null,null,null,null,null,null,null,null,null,null,null,null,null,null,null,null,null,null,null,null,null,null,null,null,null,null,null,null,null,null,null,null,null,null,null,null,null,null,null,null,null,null,null,null,null,null,null,null,null,null,null,null,null,null,0]
[null,null,null,null,null,null,null,null,null,null,null,null,null,null,null,null,null,null,null,null,null,null,null,null,null,null,null,null,null,null,null,null,null,null,null,null,null,null,null,null,null,null,null,null,null,null,null,null,null,null,null,null,null,null,null,null,null,null,null,null,null,null,null,null,0]
[null,null,null,null,null,null,null,null,null,null,null,null,null,null,null,null,null,null,null,null,null,null,null,null,null,null,null,null,null,null,null,null,null,null,null,null,null,null,null,null,null,null,null,null,null,null,null,null,null,null,null,null,null,null,null,null,null,null,null,null,null,null,null,null,0]
[null,null,null,null,null,null,null,null,null,null,null,null,null,null,null,null,null,null,null,null,null,null,null,null,null,null,null,null,null,null,null,null,null,null,null,null,null,null,null,null,null,null,null,null,null,null,null,null,null,null,null,null,null,null,null,null,null,null,null,null,null,null,null,null,0]
[null,null,null,null,null,null,null,null,null,null,null,null,null,null,null,null,null,null,null,null,null,null,null,null,null,null,null,null,null,null,null,null,null,null,null,null,null,null,null,null,null,null,null,null,null,null,null,null,null,null,null,null,null,null,null,null,null,null,null,null,null,null,null,null,0]
[null,null,null,null,null,null,null,null,null,null,null,null,null,null,null,null,null,null,null,null,null,null,null,null,null,null,null,null,null,null,null,null,null,null,null,null,null,null,null,null,null,null,null,null,null,null,null,null,null,null,null,null,null,null,null,null,null,null,null,null,null,null,null,null,0]
[null,null,null,null,null,null,null,null,null,null,null,null,null,null,null,null,null,null,null,null,null,null,null,null,null,null,null,null,null,null,null,null,null,null,null,null,null,null,null,null,null,null,null,null,null,null,null,null,null,null,null,null,null,null,null,null,null,null,null,null,null,null,null,null,0]
[null,null,null,null,null,null,null,null,null,null,null,null,null,null,null,null,null,null,null,null,null,null,null,null,null,null,null,null,null,null,null,null,null,null,null,null,null,null,null,null,null,null,null,null,null,null,null,null,null,null,null,null,null,null,null,null,null,null,null,null,null,null,null,null,0]
[null,null,null,null,null,null,null,null,null,null,null,null,null,null,null,null,null,null,null,null,null,null,null,null,null,null,null,null,null,null,null,null,null,null,null,null,null,null,null,null,null,null,null,null,null,null,null,null,null,null,null,null,null,null,null,null,null,null,null,null,null,null,null,null,0]
[null,null,null,null,null,null,null,null,null,null,null,null,null,null,null,null,null,null,null,null,null,null,null,null,null,null,null,null,null,null,null,null,null,null,null,null,null,null,null,null,null,null,null,null,null,null,null,null,null,null,null,null,null,null,null,null,null,null,null,null,null,null,null,null,0]
[null,null,null,null,null,null,null,null,null,null,null,null,null,null,null,null,null,null,null,null,null,null,null,null,null,null,null,null,null,null,null,null,null,null,null,null,null,null,null,null,null,null,null,null,null,null,null,null,null,null,null,null,null,null,null,null,null,null,null,null,null,null,null,null,0]
[null,null,null,null,null,null,null,null,null,null,null,null,null,null,null,null,null,null,null,null,null,null,null,null,null,null,null,null,null,null,null,null,null,null,null,null,null,null,null,null,null,null,null,null,null,null,null,null,null,null,null,null,null,null,null,null,null,null,null,null,null,null,null,null,0]
[null,null,null,null,null,null,null,null,null,null,null,null,null,null,null,null,null,null,null,null,null,null,null,null,null,null,null,null,null,null,null,null,null,null,null,null,null,null,null,null,null,null,null,null,null,null,null,null,null,null,null,null,null,null,null,null,null,null,null,null,null,null,null,null,0]
[null,null,null,null,null,null,null,null,null,null,null,null,null,null,null,null,null,null,null,null,null,null,null,null,null,null,null,null,null,null,null,null,null,null,null,null,null,null,null,null,null,null,null,null,null,null,null,null,null,null,null,null,null,null,null,null,null,null,null,null,null,null,null,null,0]
[null,null,null,null,null,null,null,null,null,null,null,null,null,null,null,null,null,null,null,null,null,null,null,null,null,null,null,null,null,null,null,null,null,null,null,null,null,null,null,null,null,null,null,null,null,null,null,null,null,null,null,null,null,null,null,null,null,null,null,null,null,null,null,null,0]
[null,null,null,null,null,null,null,null,null,null,null,null,null,null,null,null,null,null,null,null,null,null,null,null,null,null,null,null,null,null,null,null,null,null,null,null,null,null,null,null,null,null,null,null,null,null,null,null,null,null,null,null,null,null,null,null,null,null,null,null,null,null,null,null,0]
[null,null,null,null,null,null,null,null,null,null,null,null,null,null,null,null,null,null,null,null,null,null,null,null,null,null,null,null,null,null,null,null,null,null,null,null,null,null,null,null,null,null,null,null,null,null,null,null,null,null,null,null,null,null,null,null,null,null,null,null,null,null,null,null,0]
[null,null,null,null,null,null,null,null,null,null,null,null,null,null,null,null,null,null,null,null,null,null,null,null,null,null,null,null,null,null,null,null,null,null,null,null,null,null,null,null,null,null,null,null,null,null,null,null,null,null,null,null,null,null,null,null,null,null,null,null,null,null,null,null,0]
[null,null,null,null,null,null,null,null,null,null,null,null,null,null,null,null,null,null,null,null,null,null,null,null,null,null,null,null,null,null,null,null,null,null,null,null,null,null,null,null,null,null,null,null,null,null,null,null,null,null,null,null,null,null,null,null,null,null,null,null,null,null,null,null,0]
[null,null,null,null,null,null,null,null,null,null,null,null,null,null,null,null,null,null,null,null,null,null,null,null,null,null,null,null,null,null,null,null,null,null,null,null,null,null,null,null,null,null,null,null,null,null,null,null,null,null,null,null,null,null,null,null,null,null,null,null,null,null,null,null,0]
[null,null,null,null,null,null,null,null,null,null,null,null,null,null,null,null,null,null,null,null,null,null,null,null,null,null,null,null,null,null,null,null,null,null,null,null,null,null,null,null,null,null,null,null,null,null,null,null,null,null,null,null,null,null,null,null,null,null,null,null,null,null,null,null,0]
[null,null,null,null,null,null,null,null,null,null,null,null,null,null,null,null,null,null,null,null,null,null,null,null,null,null,null,null,null,null,null,null,null,null,null,null,null,null,null,null,null,null,null,null,null,null,null,null,null,null,null,null,null,null,null,null,null,null,null,null,null,null,null,null,0]

{"sheet":"Mai","index":6,"n_rows":100,"n_cols":65,"rows_kept":100,"cut":false,"hidden":false,"merged":[[17,0,17,1],[18,0,18,1],[19,0,19,1],[20,0,20,1],[13,0,13,1],[8,0,8,1],[9,0,9,1],[12,0,12,1],[10,0,10,1],[11,0,11,1],[14,0,14,1],[15,0,15,1],[16,0,16,1],[7,0,7,1],[4,44,4,45],[4,32,4,33],[4,34,4,35],[4,36,4,37],[4,38,4,39],[4,40,4,41],[4,42,4,43],[4,20,4,21],[4,14,4,15],[4,16,4,17],[4,18,4,19],[4,2,4,3],[4,4,4,5],[4,6,4,7],[4,8,4,9],[4,62,4,63],[6,0,6,1],[4,52,4,53],[4,54,4,55],[4,30,4,31],[4,58,4,59],[4,60,4,61],[4,22,4,23],[4,24,4,25],[4,26,4,27],[4,28,4,29],[4,56,4,57],[4,46,4,47],[4,48,4,49],[4,50,4,51],[4,12,4,13],[4,10,4,11],[1,42,1,46],[3,32,3,33],[3,34,3,35],[3,36,3,37],[3,50,3,51],[3,48,3,49],[3,26,3,27],[3,28,3,29],[3,22,3,23],[3,24,3,25],[3,38,3,39],[3,40,3,41],[3,42,3,43],[3,44,3,45],[3,46,3,47],[3,30,3,31],[1,47,1,49],[1,55,1,59],[1,60,1,62],[3,2,3,3],[3,4,3,5],[3,6,3,7],[3,8,3,9],[3,10,3,11],[3,12,3,13],[1,3,1,7],[1,8,1,10],[1,16,1,20],[1,21,1,23],[1,29,1,33],[1,34,1,36],[3,14,3,15],[3,62,3,63],[3,52,3,53],[3,54,3,55],[3,56,3,57],[3,58,3,59],[3,60,3,61],[3,16,3,17],[3,18,3,19],[3,20,3,21],[26,0,26,1],[27,0,27,1],[28,0,28,1],[29,0,29,1],[30,0,30,1],[21,0,21,1],[22,0,22,1],[23,0,23,1],[24,0,24,1],[25,0,25,1],[36,0,36,1],[37,0,37,1],[38,0,38,1],[39,0,39,1],[40,0,40,1],[31,0,31,1],[32,0,32,1],[33,0,33,1],[34,0,34,1],[35,0,35,1],[46,0,46,1],[47,0,47,1],[48,0,48,1],[49,0,49,1],[50,0,50,1],[41,0,41,1],[42,0,42,1],[43,0,43,1],[44,0,44,1],[45,0,45,1],[56,0,56,1],[57,0,57,1],[58,0,58,1],[59,0,59,1],[60,0,60,1],[51,0,51,1],[52,0,52,1],[53,0,53,1],[54,0,54,1],[55,0,55,1],[66,0,66,1],[67,0,67,1],[68,0,68,1],[69,0,69,1],[70,0,70,1],[61,0,61,1],[62,0,62,1],[63,0,63,1],[64,0,64,1],[65,0,65,1],[76,0,76,1],[77,0,77,1],[78,0,78,1],[79,0,79,1],[80,0,80,1],[71,0,71,1],[72,0,72,1],[73,0,73,1],[74,0,74,1],[75,0,75,1],[86,0,86,1],[87,0,87,1],[88,0,88,1],[89,0,89,1],[90,0,90,1],[81,0,81,1],[82,0,82,1],[83,0,83,1],[84,0,84,1],[85,0,85,1],[96,0,96,1],[97,0,97,1],[98,0,98,1],[99,0,99,1],[91,0,91,1],[92,0,92,1],[93,0,93,1],[94,0,94,1],[95,0,95,1]]}
[30,{"$f":"C5","v":"2014-05-01"}]
[null,null,null,{"$f":"IF(An!$Q$4=\"\",\"\",An!$Q$4)","v":""},null,null,null,null,{"$f":"C5","v":"2014-05-01"},null,null,null,null,"ACCEUIL",null,null,{"$f":"IF(An!$Q$4=\"\",\"\",An!$Q$4)","v":""},null,null,null,null,{"$f":"C5","v":"2014-05-01"},null,null,null,null,"ACCEUIL",null,null,{"$f":"IF(An!$Q$4=\"\",\"\",An!$Q$4)","v":""},null,null,null,null,{"$f":"C5","v":"2014-05-01"},null,null,null,null,"ACCEUIL",null,null,{"$f":"IF(An!$Q$4=\"\",\"\",An!$Q$4)","v":""},null,null,null,null,{"$f":"C5","v":"2014-05-01"},null,null,null,null,"ACCEUIL",null,null,{"$f":"IF(An!$Q$4=\"\",\"\",An!$Q$4)","v":""},null,null,null,null,{"$f":"C5","v":"2014-05-01"},null,null,"ACCEUIL"]
[]
[null,null,{"$f":"IF(C5=\"\",\"\",IF(LOOKUP(C5,Fériés)=C5,CHOOSE(WEEKDAY(C5,1),\"Dimanche\",\"Lundi\",\"Mardi\",\"Mercredi\",\"Jeudi\",\"Vendredi\",\"Samedi\",\"\")))","v":"Jeudi"},null,{"$f":"IF(E5=\"\",\"\",IF(LOOKUP(E5,Fériés)=E5,\"\",CHOOSE(WEEKDAY(E5,1),\"Dimanche\",\"Lundi\",\"Mardi\",\"Mercredi\",\"Jeudi\",\"Vendredi\",\"Samedi\")))","v":"Vendredi"},null,"Samedi",null,"Dimanche",null,"Lundi",null,"Mardi",null,"Mercredi",null,{"$f":"IF(Q5=\"\",\"\",IF(LOOKUP(Q5,Fériés)=Q5,CHOOSE(WEEKDAY(Q5,1),\"Dimanche\",\"Lundi\",\"Mardi\",\"Mercredi\",\"Jeudi\",\"Vendredi\",\"Samedi\",\"\")))","v":"Jeudi"},null,{"$f":"IF(S5=\"\",\"\",IF(LOOKUP(S5,Fériés)=S5,\"\",CHOOSE(WEEKDAY(S5,1),\"Dimanche\",\"Lundi\",\"Mardi\",\"Mercredi\",\"Jeudi\",\"Vendredi\",\"Samedi\")))","v":"Vendredi"},null,"Samedi",null,"Dimanche",null,"Lundi",null,"Mardi",null,"Mercredi",null,"Jeudi",null,{"$f":"IF(AG5=\"\",\"\",IF(LOOKUP(AG5,Fériés)=AG5,\"\",CHOOSE(WEEKDAY(AG5,1),\"Dimanche\",\"Lundi\",\"Mardi\",\"Mercredi\",\"Jeudi\",\"Vendredi\",\"Samedi\")))","v":"Vendredi"},null,{"$f":"IF(AI5=\"\",\"\",IF(LOOKUP(AI5,Fériés)=AI5,CHOOSE(WEEKDAY(AI5,1),\"Dimanche\",\"Lundi\",\"Mardi\",\"Mercredi\",\"Jeudi\",\"Vendredi\",\"Samedi\",\"\")))","v":false},null,{"$f":"IF(AK5=\"\",\"\",IF(LOOKUP(AK5,Fériés)=AK5,\"\",CHOOSE(WEEKDAY(AK5,1),\"Dimanche\",\"Lundi\",\"Mardi\",\"Mercredi\",\"Jeudi\",\"Vendredi\",\"Samedi\")))","v":"Dimanche"},null,"Lundi",null,"Mardi",null,"Mercredi",null,"Jeudi",null,"Vendredi",null,{"$f":"IF(AW5=\"\",\"\",IF(LOOKUP(AW5,Fériés)=AW5,\"\",CHOOSE(WEEKDAY(AW5,1),\"Dimanche\",\"Lundi\",\"Mardi\",\"Mercredi\",\"Jeudi\",\"Vendredi\",\"Samedi\")))","v":"Samedi"},null,{"$f":"IF(AY5=\"\",\"\",IF(LOOKUP(AY5,Fériés)=AY5,\"\",CHOOSE(WEEKDAY(AY5,1),\"Dimanche\",\"Lundi\",\"Mardi\",\"Mercredi\",\"Jeudi\",\"Vendredi\",\"Samedi\")))","v":"Dimanche"},null,"Lundi",null,"Mardi",null,{"$f":"IF(BE5=\"\",\"\",IF(LOOKUP(BE5,Fériés)=BE5,CHOOSE(WEEKDAY(BE5,1),\"Dimanche\",\"Lundi\",\"Mardi\",\"Mercredi\",\"Jeudi\",\"Vendredi\",\"Samedi\",\"\")))","v":false},null,"",null,"Vendredi",null,"Samedi"]
[null,null,{"$f":"DATE(Année,5,1)","v":"2014-05-01"},null,{"$f":"IF(C5=\"\",\"\",IF(MONTH(C5+1)<>MONTH(C5),\"\",C5+1))","v":"2014-05-02"},null,{"$f":"IF(E5=\"\",\"\",IF(MONTH(E5+1)<>MONTH(E5),\"\",E5+1))","v":"2014-05-03"},null,{"$f":"IF(G5=\"\",\"\",IF(MONTH(G5+1)<>MONTH(G5),\"\",G5+1))","v":"2014-05-04"},null,{"$f":"IF(I5=\"\",\"\",IF(MONTH(I5+1)<>MONTH(I5),\"\",I5+1))","v":"2014-05-05"},null,{"$f":"IF(K5=\"\",\"\",IF(MONTH(K5+1)<>MONTH(K5),\"\",K5+1))","v":"2014-05-06"},null,{"$f":"IF(M5=\"\",\"\",IF(MONTH(M5+1)<>MONTH(M5),\"\",M5+1))","v":"2014-05-07"},null,{"$f":"IF(O5=\"\",\"\",IF(MONTH(O5+1)<>MONTH(O5),\"\",O5+1))","v":"2014-05-08"},null,{"$f":"IF(Q5=\"\",\"\",IF(MONTH(Q5+1)<>MONTH(Q5),\"\",Q5+1))","v":"2014-05-09"},null,{"$f":"IF(S5=\"\",\"\",IF(MONTH(S5+1)<>MONTH(S5),\"\",S5+1))","v":"2014-05-10"},null,{"$f":"IF(U5=\"\",\"\",IF(MONTH(U5+1)<>MONTH(U5),\"\",U5+1))","v":"2014-05-11"},null,{"$f":"IF(W5=\"\",\"\",IF(MONTH(W5+1)<>MONTH(W5),\"\",W5+1))","v":"2014-05-12"},null,{"$f":"IF(Y5=\"\",\"\",IF(MONTH(Y5+1)<>MONTH(Y5),\"\",Y5+1))","v":"2014-05-13"},null,{"$f":"IF(AA5=\"\",\"\",IF(MONTH(AA5+1)<>MONTH(AA5),\"\",AA5+1))","v":"2014-05-14"},null,{"$f":"IF(AC5=\"\",\"\",IF(MONTH(AC5+1)<>MONTH(AC5),\"\",AC5+1))","v":"2014-05-15"},null,{"$f":"IF(AE5=\"\",\"\",IF(MONTH(AE5+1)<>MONTH(AE5),\"\",AE5+1))","v":"2014-05-16"},null,{"$f":"IF(AG5=\"\",\"\",IF(MONTH(AG5+1)<>MONTH(AG5),\"\",AG5+1))","v":"2014-05-17"},null,{"$f":"IF(AI5=\"\",\"\",IF(MONTH(AI5+1)<>MONTH(AI5),\"\",AI5+1))","v":"2014-05-18"},null,{"$f":"IF(AK5=\"\",\"\",IF(MONTH(AK5+1)<>MONTH(AK5),\"\",AK5+1))","v":"2014-05-19"},null,{"$f":"IF(AM5=\"\",\"\",IF(MONTH(AM5+1)<>MONTH(AM5),\"\",AM5+1))","v":"2014-05-20"},null,{"$f":"IF(AO5=\"\",\"\",IF(MONTH(AO5+1)<>MONTH(AO5),\"\",AO5+1))","v":"2014-05-21"},null,{"$f":"IF(AQ5=\"\",\"\",IF(MONTH(AQ5+1)<>MONTH(AQ5),\"\",AQ5+1))","v":"2014-05-22"},null,{"$f":"IF(AS5=\"\",\"\",IF(MONTH(AS5+1)<>MONTH(AS5),\"\",AS5+1))","v":"2014-05-23"},null,{"$f":"IF(AU5=\"\",\"\",IF(MONTH(AU5+1)<>MONTH(AU5),\"\",AU5+1))","v":"2014-05-24"},null,{"$f":"IF(AW5=\"\",\"\",IF(MONTH(AW5+1)<>MONTH(AW5),\"\",AW5+1))","v":"2014-05-25"},null,{"$f":"IF(AY5=\"\",\"\",IF(MONTH(AY5+1)<>MONTH(AY5),\"\",AY5+1))","v":"2014-05-26"},null,{"$f":"IF(BA5=\"\",\"\",IF(MONTH(BA5+1)<>MONTH(BA5),\"\",BA5+1))","v":"2014-05-27"},null,{"$f":"IF(BC5=\"\",\"\",IF(MONTH(BC5+1)<>MONTH(BC5),\"\",BC5+1))","v":"2014-05-28"},null,{"$f":"IF(BE5=\"\",\"\",IF(MONTH(BE5+1)<>MONTH(BE5),\"\",BE5+1))","v":"2014-05-29"},null,{"$f":"IF(BG5=\"\",\"\",IF(MONTH(BG5+1)<>MONTH(BG5),\"\",BG5+1))","v":"2014-05-30"},null,{"$f":"IF(BI5=\"\",\"\",IF(MONTH(BI5+1)<>MONTH(BI5),\"\",BI5+1))","v":"2014-05-31"}]
[null,null,"Matin","Après midi","Matin","Après midi","Matin","Après midi","Matin","Après midi","Matin","Après midi","Matin","Après midi","Matin","Après midi","Matin","Après midi","Matin","Après midi","Matin","Après midi","Matin","Après midi","Matin","Après midi","Matin","Après midi","Matin","Après midi","Matin","Après midi","Matin","Après midi","Matin","Après midi","Matin","Après midi","Matin","Après midi","Matin","Après midi","Matin","Après midi","Matin","Après midi","Matin","Après midi","Matin","Après midi","Matin","Après midi","Matin","Après midi","Matin","Après midi","Matin","Après midi",{"$f":"IF(BG5=\"\",\"\",\"Matin\")","v":"Matin"},{"$f":"IF(BG5=\"\",\"\",\"Apres midi\")","v":"Apres midi"},{"$f":"IF(BI5=\"\",\"\",\"Matin\")","v":"Matin"},{"$f":"IF(BI5=\"\",\"\",\"Apres midi\")","v":"Apres midi"},{"$f":"IF(BK5=\"\",\"\",\"Matin\")","v":"Matin"},{"$f":"IF(BK5=\"\",\"\",\"Apres midi\")","v":"Apres midi"}]
[null,null,null,null,null,null,null,null,null,null,null,null,null,null,null,null,null,null,null,null,null,null,null,null,null,null,null,null,null,null,null,null,null,null,null,null,null,null,null,null,null,null,null,null,null,null,null,null,null,null,null,null,null,null,null,null,null,null,null,null,null,null,null,null,{"$f":"COUNTA(C7:BL7)/2","v":0}]
[null,null,null,null,null,null,null,null,null,null,null,null,null,null,null,null,null,null,null,null,null,null,null,null,null,null,null,null,null,null,null,null,null,null,null,null,null,null,null,null,null,null,null,null,null,null,null,null,null,null,null,null,null,null,null,null,null,null,null,null,null,null,null,null,{"$f":"COUNTA(C8:BL8)/2","v":0}]
[null,null,null,null,null,null,null,null,null,null,null,null,null,null,null,null,null,null,null,null,null,null,null,null,null,null,null,null,null,null,null,null,null,null,null,null,null,null,null,null,null,null,null,null,null,null,null,null,null,null,null,null,null,null,null,null,null,null,null,null,null,null,null,null,0]
[null,null,null,null,null,null,null,null,null,null,null,null,null,null,null,null,null,null,null,null,null,null,null,null,null,null,null,null,null,null,null,null,null,null,null,null,null,null,null,null,null,null,null,null,null,null,null,null,null,null,null,null,null,null,null,null,null,null,null,null,null,null,null,null,0]
[null,null,null,null,null,null,null,null,null,null,null,null,null,null,null,null,null,null,null,null,null,null,null,null,null,null,null,null,null,null,null,null,null,null,null,null,null,null,null,null,null,null,null,null,null,null,null,null,null,null,null,null,null,null,null,null,null,null,null,null,null,null,null,null,0]
[null,null,null,null,null,null,null,null,null,null,null,null,null,null,null,null,null,null,null,null,null,null,null,null,null,null,null,null,null,null,null,null,null,null,null,null,null,null,null,null,null,null,null,null,null,null,null,null,null,null,null,null,null,null,null,null,null,null,null,null,null,null,null,null,0]
[null,null,null,null,null,null,null,null,null,null,null,null,null,null,null,null,null,null,null,null,null,null,null,null,null,null,null,null,null,null,null,null,null,null,null,null,null,null,null,null,null,null,null,null,null,null,null,null,null,null,null,null,null,null,null,null,null,null,null,null,null,null,null,null,0]
[null,null,null,null,null,null,null,null,null,null,null,null,null,null,null,null,null,null,null,null,null,null,null,null,null,null,null,null,null,null,null,null,null,null,null,null,null,null,null,null,null,null,null,null,null,null,null,null,null,null,null,null,null,null,null,null,null,null,null,null,null,null,null,null,0]
[null,null,null,null,null,null,null,null,null,null,null,null,null,null,null,null,null,null,null,null,null,null,null,null,null,null,null,null,null,null,null,null,null,null,null,null,null,null,null,null,null,null,null,null,null,null,null,null,null,null,null,null,null,null,null,null,null,null,null,null,null,null,null,null,0]
[null,null,null,null,null,null,null,null,null,null,null,null,null,null,null,null,null,null,null,null,null,null,null,null,null,null,null,null,null,null,null,null,null,null,null,null,null,null,null,null,null,null,null,null,null,null,null,null,null,null,null,null,null,null,null,null,null,null,null,null,null,null,null,null,0]
[null,null,null,null,null,null,null,null,null,null,null,null,null,null,null,null,null,null,null,null,null,null,null,null,null,null,null,null,null,null,null,null,null,null,null,null,null,null,null,null,null,null,null,null,null,null,null,null,null,null,null,null,null,null,null,null,null,null,null,null,null,null,null,null,0]
[null,null,null,null,null,null,null,null,null,null,null,null,null,null,null,null,null,null,null,null,null,null,null,null,null,null,null,null,null,null,null,null,null,null,null,null,null,null,null,null,null,null,null,null,null,null,null,null,null,null,null,null,null,null,null,null,null,null,null,null,null,null,null,null,0]
[null,null,null,null,null,null,null,null,null,null,null,null,null,null,null,null,null,null,null,null,null,null,null,null,null,null,null,null,null,null,null,null,null,null,null,null,null,null,null,null,null,null,null,null,null,null,null,null,null,null,null,null,null,null,null,null,null,null,null,null,null,null,null,null,0]
[null,null,null,null,null,null,null,null,null,null,null,null,null,null,null,null,null,null,null,null,null,null,null,null,null,null,null,null,null,null,null,null,null,null,null,null,null,null,null,null,null,null,null,null,null,null,null,null,null,null,null,null,null,null,null,null,null,null,null,null,null,null,null,null,0]
[null,null,null,null,null,null,null,null,null,null,null,null,null,null,null,null,null,null,null,null,null,null,null,null,null,null,null,null,null,null,null,null,null,null,null,null,null,null,null,null,null,null,null,null,null,null,null,null,null,null,null,null,null,null,null,null,null,null,null,null,null,null,null,null,0]
[null,null,null,null,null,null,null,null,null,null,null,null,null,null,null,null,null,null,null,null,null,null,null,null,null,null,null,null,null,null,null,null,null,null,null,null,null,null,null,null,null,null,null,null,null,null,null,null,null,null,null,null,null,null,null,null,null,null,null,null,null,null,null,null,0]
[null,null,null,null,null,null,null,null,null,null,null,null,null,null,null,null,null,null,null,null,null,null,null,null,null,null,null,null,null,null,null,null,null,null,null,null,null,null,null,null,null,null,null,null,null,null,null,null,null,null,null,null,null,null,null,null,null,null,null,null,null,null,null,null,0]
[null,null,null,null,null,null,null,null,null,null,null,null,null,null,null,null,null,null,null,null,null,null,null,null,null,null,null,null,null,null,null,null,null,null,null,null,null,null,null,null,null,null,null,null,null,null,null,null,null,null,null,null,null,null,null,null,null,null,null,null,null,null,null,null,0]
[null,null,null,null,null,null,null,null,null,null,null,null,null,null,null,null,null,null,null,null,null,null,null,null,null,null,null,null,null,null,null,null,null,null,null,null,null,null,null,null,null,null,null,null,null,null,null,null,null,null,null,null,null,null,null,null,null,null,null,null,null,null,null,null,0]
[null,null,null,null,null,null,null,null,null,null,null,null,null,null,null,null,null,null,null,null,null,null,null,null,null,null,null,null,null,null,null,null,null,null,null,null,null,null,null,null,null,null,null,null,null,null,null,null,null,null,null,null,null,null,null,null,null,null,null,null,null,null,null,null,0]
[null,null,null,null,null,null,null,null,null,null,null,null,null,null,null,null,null,null,null,null,null,null,null,null,null,null,null,null,null,null,null,null,null,null,null,null,null,null,null,null,null,null,null,null,null,null,null,null,null,null,null,null,null,null,null,null,null,null,null,null,null,null,null,null,0]
[null,null,null,null,null,null,null,null,null,null,null,null,null,null,null,null,null,null,null,null,null,null,null,null,null,null,null,null,null,null,null,null,null,null,null,null,null,null,null,null,null,null,null,null,null,null,null,null,null,null,null,null,null,null,null,null,null,null,null,null,null,null,null,null,0]
[null,null,null,null,null,null,null,null,null,null,null,null,null,null,null,null,null,null,null,null,null,null,null,null,null,null,null,null,null,null,null,null,null,null,null,null,null,null,null,null,null,null,null,null,null,null,null,null,null,null,null,null,null,null,null,null,null,null,null,null,null,null,null,null,0]
[null,null,null,null,null,null,null,null,null,null,null,null,null,null,null,null,null,null,null,null,null,null,null,null,null,null,null,null,null,null,null,null,null,null,null,null,null,null,null,null,null,null,null,null,null,null,null,null,null,null,null,null,null,null,null,null,null,null,null,null,null,null,null,null,0]
[null,null,null,null,null,null,null,null,null,null,null,null,null,null,null,null,null,null,null,null,null,null,null,null,null,null,null,null,null,null,null,null,null,null,null,null,null,null,null,null,null,null,null,null,null,null,null,null,null,null,null,null,null,null,null,null,null,null,null,null,null,null,null,null,0]
[null,null,null,null,null,null,null,null,null,null,null,null,null,null,null,null,null,null,null,null,null,null,null,null,null,null,null,null,null,null,null,null,null,null,null,null,null,null,null,null,null,null,null,null,null,null,null,null,null,null,null,null,null,null,null,null,null,null,null,null,null,null,null,null,0]
[null,null,null,null,null,null,null,null,null,null,null,null,null,null,null,null,null,null,null,null,null,null,null,null,null,null,null,null,null,null,null,null,null,null,null,null,null,null,null,null,null,null,null,null,null,null,null,null,null,null,null,null,null,null,null,null,null,null,null,null,null,null,null,null,0]
[null,null,null,null,null,null,null,null,null,null,null,null,null,null,null,null,null,null,null,null,null,null,null,null,null,null,null,null,null,null,null,null,null,null,null,null,null,null,null,null,null,null,null,null,null,null,null,null,null,null,null,null,null,null,null,null,null,null,null,null,null,null,null,null,0]
[null,null,null,null,null,null,null,null,null,null,null,null,null,null,null,null,null,null,null,null,null,null,null,null,null,null,null,null,null,null,null,null,null,null,null,null,null,null,null,null,null,null,null,null,null,null,null,null,null,null,null,null,null,null,null,null,null,null,null,null,null,null,null,null,0]
[null,null,null,null,null,null,null,null,null,null,null,null,null,null,null,null,null,null,null,null,null,null,null,null,null,null,null,null,null,null,null,null,null,null,null,null,null,null,null,null,null,null,null,null,null,null,null,null,null,null,null,null,null,null,null,null,null,null,null,null,null,null,null,null,0]
[null,null,null,null,null,null,null,null,null,null,null,null,null,null,null,null,null,null,null,null,null,null,null,null,null,null,null,null,null,null,null,null,null,null,null,null,null,null,null,null,null,null,null,null,null,null,null,null,null,null,null,null,null,null,null,null,null,null,null,null,null,null,null,null,0]
[null,null,null,null,null,null,null,null,null,null,null,null,null,null,null,null,null,null,null,null,null,null,null,null,null,null,null,null,null,null,null,null,null,null,null,null,null,null,null,null,null,null,null,null,null,null,null,null,null,null,null,null,null,null,null,null,null,null,null,null,null,null,null,null,0]
[null,null,null,null,null,null,null,null,null,null,null,null,null,null,null,null,null,null,null,null,null,null,null,null,null,null,null,null,null,null,null,null,null,null,null,null,null,null,null,null,null,null,null,null,null,null,null,null,null,null,null,null,null,null,null,null,null,null,null,null,null,null,null,null,0]
[null,null,null,null,null,null,null,null,null,null,null,null,null,null,null,null,null,null,null,null,null,null,null,null,null,null,null,null,null,null,null,null,null,null,null,null,null,null,null,null,null,null,null,null,null,null,null,null,null,null,null,null,null,null,null,null,null,null,null,null,null,null,null,null,0]
[null,null,null,null,null,null,null,null,null,null,null,null,null,null,null,null,null,null,null,null,null,null,null,null,null,null,null,null,null,null,null,null,null,null,null,null,null,null,null,null,null,null,null,null,null,null,null,null,null,null,null,null,null,null,null,null,null,null,null,null,null,null,null,null,0]
[null,null,null,null,null,null,null,null,null,null,null,null,null,null,null,null,null,null,null,null,null,null,null,null,null,null,null,null,null,null,null,null,null,null,null,null,null,null,null,null,null,null,null,null,null,null,null,null,null,null,null,null,null,null,null,null,null,null,null,null,null,null,null,null,0]
[null,null,null,null,null,null,null,null,null,null,null,null,null,null,null,null,null,null,null,null,null,null,null,null,null,null,null,null,null,null,null,null,null,null,null,null,null,null,null,null,null,null,null,null,null,null,null,null,null,null,null,null,null,null,null,null,null,null,null,null,null,null,null,null,0]
[null,null,null,null,null,null,null,null,null,null,null,null,null,null,null,null,null,null,null,null,null,null,null,null,null,null,null,null,null,null,null,null,null,null,null,null,null,null,null,null,null,null,null,null,null,null,null,null,null,null,null,null,null,null,null,null,null,null,null,null,null,null,null,null,0]
[null,null,null,null,null,null,null,null,null,null,null,null,null,null,null,null,null,null,null,null,null,null,null,null,null,null,null,null,null,null,null,null,null,null,null,null,null,null,null,null,null,null,null,null,null,null,null,null,null,null,null,null,null,null,null,null,null,null,null,null,null,null,null,null,0]
[null,null,null,null,null,null,null,null,null,null,null,null,null,null,null,null,null,null,null,null,null,null,null,null,null,null,null,null,null,null,null,null,null,null,null,null,null,null,null,null,null,null,null,null,null,null,null,null,null,null,null,null,null,null,null,null,null,null,null,null,null,null,null,null,0]
[null,null,null,null,null,null,null,null,null,null,null,null,null,null,null,null,null,null,null,null,null,null,null,null,null,null,null,null,null,null,null,null,null,null,null,null,null,null,null,null,null,null,null,null,null,null,null,null,null,null,null,null,null,null,null,null,null,null,null,null,null,null,null,null,0]
[null,null,null,null,null,null,null,null,null,null,null,null,null,null,null,null,null,null,null,null,null,null,null,null,null,null,null,null,null,null,null,null,null,null,null,null,null,null,null,null,null,null,null,null,null,null,null,null,null,null,null,null,null,null,null,null,null,null,null,null,null,null,null,null,0]
[null,null,null,null,null,null,null,null,null,null,null,null,null,null,null,null,null,null,null,null,null,null,null,null,null,null,null,null,null,null,null,null,null,null,null,null,null,null,null,null,null,null,null,null,null,null,null,null,null,null,null,null,null,null,null,null,null,null,null,null,null,null,null,null,0]
[null,null,null,null,null,null,null,null,null,null,null,null,null,null,null,null,null,null,null,null,null,null,null,null,null,null,null,null,null,null,null,null,null,null,null,null,null,null,null,null,null,null,null,null,null,null,null,null,null,null,null,null,null,null,null,null,null,null,null,null,null,null,null,null,0]
[null,null,null,null,null,null,null,null,null,null,null,null,null,null,null,null,null,null,null,null,null,null,null,null,null,null,null,null,null,null,null,null,null,null,null,null,null,null,null,null,null,null,null,null,null,null,null,null,null,null,null,null,null,null,null,null,null,null,null,null,null,null,null,null,0]
[null,null,null,null,null,null,null,null,null,null,null,null,null,null,null,null,null,null,null,null,null,null,null,null,null,null,null,null,null,null,null,null,null,null,null,null,null,null,null,null,null,null,null,null,null,null,null,null,null,null,null,null,null,null,null,null,null,null,null,null,null,null,null,null,0]
[null,null,null,null,null,null,null,null,null,null,null,null,null,null,null,null,null,null,null,null,null,null,null,null,null,null,null,null,null,null,null,null,null,null,null,null,null,null,null,null,null,null,null,null,null,null,null,null,null,null,null,null,null,null,null,null,null,null,null,null,null,null,null,null,0]
[null,null,null,null,null,null,null,null,null,null,null,null,null,null,null,null,null,null,null,null,null,null,null,null,null,null,null,null,null,null,null,null,null,null,null,null,null,null,null,null,null,null,null,null,null,null,null,null,null,null,null,null,null,null,null,null,null,null,null,null,null,null,null,null,0]
[null,null,null,null,null,null,null,null,null,null,null,null,null,null,null,null,null,null,null,null,null,null,null,null,null,null,null,null,null,null,null,null,null,null,null,null,null,null,null,null,null,null,null,null,null,null,null,null,null,null,null,null,null,null,null,null,null,null,null,null,null,null,null,null,0]
[null,null,null,null,null,null,null,null,null,null,null,null,null,null,null,null,null,null,null,null,null,null,null,null,null,null,null,null,null,null,null,null,null,null,null,null,null,null,null,null,null,null,null,null,null,null,null,null,null,null,null,null,null,null,null,null,null,null,null,null,null,null,null,null,0]
[null,null,null,null,null,null,null,null,null,null,null,null,null,null,null,null,null,null,null,null,null,null,null,null,null,null,null,null,null,null,null,null,null,null,null,null,null,null,null,null,null,null,null,null,null,null,null,null,null,null,null,null,null,null,null,null,null,null,null,null,null,null,null,null,0]
[null,null,null,null,null,null,null,null,null,null,null,null,null,null,null,null,null,null,null,null,null,null,null,null,null,null,null,null,null,null,null,null,null,null,null,null,null,null,null,null,null,null,null,null,null,null,null,null,null,null,null,null,null,null,null,null,null,null,null,null,null,null,null,null,0]
[null,null,null,null,null,null,null,null,null,null,null,null,null,null,null,null,null,null,null,null,null,null,null,null,null,null,null,null,null,null,null,null,null,null,null,null,null,null,null,null,null,null,null,null,null,null,null,null,null,null,null,null,null,null,null,null,null,null,null,null,null,null,null,null,0]
[null,null,null,null,null,null,null,null,null,null,null,null,null,null,null,null,null,null,null,null,null,null,null,null,null,null,null,null,null,null,null,null,null,null,null,null,null,null,null,null,null,null,null,null,null,null,null,null,null,null,null,null,null,null,null,null,null,null,null,null,null,null,null,null,0]
[null,null,null,null,null,null,null,null,null,null,null,null,null,null,null,null,null,null,null,null,null,null,null,null,null,null,null,null,null,null,null,null,null,null,null,null,null,null,null,null,null,null,null,null,null,null,null,null,null,null,null,null,null,null,null,null,null,null,null,null,null,null,null,null,0]
[null,null,null,null,null,null,null,null,null,null,null,null,null,null,null,null,null,null,null,null,null,null,null,null,null,null,null,null,null,null,null,null,null,null,null,null,null,null,null,null,null,null,null,null,null,null,null,null,null,null,null,null,null,null,null,null,null,null,null,null,null,null,null,null,0]
[null,null,null,null,null,null,null,null,null,null,null,null,null,null,null,null,null,null,null,null,null,null,null,null,null,null,null,null,null,null,null,null,null,null,null,null,null,null,null,null,null,null,null,null,null,null,null,null,null,null,null,null,null,null,null,null,null,null,null,null,null,null,null,null,0]
[null,null,null,null,null,null,null,null,null,null,null,null,null,null,null,null,null,null,null,null,null,null,null,null,null,null,null,null,null,null,null,null,null,null,null,null,null,null,null,null,null,null,null,null,null,null,null,null,null,null,null,null,null,null,null,null,null,null,null,null,null,null,null,null,0]
[null,null,null,null,null,null,null,null,null,null,null,null,null,null,null,null,null,null,null,null,null,null,null,null,null,null,null,null,null,null,null,null,null,null,null,null,null,null,null,null,null,null,null,null,null,null,null,null,null,null,null,null,null,null,null,null,null,null,null,null,null,null,null,null,0]
[null,null,null,null,null,null,null,null,null,null,null,null,null,null,null,null,null,null,null,null,null,null,null,null,null,null,null,null,null,null,null,null,null,null,null,null,null,null,null,null,null,null,null,null,null,null,null,null,null,null,null,null,null,null,null,null,null,null,null,null,null,null,null,null,0]
[null,null,null,null,null,null,null,null,null,null,null,null,null,null,null,null,null,null,null,null,null,null,null,null,null,null,null,null,null,null,null,null,null,null,null,null,null,null,null,null,null,null,null,null,null,null,null,null,null,null,null,null,null,null,null,null,null,null,null,null,null,null,null,null,0]
[null,null,null,null,null,null,null,null,null,null,null,null,null,null,null,null,null,null,null,null,null,null,null,null,null,null,null,null,null,null,null,null,null,null,null,null,null,null,null,null,null,null,null,null,null,null,null,null,null,null,null,null,null,null,null,null,null,null,null,null,null,null,null,null,0]
[null,null,null,null,null,null,null,null,null,null,null,null,null,null,null,null,null,null,null,null,null,null,null,null,null,null,null,null,null,null,null,null,null,null,null,null,null,null,null,null,null,null,null,null,null,null,null,null,null,null,null,null,null,null,null,null,null,null,null,null,null,null,null,null,0]
[null,null,null,null,null,null,null,null,null,null,null,null,null,null,null,null,null,null,null,null,null,null,null,null,null,null,null,null,null,null,null,null,null,null,null,null,null,null,null,null,null,null,null,null,null,null,null,null,null,null,null,null,null,null,null,null,null,null,null,null,null,null,null,null,0]
[null,null,null,null,null,null,null,null,null,null,null,null,null,null,null,null,null,null,null,null,null,null,null,null,null,null,null,null,null,null,null,null,null,null,null,null,null,null,null,null,null,null,null,null,null,null,null,null,null,null,null,null,null,null,null,null,null,null,null,null,null,null,null,null,0]
[null,null,null,null,null,null,null,null,null,null,null,null,null,null,null,null,null,null,null,null,null,null,null,null,null,null,null,null,null,null,null,null,null,null,null,null,null,null,null,null,null,null,null,null,null,null,null,null,null,null,null,null,null,null,null,null,null,null,null,null,null,null,null,null,{"$f":"COUNTA(C72:BL72)/2","v":0}]
[null,null,null,null,null,null,null,null,null,null,null,null,null,null,null,null,null,null,null,null,null,null,null,null,null,null,null,null,null,null,null,null,null,null,null,null,null,null,null,null,null,null,null,null,null,null,null,null,null,null,null,null,null,null,null,null,null,null,null,null,null,null,null,null,0]
[null,null,null,null,null,null,null,null,null,null,null,null,null,null,null,null,null,null,null,null,null,null,null,null,null,null,null,null,null,null,null,null,null,null,null,null,null,null,null,null,null,null,null,null,null,null,null,null,null,null,null,null,null,null,null,null,null,null,null,null,null,null,null,null,0]
[null,null,null,null,null,null,null,null,null,null,null,null,null,null,null,null,null,null,null,null,null,null,null,null,null,null,null,null,null,null,null,null,null,null,null,null,null,null,null,null,null,null,null,null,null,null,null,null,null,null,null,null,null,null,null,null,null,null,null,null,null,null,null,null,0]
[null,null,null,null,null,null,null,null,null,null,null,null,null,null,null,null,null,null,null,null,null,null,null,null,null,null,null,null,null,null,null,null,null,null,null,null,null,null,null,null,null,null,null,null,null,null,null,null,null,null,null,null,null,null,null,null,null,null,null,null,null,null,null,null,0]
[null,null,null,null,null,null,null,null,null,null,null,null,null,null,null,null,null,null,null,null,null,null,null,null,null,null,null,null,null,null,null,null,null,null,null,null,null,null,null,null,null,null,null,null,null,null,null,null,null,null,null,null,null,null,null,null,null,null,null,null,null,null,null,null,0]
[null,null,null,null,null,null,null,null,null,null,null,null,null,null,null,null,null,null,null,null,null,null,null,null,null,null,null,null,null,null,null,null,null,null,null,null,null,null,null,null,null,null,null,null,null,null,null,null,null,null,null,null,null,null,null,null,null,null,null,null,null,null,null,null,0]
[null,null,null,null,null,null,null,null,null,null,null,null,null,null,null,null,null,null,null,null,null,null,null,null,null,null,null,null,null,null,null,null,null,null,null,null,null,null,null,null,null,null,null,null,null,null,null,null,null,null,null,null,null,null,null,null,null,null,null,null,null,null,null,null,0]
[null,null,null,null,null,null,null,null,null,null,null,null,null,null,null,null,null,null,null,null,null,null,null,null,null,null,null,null,null,null,null,null,null,null,null,null,null,null,null,null,null,null,null,null,null,null,null,null,null,null,null,null,null,null,null,null,null,null,null,null,null,null,null,null,0]
[null,null,null,null,null,null,null,null,null,null,null,null,null,null,null,null,null,null,null,null,null,null,null,null,null,null,null,null,null,null,null,null,null,null,null,null,null,null,null,null,null,null,null,null,null,null,null,null,null,null,null,null,null,null,null,null,null,null,null,null,null,null,null,null,0]
[null,null,null,null,null,null,null,null,null,null,null,null,null,null,null,null,null,null,null,null,null,null,null,null,null,null,null,null,null,null,null,null,null,null,null,null,null,null,null,null,null,null,null,null,null,null,null,null,null,null,null,null,null,null,null,null,null,null,null,null,null,null,null,null,0]
[null,null,null,null,null,null,null,null,null,null,null,null,null,null,null,null,null,null,null,null,null,null,null,null,null,null,null,null,null,null,null,null,null,null,null,null,null,null,null,null,null,null,null,null,null,null,null,null,null,null,null,null,null,null,null,null,null,null,null,null,null,null,null,null,0]
[null,null,null,null,null,null,null,null,null,null,null,null,null,null,null,null,null,null,null,null,null,null,null,null,null,null,null,null,null,null,null,null,null,null,null,null,null,null,null,null,null,null,null,null,null,null,null,null,null,null,null,null,null,null,null,null,null,null,null,null,null,null,null,null,0]
[null,null,null,null,null,null,null,null,null,null,null,null,null,null,null,null,null,null,null,null,null,null,null,null,null,null,null,null,null,null,null,null,null,null,null,null,null,null,null,null,null,null,null,null,null,null,null,null,null,null,null,null,null,null,null,null,null,null,null,null,null,null,null,null,0]
[null,null,null,null,null,null,null,null,null,null,null,null,null,null,null,null,null,null,null,null,null,null,null,null,null,null,null,null,null,null,null,null,null,null,null,null,null,null,null,null,null,null,null,null,null,null,null,null,null,null,null,null,null,null,null,null,null,null,null,null,null,null,null,null,0]
[null,null,null,null,null,null,null,null,null,null,null,null,null,null,null,null,null,null,null,null,null,null,null,null,null,null,null,null,null,null,null,null,null,null,null,null,null,null,null,null,null,null,null,null,null,null,null,null,null,null,null,null,null,null,null,null,null,null,null,null,null,null,null,null,0]
[null,null,null,null,null,null,null,null,null,null,null,null,null,null,null,null,null,null,null,null,null,null,null,null,null,null,null,null,null,null,null,null,null,null,null,null,null,null,null,null,null,null,null,null,null,null,null,null,null,null,null,null,null,null,null,null,null,null,null,null,null,null,null,null,0]
[null,null,null,null,null,null,null,null,null,null,null,null,null,null,null,null,null,null,null,null,null,null,null,null,null,null,null,null,null,null,null,null,null,null,null,null,null,null,null,null,null,null,null,null,null,null,null,null,null,null,null,null,null,null,null,null,null,null,null,null,null,null,null,null,0]
[null,null,null,null,null,null,null,null,null,null,null,null,null,null,null,null,null,null,null,null,null,null,null,null,null,null,null,null,null,null,null,null,null,null,null,null,null,null,null,null,null,null,null,null,null,null,null,null,null,null,null,null,null,null,null,null,null,null,null,null,null,null,null,null,0]
[null,null,null,null,null,null,null,null,null,null,null,null,null,null,null,null,null,null,null,null,null,null,null,null,null,null,null,null,null,null,null,null,null,null,null,null,null,null,null,null,null,null,null,null,null,null,null,null,null,null,null,null,null,null,null,null,null,null,null,null,null,null,null,null,0]
[null,null,null,null,null,null,null,null,null,null,null,null,null,null,null,null,null,null,null,null,null,null,null,null,null,null,null,null,null,null,null,null,null,null,null,null,null,null,null,null,null,null,null,null,null,null,null,null,null,null,null,null,null,null,null,null,null,null,null,null,null,null,null,null,0]
[null,null,null,null,null,null,null,null,null,null,null,null,null,null,null,null,null,null,null,null,null,null,null,null,null,null,null,null,null,null,null,null,null,null,null,null,null,null,null,null,null,null,null,null,null,null,null,null,null,null,null,null,null,null,null,null,null,null,null,null,null,null,null,null,0]
[null,null,null,null,null,null,null,null,null,null,null,null,null,null,null,null,null,null,null,null,null,null,null,null,null,null,null,null,null,null,null,null,null,null,null,null,null,null,null,null,null,null,null,null,null,null,null,null,null,null,null,null,null,null,null,null,null,null,null,null,null,null,null,null,0]
[null,null,null,null,null,null,null,null,null,null,null,null,null,null,null,null,null,null,null,null,null,null,null,null,null,null,null,null,null,null,null,null,null,null,null,null,null,null,null,null,null,null,null,null,null,null,null,null,null,null,null,null,null,null,null,null,null,null,null,null,null,null,null,null,0]
[null,null,null,null,null,null,null,null,null,null,null,null,null,null,null,null,null,null,null,null,null,null,null,null,null,null,null,null,null,null,null,null,null,null,null,null,null,null,null,null,null,null,null,null,null,null,null,null,null,null,null,null,null,null,null,null,null,null,null,null,null,null,null,null,0]
[null,null,null,null,null,null,null,null,null,null,null,null,null,null,null,null,null,null,null,null,null,null,null,null,null,null,null,null,null,null,null,null,null,null,null,null,null,null,null,null,null,null,null,null,null,null,null,null,null,null,null,null,null,null,null,null,null,null,null,null,null,null,null,null,0]
[null,null,null,null,null,null,null,null,null,null,null,null,null,null,null,null,null,null,null,null,null,null,null,null,null,null,null,null,null,null,null,null,null,null,null,null,null,null,null,null,null,null,null,null,null,null,null,null,null,null,null,null,null,null,null,null,null,null,null,null,null,null,null,null,0]
[null,null,null,null,null,null,null,null,null,null,null,null,null,null,null,null,null,null,null,null,null,null,null,null,null,null,null,null,null,null,null,null,null,null,null,null,null,null,null,null,null,null,null,null,null,null,null,null,null,null,null,null,null,null,null,null,null,null,null,null,null,null,null,null,0]
[null,null,null,null,null,null,null,null,null,null,null,null,null,null,null,null,null,null,null,null,null,null,null,null,null,null,null,null,null,null,null,null,null,null,null,null,null,null,null,null,null,null,null,null,null,null,null,null,null,null,null,null,null,null,null,null,null,null,null,null,null,null,null,null,0]

{"sheet":"Juin","index":7,"n_rows":100,"n_cols":65,"rows_kept":100,"cut":false,"hidden":false,"merged":[[17,0,17,1],[18,0,18,1],[19,0,19,1],[20,0,20,1],[13,0,13,1],[8,0,8,1],[9,0,9,1],[12,0,12,1],[10,0,10,1],[11,0,11,1],[14,0,14,1],[15,0,15,1],[16,0,16,1],[7,0,7,1],[4,44,4,45],[4,32,4,33],[4,34,4,35],[4,36,4,37],[4,38,4,39],[4,40,4,41],[4,42,4,43],[4,20,4,21],[4,14,4,15],[4,16,4,17],[4,18,4,19],[4,2,4,3],[4,4,4,5],[4,6,4,7],[4,8,4,9],[4,62,4,63],[6,0,6,1],[4,52,4,53],[4,54,4,55],[4,30,4,31],[4,58,4,59],[4,60,4,61],[4,22,4,23],[4,24,4,25],[4,26,4,27],[4,28,4,29],[4,56,4,57],[4,46,4,47],[4,48,4,49],[4,50,4,51],[4,12,4,13],[4,10,4,11],[1,42,1,46],[3,32,3,33],[3,34,3,35],[3,36,3,37],[3,50,3,51],[3,48,3,49],[3,26,3,27],[3,28,3,29],[3,22,3,23],[3,24,3,25],[3,38,3,39],[3,40,3,41],[3,42,3,43],[3,44,3,45],[3,46,3,47],[3,30,3,31],[1,47,1,49],[1,55,1,59],[1,60,1,62],[3,2,3,3],[3,4,3,5],[3,6,3,7],[3,8,3,9],[3,10,3,11],[3,12,3,13],[1,3,1,7],[1,8,1,10],[1,16,1,20],[1,21,1,23],[1,29,1,33],[1,34,1,36],[3,14,3,15],[3,62,3,63],[3,52,3,53],[3,54,3,55],[3,56,3,57],[3,58,3,59],[3,60,3,61],[3,16,3,17],[3,18,3,19],[3,20,3,21],[26,0,26,1],[27,0,27,1],[28,0,28,1],[29,0,29,1],[30,0,30,1],[21,0,21,1],[22,0,22,1],[23,0,23,1],[24,0,24,1],[25,0,25,1],[36,0,36,1],[37,0,37,1],[38,0,38,1],[39,0,39,1],[40,0,40,1],[31,0,31,1],[32,0,32,1],[33,0,33,1],[34,0,34,1],[35,0,35,1],[46,0,46,1],[47,0,47,1],[48,0,48,1],[49,0,49,1],[50,0,50,1],[41,0,41,1],[42,0,42,1],[43,0,43,1],[44,0,44,1],[45,0,45,1],[56,0,56,1],[57,0,57,1],[58,0,58,1],[59,0,59,1],[60,0,60,1],[51,0,51,1],[52,0,52,1],[53,0,53,1],[54,0,54,1],[55,0,55,1],[66,0,66,1],[67,0,67,1],[68,0,68,1],[69,0,69,1],[70,0,70,1],[61,0,61,1],[62,0,62,1],[63,0,63,1],[64,0,64,1],[65,0,65,1],[76,0,76,1],[77,0,77,1],[78,0,78,1],[79,0,79,1],[80,0,80,1],[71,0,71,1],[72,0,72,1],[73,0,73,1],[74,0,74,1],[75,0,75,1],[86,0,86,1],[87,0,87,1],[88,0,88,1],[89,0,89,1],[90,0,90,1],[81,0,81,1],[82,0,82,1],[83,0,83,1],[84,0,84,1],[85,0,85,1],[96,0,96,1],[97,0,97,1],[98,0,98,1],[99,0,99,1],[91,0,91,1],[92,0,92,1],[93,0,93,1],[94,0,94,1],[95,0,95,1]]}
[1,{"$f":"C5","v":"2014-06-01"}]
[null,null,null,{"$f":"IF(An!$Q$4=\"\",\"\",An!$Q$4)","v":""},null,null,null,null,{"$f":"C5","v":"2014-06-01"},null,null,null,null,"ACCEUIL",null,null,{"$f":"IF(An!$Q$4=\"\",\"\",An!$Q$4)","v":""},null,null,null,null,{"$f":"C5","v":"2014-06-01"},null,null,null,null,"ACCEUIL",null,null,{"$f":"IF(An!$Q$4=\"\",\"\",An!$Q$4)","v":""},null,null,null,null,{"$f":"C5","v":"2014-06-01"},null,null,null,null,"ACCEUIL",null,null,{"$f":"IF(An!$Q$4=\"\",\"\",An!$Q$4)","v":""},null,null,null,null,{"$f":"C5","v":"2014-06-01"},null,null,null,null,"ACCEUIL",null,null,{"$f":"IF(An!$Q$4=\"\",\"\",An!$Q$4)","v":""},null,null,null,null,{"$f":"C5","v":"2014-06-01"},null,null,"ACCEUIL"]
[]
[null,null,{"$f":"IF(C5=\"\",\"\",IF(LOOKUP(C5,Fériés)=C5,\"\",CHOOSE(WEEKDAY(C5,1),\"Dimanche\",\"Lundi\",\"Mardi\",\"Mercredi\",\"Jeudi\",\"Vendredi\",\"Samedi\")))","v":"Dimanche"},null,"Lundi",null,"Mardi",null,"Mercredi",null,"Jeudi",null,"Vendredi",null,"Samedi",null,"Dimanche",null,{"$f":"IF(S5=\"\",\"\",IF(LOOKUP(S5,Fériés)=S5,\"\",CHOOSE(WEEKDAY(S5,1),\"Dimanche\",\"Lundi\",\"Mardi\",\"Mercredi\",\"Jeudi\",\"Vendredi\",\"Samedi\")))","v":""},null,"Mardi",null,"Mercredi",null,"Jeudi",null,"Vendredi",null,"Samedi",null,"Dimanche",null,{"$f":"IF(AG5=\"\",\"\",IF(LOOKUP(AG5,Fériés)=AG5,\"\",CHOOSE(WEEKDAY(AG5,1),\"Dimanche\",\"Lundi\",\"Mardi\",\"Mercredi\",\"Jeudi\",\"Vendredi\",\"Samedi\")))","v":"Lundi"},null,{"$f":"IF(AI5=\"\",\"\",IF(LOOKUP(AI5,Fériés)=AI5,\"\",CHOOSE(WEEKDAY(AI5,1),\"Dimanche\",\"Lundi\",\"Mardi\",\"Mercredi\",\"Jeudi\",\"Vendredi\",\"Samedi\")))","v":"Mardi"},null,"Mercredi",null,"Jeudi",null,"Vendredi",null,"Samedi",null,"Dimanche",null,"Lundi",null,{"$f":"IF(AW5=\"\",\"\",IF(LOOKUP(AW5,Fériés)=AW5,\"\",CHOOSE(WEEKDAY(AW5,1),\"Dimanche\",\"Lundi\",\"Mardi\",\"Mercredi\",\"Jeudi\",\"Vendredi\",\"Samedi\")))","v":"Mardi"},null,{"$f":"IF(AY5=\"\",\"\",IF(LOOKUP(AY5,Fériés)=AY5,\"\",CHOOSE(WEEKDAY(AY5,1),\"Dimanche\",\"Lundi\",\"Mardi\",\"Mercredi\",\"Jeudi\",\"Vendredi\",\"Samedi\")))","v":"Mercredi"},null,"Jeudi",null,"Vendredi",null,"Samedi",null,"Dimanche",null,"Lundi",null,""]
[null,null,{"$f":"DATE(Année,6,1)","v":"2014-06-01"},null,{"$f":"IF(C5=\"\",\"\",IF(MONTH(C5+1)<>MONTH(C5),\"\",C5+1))","v":"2014-06-02"},null,{"$f":"IF(E5=\"\",\"\",IF(MONTH(E5+1)<>MONTH(E5),\"\",E5+1))","v":"2014-06-03"},null,{"$f":"IF(G5=\"\",\"\",IF(MONTH(G5+1)<>MONTH(G5),\"\",G5+1))","v":"2014-06-04"},null,{"$f":"IF(I5=\"\",\"\",IF(MONTH(I5+1)<>MONTH(I5),\"\",I5+1))","v":"2014-06-05"},null,{"$f":"IF(K5=\"\",\"\",IF(MONTH(K5+1)<>MONTH(K5),\"\",K5+1))","v":"2014-06-06"},null,{"$f":"IF(M5=\"\",\"\",IF(MONTH(M5+1)<>MONTH(M5),\"\",M5+1))","v":"2014-06-07"},null,{"$f":"IF(O5=\"\",\"\",IF(MONTH(O5+1)<>MONTH(O5),\"\",O5+1))","v":"2014-06-08"},null,{"$f":"IF(Q5=\"\",\"\",IF(MONTH(Q5+1)<>MONTH(Q5),\"\",Q5+1))","v":"2014-06-09"},null,{"$f":"IF(S5=\"\",\"\",IF(MONTH(S5+1)<>MONTH(S5),\"\",S5+1))","v":"2014-06-10"},null,{"$f":"IF(U5=\"\",\"\",IF(MONTH(U5+1)<>MONTH(U5),\"\",U5+1))","v":"2014-06-11"},null,{"$f":"IF(W5=\"\",\"\",IF(MONTH(W5+1)<>MONTH(W5),\"\",W5+1))","v":"2014-06-12"},null,{"$f":"IF(Y5=\"\",\"\",IF(MONTH(Y5+1)<>MONTH(Y5),\"\",Y5+1))","v":"2014-06-13"},null,{"$f":"IF(AA5=\"\",\"\",IF(MONTH(AA5+1)<>MONTH(AA5),\"\",AA5+1))","v":"2014-06-14"},null,{"$f":"IF(AC5=\"\",\"\",IF(MONTH(AC5+1)<>MONTH(AC5),\"\",AC5+1))","v":"2014-06-15"},null,{"$f":"IF(AE5=\"\",\"\",IF(MONTH(AE5+1)<>MONTH(AE5),\"\",AE5+1))","v":"2014-06-16"},null,{"$f":"IF(AG5=\"\",\"\",IF(MONTH(AG5+1)<>MONTH(AG5),\"\",AG5+1))","v":"2014-06-17"},null,{"$f":"IF(AI5=\"\",\"\",IF(MONTH(AI5+1)<>MONTH(AI5),\"\",AI5+1))","v":"2014-06-18"},null,{"$f":"IF(AK5=\"\",\"\",IF(MONTH(AK5+1)<>MONTH(AK5),\"\",AK5+1))","v":"2014-06-19"},null,{"$f":"IF(AM5=\"\",\"\",IF(MONTH(AM5+1)<>MONTH(AM5),\"\",AM5+1))","v":"2014-06-20"},null,{"$f":"IF(AO5=\"\",\"\",IF(MONTH(AO5+1)<>MONTH(AO5),\"\",AO5+1))","v":"2014-06-21"},null,{"$f":"IF(AQ5=\"\",\"\",IF(MONTH(AQ5+1)<>MONTH(AQ5),\"\",AQ5+1))","v":"2014-06-22"},null,{"$f":"IF(AS5=\"\",\"\",IF(MONTH(AS5+1)<>MONTH(AS5),\"\",AS5+1))","v":"2014-06-23"},null,{"$f":"IF(AU5=\"\",\"\",IF(MONTH(AU5+1)<>MONTH(AU5),\"\",AU5+1))","v":"2014-06-24"},null,{"$f":"IF(AW5=\"\",\"\",IF(MONTH(AW5+1)<>MONTH(AW5),\"\",AW5+1))","v":"2014-06-25"},null,{"$f":"IF(AY5=\"\",\"\",IF(MONTH(AY5+1)<>MONTH(AY5),\"\",AY5+1))","v":"2014-06-26"},null,{"$f":"IF(BA5=\"\",\"\",IF(MONTH(BA5+1)<>MONTH(BA5),\"\",BA5+1))","v":"2014-06-27"},null,{"$f":"IF(BC5=\"\",\"\",IF(MONTH(BC5+1)<>MONTH(BC5),\"\",BC5+1))","v":"2014-06-28"},null,{"$f":"IF(BE5=\"\",\"\",IF(MONTH(BE5+1)<>MONTH(BE5),\"\",BE5+1))","v":"2014-06-29"},null,{"$f":"IF(BG5=\"\",\"\",IF(MONTH(BG5+1)<>MONTH(BG5),\"\",BG5+1))","v":"2014-06-30"},null,{"$f":"IF(BI5=\"\",\"\",IF(MONTH(BI5+1)<>MONTH(BI5),\"\",BI5+1))","v":""}]
[null,null,"Matin","Après midi","Matin","Après midi","Matin","Après midi","Matin","Après midi","Matin","Après midi","Matin","Après midi","Matin","Après midi","Matin","Après midi","Matin","Après midi","Matin","Après midi","Matin","Après midi","Matin","Après midi","Matin","Après midi","Matin","Après midi","Matin","Après midi","Matin","Après midi","Matin","Après midi","Matin","Après midi","Matin","Après midi","Matin","Après midi","Matin","Après midi","Matin","Après midi","Matin","Après midi","Matin","Après midi","Matin","Après midi","Matin","Après midi","Matin","Après midi","Matin","Après midi",{"$f":"IF(BG5=\"\",\"\",\"Matin\")","v":"Matin"},{"$f":"IF(BG5=\"\",\"\",\"Apres midi\")","v":"Apres midi"},{"$f":"IF(BI5=\"\",\"\",\"Matin\")","v":"Matin"},{"$f":"IF(BI5=\"\",\"\",\"Apres midi\")","v":"Apres midi"},{"$f":"IF(BK5=\"\",\"\",\"Matin\")","v":""},{"$f":"IF(BK5=\"\",\"\",\"Apres midi\")","v":""}]
[null,null,null,null,null,null,null,null,null,null,null,null,null,null,null,null,null,null,null,null,null,null,null,null,null,null,null,null,null,null,null,null,null,null,null,null,null,null,null,null,null,null,null,null,null,null,null,null,null,null,null,null,null,null,null,null,null,null,null,null,null,null,null,null,{"$f":"COUNTA(C7:BL7)/2","v":0}]
[null,null,null,null,null,null,null,null,null,null,null,null,null,null,null,null,null,null,null,null,null,null,null,null,null,null,null,null,null,null,null,null,null,null,null,null,null,null,null,null,null,null,null,null,null,null,null,null,null,null,null,null,null,null,null,null,null,null,null,null,null,null,null,null,{"$f":"COUNTA(C8:BL8)/2","v":0}]
[null,null,null,null,null,null,null,null,null,null,null,null,null,null,null,null,null,null,null,null,null,null,null,null,null,null,null,null,null,null,null,null,null,null,null,null,null,null,null,null,null,null,null,null,null,null,null,null,null,null,null,null,null,null,null,null,null,null,null,null,null,null,null,null,0]
[null,null,null,null,null,null,null,null,null,null,null,null,null,null,null,null,null,null,null,null,null,null,null,null,null,null,null,null,null,null,null,null,null,null,null,null,null,null,null,null,null,null,null,null,null,null,null,null,null,null,null,null,null,null,null,null,null,null,null,null,null,null,null,null,0]
[null,null,null,null,null,null,null,null,null,null,null,null,null,null,null,null,null,null,null,null,null,null,null,null,null,null,null,null,null,null,null,null,null,null,null,null,null,null,null,null,null,null,null,null,null,null,null,null,null,null,null,null,null,null,null,null,null,null,null,null,null,null,null,null,0]
[null,null,null,null,null,null,null,null,null,null,null,null,null,null,null,null,null,null,null,null,null,null,null,null,null,null,null,null,null,null,null,null,null,null,null,null,null,null,null,null,null,null,null,null,null,null,null,null,null,null,null,null,null,null,null,null,null,null,null,null,null,null,null,null,0]
[null,null,null,null,null,null,null,null,null,null,null,null,null,null,null,null,null,null,null,null,null,null,null,null,null,null,null,null,null,null,null,null,null,null,null,null,null,null,null,null,null,null,null,null,null,null,null,null,null,null,null,null,null,null,null,null,null,null,null,null,null,null,null,null,0]
[null,null,null,null,null,null,null,null,null,null,null,null,null,null,null,null,null,null,null,null,null,null,null,null,null,null,null,null,null,null,null,null,null,null,null,null,null,null,null,null,null,null,null,null,null,null,null,null,null,null,null,null,null,null,null,null,null,null,null,null,null,null,null,null,0]
[null,null,null,null,null,null,null,null,null,null,null,null,null,null,null,null,null,null,null,null,null,null,null,null,null,null,null,null,null,null,null,null,null,null,null,null,null,null,null,null,null,null,null,null,null,null,null,null,null,null,null,null,null,null,null,null,null,null,null,null,null,null,null,null,0]
[null,null,null,null,null,null,null,null,null,null,null,null,null,null,null,null,null,null,null,null,null,null,null,null,null,null,null,null,null,null,null,null,null,null,null,null,null,null,null,null,null,null,null,null,null,null,null,null,null,null,null,null,null,null,null,null,null,null,null,null,null,null,null,null,0]
[null,null,null,null,null,null,null,null,null,null,null,null,null,null,null,null,null,null,null,null,null,null,null,null,null,null,null,null,null,null,null,null,null,null,null,null,null,null,null,null,null,null,null,null,null,null,null,null,null,null,null,null,null,null,null,null,null,null,null,null,null,null,null,null,0]
[null,null,null,null,null,null,null,null,null,null,null,null,null,null,null,null,null,null,null,null,null,null,null,null,null,null,null,null,null,null,null,null,null,null,null,null,null,null,null,null,null,null,null,null,null,null,null,null,null,null,null,null,null,null,null,null,null,null,null,null,null,null,null,null,0]
[null,null,null,null,null,null,null,null,null,null,null,null,null,null,null,null,null,null,null,null,null,null,null,null,null,null,null,null,null,null,null,null,null,null,null,null,null,null,null,null,null,null,null,null,null,null,null,null,null,null,null,null,null,null,null,null,null,null,null,null,null,null,null,null,0]
[null,null,null,null,null,null,null,null,null,null,null,null,null,null,null,null,null,null,null,null,null,null,null,null,null,null,null,null,null,null,null,null,null,null,null,null,null,null,null,null,null,null,null,null,null,null,null,null,null,null,null,null,null,null,null,null,null,null,null,null,null,null,null,null,0]
[null,null,null,null,null,null,null,null,null,null,null,null,null,null,null,null,null,null,null,null,null,null,null,null,null,null,null,null,null,null,null,null,null,null,null,null,null,null,null,null,null,null,null,null,null,null,null,null,null,null,null,null,null,null,null,null,null,null,null,null,null,null,null,null,0]
[null,null,null,null,null,null,null,null,null,null,null,null,null,null,null,null,null,null,null,null,null,null,null,null,null,null,null,null,null,null,null,null,null,null,null,null,null,null,null,null,null,null,null,null,null,null,null,null,null,null,null,null,null,null,null,null,null,null,null,null,null,null,null,null,0]
[null,null,null,null,null,null,null,null,null,null,null,null,null,null,null,null,null,null,null,null,null,null,null,null,null,null,null,null,null,null,null,null,null,null,null,null,null,null,null,null,null,null,null,null,null,null,null,null,null,null,null,null,null,null,null,null,null,null,null,null,null,null,null,null,0]
[null,null,null,null,null,null,null,null,null,null,null,null,null,null,null,null,null,null,null,null,null,null,null,null,null,null,null,null,null,null,null,null,null,null,null,null,null,null,null,null,null,null,null,null,null,null,null,null,null,null,null,null,null,null,null,null,null,null,null,null,null,null,null,null,0]
[null,null,null,null,null,null,null,null,null,null,null,null,null,null,null,null,null,null,null,null,null,null,null,null,null,null,null,null,null,null,null,null,null,null,null,null,null,null,null,null,null,null,null,null,null,null,null,null,null,null,null,null,null,null,null,null,null,null,null,null,null,null,null,null,0]
[null,null,null,null,null,null,null,null,null,null,null,null,null,null,null,null,null,null,null,null,null,null,null,null,null,null,null,null,null,null,null,null,null,null,null,null,null,null,null,null,null,null,null,null,null,null,null,null,null,null,null,null,null,null,null,null,null,null,null,null,null,null,null,null,0]
[null,null,null,null,null,null,null,null,null,null,null,null,null,null,null,null,null,null,null,null,null,null,null,null,null,null,null,null,null,null,null,null,null,null,null,null,null,null,null,null,null,null,null,null,null,null,null,null,null,null,null,null,null,null,null,null,null,null,null,null,null,null,null,null,0]
[null,null,null,null,null,null,null,null,null,null,null,null,null,null,null,null,null,null,null,null,null,null,null,null,null,null,null,null,null,null,null,null,null,null,null,null,null,null,null,null,null,null,null,null,null,null,null,null,null,null,null,null,null,null,null,null,null,null,null,null,null,null,null,null,0]
[null,null,null,null,null,null,null,null,null,null,null,null,null,null,null,null,null,null,null,null,null,null,null,null,null,null,null,null,null,null,null,null,null,null,null,null,null,null,null,null,null,null,null,null,null,null,null,null,null,null,null,null,null,null,null,null,null,null,null,null,null,null,null,null,0]
[null,null,null,null,null,null,null,null,null,null,null,null,null,null,null,null,null,null,null,null,null,null,null,null,null,null,null,null,null,null,null,null,null,null,null,null,null,null,null,null,null,null,null,null,null,null,null,null,null,null,null,null,null,null,null,null,null,null,null,null,null,null,null,null,0]
[null,null,null,null,null,null,null,null,null,null,null,null,null,null,null,null,null,null,null,null,null,null,null,null,null,null,null,null,null,null,null,null,null,null,null,null,null,null,null,null,null,null,null,null,null,null,null,null,null,null,null,null,null,null,null,null,null,null,null,null,null,null,null,null,0]
[null,null,null,null,null,null,null,null,null,null,null,null,null,null,null,null,null,null,null,null,null,null,null,null,null,null,null,null,null,null,null,null,null,null,null,null,null,null,null,null,null,null,null,null,null,null,null,null,null,null,null,null,null,null,null,null,null,null,null,null,null,null,null,null,0]
[null,null,null,null,null,null,null,null,null,null,null,null,null,null,null,null,null,null,null,null,null,null,null,null,null,null,null,null,null,null,null,null,null,null,null,null,null,null,null,null,null,null,null,null,null,null,null,null,null,null,null,null,null,null,null,null,null,null,null,null,null,null,null,null,0]
[null,null,null,null,null,null,null,null,null,null,null,null,null,null,null,null,null,null,null,null,null,null,null,null,null,null,null,null,null,null,null,null,null,null,null,null,null,null,null,null,null,null,null,null,null,null,null,null,null,null,null,null,null,null,null,null,null,null,null,null,null,null,null,null,0]
[null,null,null,null,null,null,null,null,null,null,null,null,null,null,null,null,null,null,null,null,null,null,null,null,null,null,null,null,null,null,null,null,null,null,null,null,null,null,null,null,null,null,null,null,null,null,null,null,null,null,null,null,null,null,null,null,null,null,null,null,null,null,null,null,0]
[null,null,null,null,null,null,null,null,null,null,null,null,null,null,null,null,null,null,null,null,null,null,null,null,null,null,null,null,null,null,null,null,null,null,null,null,null,null,null,null,null,null,null,null,null,null,null,null,null,null,null,null,null,null,null,null,null,null,null,null,null,null,null,null,0]
[null,null,null,null,null,null,null,null,null,null,null,null,null,null,null,null,null,null,null,null,null,null,null,null,null,null,null,null,null,null,null,null,null,null,null,null,null,null,null,null,null,null,null,null,null,null,null,null,null,null,null,null,null,null,null,null,null,null,null,null,null,null,null,null,0]
[null,null,null,null,null,null,null,null,null,null,null,null,null,null,null,null,null,null,null,null,null,null,null,null,null,null,null,null,null,null,null,null,null,null,null,null,null,null,null,null,null,null,null,null,null,null,null,null,null,null,null,null,null,null,null,null,null,null,null,null,null,null,null,null,0]
[null,null,null,null,null,null,null,null,null,null,null,null,null,null,null,null,null,null,null,null,null,null,null,null,null,null,null,null,null,null,null,null,null,null,null,null,null,null,null,null,null,null,null,null,null,null,null,null,null,null,null,null,null,null,null,null,null,null,null,null,null,null,null,null,0]
[null,null,null,null,null,null,null,null,null,null,null,null,null,null,null,null,null,null,null,null,null,null,null,null,null,null,null,null,null,null,null,null,null,null,null,null,null,null,null,null,null,null,null,null,null,null,null,null,null,null,null,null,null,null,null,null,null,null,null,null,null,null,null,null,0]
[null,null,null,null,null,null,null,null,null,null,null,null,null,null,null,null,null,null,null,null,null,null,null,null,null,null,null,null,null,null,null,null,null,null,null,null,null,null,null,null,null,null,null,null,null,null,null,null,null,null,null,null,null,null,null,null,null,null,null,null,null,null,null,null,0]
[null,null,null,null,null,null,null,null,null,null,null,null,null,null,null,null,null,null,null,null,null,null,null,null,null,null,null,null,null,null,null,null,null,null,null,null,null,null,null,null,null,null,null,null,null,null,null,null,null,null,null,null,null,null,null,null,null,null,null,null,null,null,null,null,0]
[null,null,null,null,null,null,null,null,null,null,null,null,null,null,null,null,null,null,null,null,null,null,null,null,null,null,null,null,null,null,null,null,null,null,null,null,null,null,null,null,null,null,null,null,null,null,null,null,null,null,null,null,null,null,null,null,null,null,null,null,null,null,null,null,0]
[null,null,null,null,null,null,null,null,null,null,null,null,null,null,null,null,null,null,null,null,null,null,null,null,null,null,null,null,null,null,null,null,null,null,null,null,null,null,null,null,null,null,null,null,null,null,null,null,null,null,null,null,null,null,null,null,null,null,null,null,null,null,null,null,0]
[null,null,null,null,null,null,null,null,null,null,null,null,null,null,null,null,null,null,null,null,null,null,null,null,null,null,null,null,null,null,null,null,null,null,null,null,null,null,null,null,null,null,null,null,null,null,null,null,null,null,null,null,null,null,null,null,null,null,null,null,null,null,null,null,0]
[null,null,null,null,null,null,null,null,null,null,null,null,null,null,null,null,null,null,null,null,null,null,null,null,null,null,null,null,null,null,null,null,null,null,null,null,null,null,null,null,null,null,null,null,null,null,null,null,null,null,null,null,null,null,null,null,null,null,null,null,null,null,null,null,0]
[null,null,null,null,null,null,null,null,null,null,null,null,null,null,null,null,null,null,null,null,null,null,null,null,null,null,null,null,null,null,null,null,null,null,null,null,null,null,null,null,null,null,null,null,null,null,null,null,null,null,null,null,null,null,null,null,null,null,null,null,null,null,null,null,0]
[null,null,null,null,null,null,null,null,null,null,null,null,null,null,null,null,null,null,null,null,null,null,null,null,null,null,null,null,null,null,null,null,null,null,null,null,null,null,null,null,null,null,null,null,null,null,null,null,null,null,null,null,null,null,null,null,null,null,null,null,null,null,null,null,0]
[null,null,null,null,null,null,null,null,null,null,null,null,null,null,null,null,null,null,null,null,null,null,null,null,null,null,null,null,null,null,null,null,null,null,null,null,null,null,null,null,null,null,null,null,null,null,null,null,null,null,null,null,null,null,null,null,null,null,null,null,null,null,null,null,0]
[null,null,null,null,null,null,null,null,null,null,null,null,null,null,null,null,null,null,null,null,null,null,null,null,null,null,null,null,null,null,null,null,null,null,null,null,null,null,null,null,null,null,null,null,null,null,null,null,null,null,null,null,null,null,null,null,null,null,null,null,null,null,null,null,0]
[null,null,null,null,null,null,null,null,null,null,null,null,null,null,null,null,null,null,null,null,null,null,null,null,null,null,null,null,null,null,null,null,null,null,null,null,null,null,null,null,null,null,null,null,null,null,null,null,null,null,null,null,null,null,null,null,null,null,null,null,null,null,null,null,0]
[null,null,null,null,null,null,null,null,null,null,null,null,null,null,null,null,null,null,null,null,null,null,null,null,null,null,null,null,null,null,null,null,null,null,null,null,null,null,null,null,null,null,null,null,null,null,null,null,null,null,null,null,null,null,null,null,null,null,null,null,null,null,null,null,0]
[null,null,null,null,null,null,null,null,null,null,null,null,null,null,null,null,null,null,null,null,null,null,null,null,null,null,null,null,null,null,null,null,null,null,null,null,null,null,null,null,null,null,null,null,null,null,null,null,null,null,null,null,null,null,null,null,null,null,null,null,null,null,null,null,0]
[null,null,null,null,null,null,null,null,null,null,null,null,null,null,null,null,null,null,null,null,null,null,null,null,null,null,null,null,null,null,null,null,null,null,null,null,null,null,null,null,null,null,null,null,null,null,null,null,null,null,null,null,null,null,null,null,null,null,null,null,null,null,null,null,0]
[null,null,null,null,null,null,null,null,null,null,null,null,null,null,null,null,null,null,null,null,null,null,null,null,null,null,null,null,null,null,null,null,null,null,null,null,null,null,null,null,null,null,null,null,null,null,null,null,null,null,null,null,null,null,null,null,null,null,null,null,null,null,null,null,0]
[null,null,null,null,null,null,null,null,null,null,null,null,null,null,null,null,null,null,null,null,null,null,null,null,null,null,null,null,null,null,null,null,null,null,null,null,null,null,null,null,null,null,null,null,null,null,null,null,null,null,null,null,null,null,null,null,null,null,null,null,null,null,null,null,0]
[null,null,null,null,null,null,null,null,null,null,null,null,null,null,null,null,null,null,null,null,null,null,null,null,null,null,null,null,null,null,null,null,null,null,null,null,null,null,null,null,null,null,null,null,null,null,null,null,null,null,null,null,null,null,null,null,null,null,null,null,null,null,null,null,0]
[null,null,null,null,null,null,null,null,null,null,null,null,null,null,null,null,null,null,null,null,null,null,null,null,null,null,null,null,null,null,null,null,null,null,null,null,null,null,null,null,null,null,null,null,null,null,null,null,null,null,null,null,null,null,null,null,null,null,null,null,null,null,null,null,0]
[null,null,null,null,null,null,null,null,null,null,null,null,null,null,null,null,null,null,null,null,null,null,null,null,null,null,null,null,null,null,null,null,null,null,null,null,null,null,null,null,null,null,null,null,null,null,null,null,null,null,null,null,null,null,null,null,null,null,null,null,null,null,null,null,0]
[null,null,null,null,null,null,null,null,null,null,null,null,null,null,null,null,null,null,null,null,null,null,null,null,null,null,null,null,null,null,null,null,null,null,null,null,null,null,null,null,null,null,null,null,null,null,null,null,null,null,null,null,null,null,null,null,null,null,null,null,null,null,null,null,0]
[null,null,null,null,null,null,null,null,null,null,null,null,null,null,null,null,null,null,null,null,null,null,null,null,null,null,null,null,null,null,null,null,null,null,null,null,null,null,null,null,null,null,null,null,null,null,null,null,null,null,null,null,null,null,null,null,null,null,null,null,null,null,null,null,0]
[null,null,null,null,null,null,null,null,null,null,null,null,null,null,null,null,null,null,null,null,null,null,null,null,null,null,null,null,null,null,null,null,null,null,null,null,null,null,null,null,null,null,null,null,null,null,null,null,null,null,null,null,null,null,null,null,null,null,null,null,null,null,null,null,0]
[null,null,null,null,null,null,null,null,null,null,null,null,null,null,null,null,null,null,null,null,null,null,null,null,null,null,null,null,null,null,null,null,null,null,null,null,null,null,null,null,null,null,null,null,null,null,null,null,null,null,null,null,null,null,null,null,null,null,null,null,null,null,null,null,0]
[null,null,null,null,null,null,null,null,null,null,null,null,null,null,null,null,null,null,null,null,null,null,null,null,null,null,null,null,null,null,null,null,null,null,null,null,null,null,null,null,null,null,null,null,null,null,null,null,null,null,null,null,null,null,null,null,null,null,null,null,null,null,null,null,0]
[null,null,null,null,null,null,null,null,null,null,null,null,null,null,null,null,null,null,null,null,null,null,null,null,null,null,null,null,null,null,null,null,null,null,null,null,null,null,null,null,null,null,null,null,null,null,null,null,null,null,null,null,null,null,null,null,null,null,null,null,null,null,null,null,0]
[null,null,null,null,null,null,null,null,null,null,null,null,null,null,null,null,null,null,null,null,null,null,null,null,null,null,null,null,null,null,null,null,null,null,null,null,null,null,null,null,null,null,null,null,null,null,null,null,null,null,null,null,null,null,null,null,null,null,null,null,null,null,null,null,0]
[null,null,null,null,null,null,null,null,null,null,null,null,null,null,null,null,null,null,null,null,null,null,null,null,null,null,null,null,null,null,null,null,null,null,null,null,null,null,null,null,null,null,null,null,null,null,null,null,null,null,null,null,null,null,null,null,null,null,null,null,null,null,null,null,0]
[null,null,null,null,null,null,null,null,null,null,null,null,null,null,null,null,null,null,null,null,null,null,null,null,null,null,null,null,null,null,null,null,null,null,null,null,null,null,null,null,null,null,null,null,null,null,null,null,null,null,null,null,null,null,null,null,null,null,null,null,null,null,null,null,0]
[null,null,null,null,null,null,null,null,null,null,null,null,null,null,null,null,null,null,null,null,null,null,null,null,null,null,null,null,null,null,null,null,null,null,null,null,null,null,null,null,null,null,null,null,null,null,null,null,null,null,null,null,null,null,null,null,null,null,null,null,null,null,null,null,0]
[null,null,null,null,null,null,null,null,null,null,null,null,null,null,null,null,null,null,null,null,null,null,null,null,null,null,null,null,null,null,null,null,null,null,null,null,null,null,null,null,null,null,null,null,null,null,null,null,null,null,null,null,null,null,null,null,null,null,null,null,null,null,null,null,0]
[null,null,null,null,null,null,null,null,null,null,null,null,null,null,null,null,null,null,null,null,null,null,null,null,null,null,null,null,null,null,null,null,null,null,null,null,null,null,null,null,null,null,null,null,null,null,null,null,null,null,null,null,null,null,null,null,null,null,null,null,null,null,null,null,0]
[null,null,null,null,null,null,null,null,null,null,null,null,null,null,null,null,null,null,null,null,null,null,null,null,null,null,null,null,null,null,null,null,null,null,null,null,null,null,null,null,null,null,null,null,null,null,null,null,null,null,null,null,null,null,null,null,null,null,null,null,null,null,null,null,{"$f":"COUNTA(C72:BL72)/2","v":0}]
[null,null,null,null,null,null,null,null,null,null,null,null,null,null,null,null,null,null,null,null,null,null,null,null,null,null,null,null,null,null,null,null,null,null,null,null,null,null,null,null,null,null,null,null,null,null,null,null,null,null,null,null,null,null,null,null,null,null,null,null,null,null,null,null,0]
[null,null,null,null,null,null,null,null,null,null,null,null,null,null,null,null,null,null,null,null,null,null,null,null,null,null,null,null,null,null,null,null,null,null,null,null,null,null,null,null,null,null,null,null,null,null,null,null,null,null,null,null,null,null,null,null,null,null,null,null,null,null,null,null,0]
[null,null,null,null,null,null,null,null,null,null,null,null,null,null,null,null,null,null,null,null,null,null,null,null,null,null,null,null,null,null,null,null,null,null,null,null,null,null,null,null,null,null,null,null,null,null,null,null,null,null,null,null,null,null,null,null,null,null,null,null,null,null,null,null,0]
[null,null,null,null,null,null,null,null,null,null,null,null,null,null,null,null,null,null,null,null,null,null,null,null,null,null,null,null,null,null,null,null,null,null,null,null,null,null,null,null,null,null,null,null,null,null,null,null,null,null,null,null,null,null,null,null,null,null,null,null,null,null,null,null,0]
[null,null,null,null,null,null,null,null,null,null,null,null,null,null,null,null,null,null,null,null,null,null,null,null,null,null,null,null,null,null,null,null,null,null,null,null,null,null,null,null,null,null,null,null,null,null,null,null,null,null,null,null,null,null,null,null,null,null,null,null,null,null,null,null,0]
[null,null,null,null,null,null,null,null,null,null,null,null,null,null,null,null,null,null,null,null,null,null,null,null,null,null,null,null,null,null,null,null,null,null,null,null,null,null,null,null,null,null,null,null,null,null,null,null,null,null,null,null,null,null,null,null,null,null,null,null,null,null,null,null,0]
[null,null,null,null,null,null,null,null,null,null,null,null,null,null,null,null,null,null,null,null,null,null,null,null,null,null,null,null,null,null,null,null,null,null,null,null,null,null,null,null,null,null,null,null,null,null,null,null,null,null,null,null,null,null,null,null,null,null,null,null,null,null,null,null,0]
[null,null,null,null,null,null,null,null,null,null,null,null,null,null,null,null,null,null,null,null,null,null,null,null,null,null,null,null,null,null,null,null,null,null,null,null,null,null,null,null,null,null,null,null,null,null,null,null,null,null,null,null,null,null,null,null,null,null,null,null,null,null,null,null,0]
[null,null,null,null,null,null,null,null,null,null,null,null,null,null,null,null,null,null,null,null,null,null,null,null,null,null,null,null,null,null,null,null,null,null,null,null,null,null,null,null,null,null,null,null,null,null,null,null,null,null,null,null,null,null,null,null,null,null,null,null,null,null,null,null,0]
[null,null,null,null,null,null,null,null,null,null,null,null,null,null,null,null,null,null,null,null,null,null,null,null,null,null,null,null,null,null,null,null,null,null,null,null,null,null,null,null,null,null,null,null,null,null,null,null,null,null,null,null,null,null,null,null,null,null,null,null,null,null,null,null,0]
[null,null,null,null,null,null,null,null,null,null,null,null,null,null,null,null,null,null,null,null,null,null,null,null,null,null,null,null,null,null,null,null,null,null,null,null,null,null,null,null,null,null,null,null,null,null,null,null,null,null,null,null,null,null,null,null,null,null,null,null,null,null,null,null,0]
[null,null,null,null,null,null,null,null,null,null,null,null,null,null,null,null,null,null,null,null,null,null,null,null,null,null,null,null,null,null,null,null,null,null,null,null,null,null,null,null,null,null,null,null,null,null,null,null,null,null,null,null,null,null,null,null,null,null,null,null,null,null,null,null,0]
[null,null,null,null,null,null,null,null,null,null,null,null,null,null,null,null,null,null,null,null,null,null,null,null,null,null,null,null,null,null,null,null,null,null,null,null,null,null,null,null,null,null,null,null,null,null,null,null,null,null,null,null,null,null,null,null,null,null,null,null,null,null,null,null,0]
[null,null,null,null,null,null,null,null,null,null,null,null,null,null,null,null,null,null,null,null,null,null,null,null,null,null,null,null,null,null,null,null,null,null,null,null,null,null,null,null,null,null,null,null,null,null,null,null,null,null,null,null,null,null,null,null,null,null,null,null,null,null,null,null,0]
[null,null,null,null,null,null,null,null,null,null,null,null,null,null,null,null,null,null,null,null,null,null,null,null,null,null,null,null,null,null,null,null,null,null,null,null,null,null,null,null,null,null,null,null,null,null,null,null,null,null,null,null,null,null,null,null,null,null,null,null,null,null,null,null,0]
[null,null,null,null,null,null,null,null,null,null,null,null,null,null,null,null,null,null,null,null,null,null,null,null,null,null,null,null,null,null,null,null,null,null,null,null,null,null,null,null,null,null,null,null,null,null,null,null,null,null,null,null,null,null,null,null,null,null,null,null,null,null,null,null,0]
[null,null,null,null,null,null,null,null,null,null,null,null,null,null,null,null,null,null,null,null,null,null,null,null,null,null,null,null,null,null,null,null,null,null,null,null,null,null,null,null,null,null,null,null,null,null,null,null,null,null,null,null,null,null,null,null,null,null,null,null,null,null,null,null,0]
[null,null,null,null,null,null,null,null,null,null,null,null,null,null,null,null,null,null,null,null,null,null,null,null,null,null,null,null,null,null,null,null,null,null,null,null,null,null,null,null,null,null,null,null,null,null,null,null,null,null,null,null,null,null,null,null,null,null,null,null,null,null,null,null,0]
[null,null,null,null,null,null,null,null,null,null,null,null,null,null,null,null,null,null,null,null,null,null,null,null,null,null,null,null,null,null,null,null,null,null,null,null,null,null,null,null,null,null,null,null,null,null,null,null,null,null,null,null,null,null,null,null,null,null,null,null,null,null,null,null,0]
[null,null,null,null,null,null,null,null,null,null,null,null,null,null,null,null,null,null,null,null,null,null,null,null,null,null,null,null,null,null,null,null,null,null,null,null,null,null,null,null,null,null,null,null,null,null,null,null,null,null,null,null,null,null,null,null,null,null,null,null,null,null,null,null,0]
[null,null,null,null,null,null,null,null,null,null,null,null,null,null,null,null,null,null,null,null,null,null,null,null,null,null,null,null,null,null,null,null,null,null,null,null,null,null,null,null,null,null,null,null,null,null,null,null,null,null,null,null,null,null,null,null,null,null,null,null,null,null,null,null,0]
[null,null,null,null,null,null,null,null,null,null,null,null,null,null,null,null,null,null,null,null,null,null,null,null,null,null,null,null,null,null,null,null,null,null,null,null,null,null,null,null,null,null,null,null,null,null,null,null,null,null,null,null,null,null,null,null,null,null,null,null,null,null,null,null,0]
[null,null,null,null,null,null,null,null,null,null,null,null,null,null,null,null,null,null,null,null,null,null,null,null,null,null,null,null,null,null,null,null,null,null,null,null,null,null,null,null,null,null,null,null,null,null,null,null,null,null,null,null,null,null,null,null,null,null,null,null,null,null,null,null,0]
[null,null,null,null,null,null,null,null,null,null,null,null,null,null,null,null,null,null,null,null,null,null,null,null,null,null,null,null,null,null,null,null,null,null,null,null,null,null,null,null,null,null,null,null,null,null,null,null,null,null,null,null,null,null,null,null,null,null,null,null,null,null,null,null,0]
[null,null,null,null,null,null,null,null,null,null,null,null,null,null,null,null,null,null,null,null,null,null,null,null,null,null,null,null,null,null,null,null,null,null,null,null,null,null,null,null,null,null,null,null,null,null,null,null,null,null,null,null,null,null,null,null,null,null,null,null,null,null,null,null,0]
[null,null,null,null,null,null,null,null,null,null,null,null,null,null,null,null,null,null,null,null,null,null,null,null,null,null,null,null,null,null,null,null,null,null,null,null,null,null,null,null,null,null,null,null,null,null,null,null,null,null,null,null,null,null,null,null,null,null,null,null,null,null,null,null,0]
[null,null,null,null,null,null,null,null,null,null,null,null,null,null,null,null,null,null,null,null,null,null,null,null,null,null,null,null,null,null,null,null,null,null,null,null,null,null,null,null,null,null,null,null,null,null,null,null,null,null,null,null,null,null,null,null,null,null,null,null,null,null,null,null,0]
[null,null,null,null,null,null,null,null,null,null,null,null,null,null,null,null,null,null,null,null,null,null,null,null,null,null,null,null,null,null,null,null,null,null,null,null,null,null,null,null,null,null,null,null,null,null,null,null,null,null,null,null,null,null,null,null,null,null,null,null,null,null,null,null,0]

{"sheet":"Juillet","index":8,"n_rows":100,"n_cols":65,"rows_kept":100,"cut":false,"hidden":false,"merged":[[17,0,17,1],[18,0,18,1],[19,0,19,1],[20,0,20,1],[13,0,13,1],[8,0,8,1],[9,0,9,1],[12,0,12,1],[10,0,10,1],[11,0,11,1],[14,0,14,1],[15,0,15,1],[16,0,16,1],[7,0,7,1],[4,44,4,45],[4,32,4,33],[4,34,4,35],[4,36,4,37],[4,38,4,39],[4,40,4,41],[4,42,4,43],[4,20,4,21],[4,14,4,15],[4,16,4,17],[4,18,4,19],[4,2,4,3],[4,4,4,5],[4,6,4,7],[4,8,4,9],[4,62,4,63],[6,0,6,1],[4,52,4,53],[4,54,4,55],[4,30,4,31],[4,58,4,59],[4,60,4,61],[4,22,4,23],[4,24,4,25],[4,26,4,27],[4,28,4,29],[4,56,4,57],[4,46,4,47],[4,48,4,49],[4,50,4,51],[4,12,4,13],[4,10,4,11],[1,42,1,46],[3,32,3,33],[3,34,3,35],[3,36,3,37],[3,50,3,51],[3,48,3,49],[3,26,3,27],[3,28,3,29],[3,22,3,23],[3,24,3,25],[3,38,3,39],[3,40,3,41],[3,42,3,43],[3,44,3,45],[3,46,3,47],[3,30,3,31],[1,47,1,49],[1,55,1,59],[1,60,1,62],[3,2,3,3],[3,4,3,5],[3,6,3,7],[3,8,3,9],[3,10,3,11],[3,12,3,13],[1,3,1,7],[1,8,1,10],[1,16,1,20],[1,21,1,23],[1,29,1,33],[1,34,1,36],[3,14,3,15],[3,62,3,63],[3,52,3,53],[3,54,3,55],[3,56,3,57],[3,58,3,59],[3,60,3,61],[3,16,3,17],[3,18,3,19],[3,20,3,21],[26,0,26,1],[27,0,27,1],[28,0,28,1],[29,0,29,1],[30,0,30,1],[21,0,21,1],[22,0,22,1],[23,0,23,1],[24,0,24,1],[25,0,25,1],[36,0,36,1],[37,0,37,1],[38,0,38,1],[39,0,39,1],[40,0,40,1],[31,0,31,1],[32,0,32,1],[33,0,33,1],[34,0,34,1],[35,0,35,1],[46,0,46,1],[47,0,47,1],[48,0,48,1],[49,0,49,1],[50,0,50,1],[41,0,41,1],[42,0,42,1],[43,0,43,1],[44,0,44,1],[45,0,45,1],[56,0,56,1],[57,0,57,1],[58,0,58,1],[59,0,59,1],[60,0,60,1],[51,0,51,1],[52,0,52,1],[53,0,53,1],[54,0,54,1],[55,0,55,1],[66,0,66,1],[67,0,67,1],[68,0,68,1],[69,0,69,1],[70,0,70,1],[61,0,61,1],[62,0,62,1],[63,0,63,1],[64,0,64,1],[65,0,65,1],[76,0,76,1],[77,0,77,1],[78,0,78,1],[79,0,79,1],[80,0,80,1],[71,0,71,1],[72,0,72,1],[73,0,73,1],[74,0,74,1],[75,0,75,1],[86,0,86,1],[87,0,87,1],[88,0,88,1],[89,0,89,1],[90,0,90,1],[81,0,81,1],[82,0,82,1],[83,0,83,1],[84,0,84,1],[85,0,85,1],[96,0,96,1],[97,0,97,1],[98,0,98,1],[99,0,99,1],[91,0,91,1],[92,0,92,1],[93,0,93,1],[94,0,94,1],[95,0,95,1]]}
[31,{"$f":"C5","v":"2014-07-01"}]
[null,null,null,{"$f":"IF(An!$Q$4=\"\",\"\",An!$Q$4)","v":""},null,null,null,null,{"$f":"C5","v":"2014-07-01"},null,null,null,null,"ACCEUIL",null,null,{"$f":"IF(An!$Q$4=\"\",\"\",An!$Q$4)","v":""},null,null,null,null,{"$f":"C5","v":"2014-07-01"},null,null,null,null,"ACCEUIL",null,null,{"$f":"IF(An!$Q$4=\"\",\"\",An!$Q$4)","v":""},null,null,null,null,{"$f":"C5","v":"2014-07-01"},null,null,null,null,"ACCEUIL",null,null,{"$f":"IF(An!$Q$4=\"\",\"\",An!$Q$4)","v":""},null,null,null,null,{"$f":"C5","v":"2014-07-01"},null,null,null,null,"ACCEUIL",null,null,{"$f":"IF(An!$Q$4=\"\",\"\",An!$Q$4)","v":""},null,null,null,null,{"$f":"C5","v":"2014-07-01"},null,null,"ACCEUIL"]
[]
[null,null,{"$f":"IF(C5=\"\",\"\",IF(LOOKUP(C5,Fériés)=C5,\"\",CHOOSE(WEEKDAY(C5,1),\"Dimanche\",\"Lundi\",\"Mardi\",\"Mercredi\",\"Jeudi\",\"Vendredi\",\"Samedi\")))","v":"Mardi"},null,"Mercredi",null,"Jeudi",null,"Vendredi",null,"Samedi",null,"Dimanche",null,"Lundi",null,"Mardi",null,{"$f":"IF(S5=\"\",\"\",IF(LOOKUP(S5,Fériés)=S5,\"\",CHOOSE(WEEKDAY(S5,1),\"Dimanche\",\"Lundi\",\"Mardi\",\"Mercredi\",\"Jeudi\",\"Vendredi\",\"Samedi\")))","v":"Mercredi"},null,"Jeudi",null,"Vendredi",null,"Samedi",null,"Dimanche",null,{"$f":"IF(AC5=\"\",\"\",IF(LOOKUP(AC5,Fériés)=AC5,CHOOSE(WEEKDAY(AC5,1),\"Dimanche\",\"Lundi\",\"Mardi\",\"Mercredi\",\"Jeudi\",\"Vendredi\",\"Samedi\",\"\")))","v":"Lundi"},null,"Mardi",null,{"$f":"IF(AG5=\"\",\"\",IF(LOOKUP(AG5,Fériés)=AG5,\"\",CHOOSE(WEEKDAY(AG5,1),\"Dimanche\",\"Lundi\",\"Mardi\",\"Mercredi\",\"Jeudi\",\"Vendredi\",\"Samedi\")))","v":"Mercredi"},null,{"$f":"IF(AI5=\"\",\"\",IF(LOOKUP(AI5,Fériés)=AI5,\"\",CHOOSE(WEEKDAY(AI5,1),\"Dimanche\",\"Lundi\",\"Mardi\",\"Mercredi\",\"Jeudi\",\"Vendredi\",\"Samedi\")))","v":"Jeudi"},null,"Vendredi",null,"Samedi",null,"Dimanche",null,"Lundi",null,"Mardi",null,"Mercredi",null,{"$f":"IF(AW5=\"\",\"\",IF(LOOKUP(AW5,Fériés)=AW5,\"\",CHOOSE(WEEKDAY(AW5,1),\"Dimanche\",\"Lundi\",\"Mardi\",\"Mercredi\",\"Jeudi\",\"Vendredi\",\"Samedi\")))","v":"Jeudi"},null,{"$f":"IF(AY5=\"\",\"\",IF(LOOKUP(AY5,Fériés)=AY5,\"\",CHOOSE(WEEKDAY(AY5,1),\"Dimanche\",\"Lundi\",\"Mardi\",\"Mercredi\",\"Jeudi\",\"Vendredi\",\"Samedi\")))","v":"Vendredi"},null,"Samedi",null,"Dimanche",null,"Lundi",null,"Mardi",null,"Mercredi",null,"Jeudi"]
[null,null,{"$f":"DATE(Année,7,1)","v":"2014-07-01"},null,{"$f":"IF(C5=\"\",\"\",IF(MONTH(C5+1)<>MONTH(C5),\"\",C5+1))","v":"2014-07-02"},null,{"$f":"IF(E5=\"\",\"\",IF(MONTH(E5+1)<>MONTH(E5),\"\",E5+1))","v":"2014-07-03"},null,{"$f":"IF(G5=\"\",\"\",IF(MONTH(G5+1)<>MONTH(G5),\"\",G5+1))","v":"2014-07-04"},null,{"$f":"IF(I5=\"\",\"\",IF(MONTH(I5+1)<>MONTH(I5),\"\",I5+1))","v":"2014-07-05"},null,{"$f":"IF(K5=\"\",\"\",IF(MONTH(K5+1)<>MONTH(K5),\"\",K5+1))","v":"2014-07-06"},null,{"$f":"IF(M5=\"\",\"\",IF(MONTH(M5+1)<>MONTH(M5),\"\",M5+1))","v":"2014-07-07"},null,{"$f":"IF(O5=\"\",\"\",IF(MONTH(O5+1)<>MONTH(O5),\"\",O5+1))","v":"2014-07-08"},null,{"$f":"IF(Q5=\"\",\"\",IF(MONTH(Q5+1)<>MONTH(Q5),\"\",Q5+1))","v":"2014-07-09"},null,{"$f":"IF(S5=\"\",\"\",IF(MONTH(S5+1)<>MONTH(S5),\"\",S5+1))","v":"2014-07-10"},null,{"$f":"IF(U5=\"\",\"\",IF(MONTH(U5+1)<>MONTH(U5),\"\",U5+1))","v":"2014-07-11"},null,{"$f":"IF(W5=\"\",\"\",IF(MONTH(W5+1)<>MONTH(W5),\"\",W5+1))","v":"2014-07-12"},null,{"$f":"IF(Y5=\"\",\"\",IF(MONTH(Y5+1)<>MONTH(Y5),\"\",Y5+1))","v":"2014-07-13"},null,{"$f":"IF(AA5=\"\",\"\",IF(MONTH(AA5+1)<>MONTH(AA5),\"\",AA5+1))","v":"2014-07-14"},null,{"$f":"IF(AC5=\"\",\"\",IF(MONTH(AC5+1)<>MONTH(AC5),\"\",AC5+1))","v":"2014-07-15"},null,{"$f":"IF(AE5=\"\",\"\",IF(MONTH(AE5+1)<>MONTH(AE5),\"\",AE5+1))","v":"2014-07-16"},null,{"$f":"IF(AG5=\"\",\"\",IF(MONTH(AG5+1)<>MONTH(AG5),\"\",AG5+1))","v":"2014-07-17"},null,{"$f":"IF(AI5=\"\",\"\",IF(MONTH(AI5+1)<>MONTH(AI5),\"\",AI5+1))","v":"2014-07-18"},null,{"$f":"IF(AK5=\"\",\"\",IF(MONTH(AK5+1)<>MONTH(AK5),\"\",AK5+1))","v":"2014-07-19"},null,{"$f":"IF(AM5=\"\",\"\",IF(MONTH(AM5+1)<>MONTH(AM5),\"\",AM5+1))","v":"2014-07-20"},null,{"$f":"IF(AO5=\"\",\"\",IF(MONTH(AO5+1)<>MONTH(AO5),\"\",AO5+1))","v":"2014-07-21"},null,{"$f":"IF(AQ5=\"\",\"\",IF(MONTH(AQ5+1)<>MONTH(AQ5),\"\",AQ5+1))","v":"2014-07-22"},null,{"$f":"IF(AS5=\"\",\"\",IF(MONTH(AS5+1)<>MONTH(AS5),\"\",AS5+1))","v":"2014-07-23"},null,{"$f":"IF(AU5=\"\",\"\",IF(MONTH(AU5+1)<>MONTH(AU5),\"\",AU5+1))","v":"2014-07-24"},null,{"$f":"IF(AW5=\"\",\"\",IF(MONTH(AW5+1)<>MONTH(AW5),\"\",AW5+1))","v":"2014-07-25"},null,{"$f":"IF(AY5=\"\",\"\",IF(MONTH(AY5+1)<>MONTH(AY5),\"\",AY5+1))","v":"2014-07-26"},null,{"$f":"IF(BA5=\"\",\"\",IF(MONTH(BA5+1)<>MONTH(BA5),\"\",BA5+1))","v":"2014-07-27"},null,{"$f":"IF(BC5=\"\",\"\",IF(MONTH(BC5+1)<>MONTH(BC5),\"\",BC5+1))","v":"2014-07-28"},null,{"$f":"IF(BE5=\"\",\"\",IF(MONTH(BE5+1)<>MONTH(BE5),\"\",BE5+1))","v":"2014-07-29"},null,{"$f":"IF(BG5=\"\",\"\",IF(MONTH(BG5+1)<>MONTH(BG5),\"\",BG5+1))","v":"2014-07-30"},null,{"$f":"IF(BI5=\"\",\"\",IF(MONTH(BI5+1)<>MONTH(BI5),\"\",BI5+1))","v":"2014-07-31"}]
[null,null,"Matin","Après midi","Matin","Après midi","Matin","Après midi","Matin","Après midi","Matin","Après midi","Matin","Après midi","Matin","Après midi","Matin","Après midi","Matin","Après midi","Matin","Après midi","Matin","Après midi","Matin","Après midi","Matin","Après midi","Matin","Après midi","Matin","Après midi","Matin","Après midi","Matin","Après midi","Matin","Après midi","Matin","Après midi","Matin","Après midi","Matin","Après midi","Matin","Après midi","Matin","Après midi","Matin","Après midi","Matin","Après midi","Matin","Après midi","Matin","Après midi","Matin","Après midi",{"$f":"IF(BG5=\"\",\"\",\"Matin\")","v":"Matin"},{"$f":"IF(BG5=\"\",\"\",\"Apres midi\")","v":"Apres midi"},{"$f":"IF(BI5=\"\",\"\",\"Matin\")","v":"Matin"},{"$f":"IF(BI5=\"\",\"\",\"Apres midi\")","v":"Apres midi"},{"$f":"IF(BK5=\"\",\"\",\"Matin\")","v":"Matin"},{"$f":"IF(BK5=\"\",\"\",\"Apres midi\")","v":"Apres midi"}]
[null,null,null,null,null,null,null,null,null,null,null,null,null,null,null,null,null,null,null,null,null,null,null,null,null,null,null,null,null,null,null,null,null,null,null,null,null,null,null,null,null,null,null,null,null,null,null,null,null,null,null,null,null,null,null,null,null,null,null,null,null,null,null,null,{"$f":"COUNTA(C7:BL7)/2","v":0}]
[null,null,null,null,null,null,null,null,null,null,null,null,null,null,null,null,null,null,null,null,null,null,null,null,null,null,null,null,null,null,null,null,null,null,null,null,null,null,null,null,null,null,null,null,null,null,null,null,null,null,null,null,null,null,null,null,null,null,null,null,null,null,null,null,{"$f":"COUNTA(C8:BL8)/2","v":0}]
[null,null,null,null,null,null,null,null,null,null,null,null,null,null,null,null,null,null,null,null,null,null,null,null,null,null,null,null,null,null,null,null,null,null,null,null,null,null,null,null,null,null,null,null,null,null,null,null,null,null,null,null,null,null,null,null,null,null,null,null,null,null,null,null,0]
[null,null,null,null,null,null,null,null,null,null,null,null,null,null,null,null,null,null,null,null,null,null,null,null,null,null,null,null,null,null,null,null,null,null,null,null,null,null,null,null,null,null,null,null,null,null,null,null,null,null,null,null,null,null,null,null,null,null,null,null,null,null,null,null,0]
[null,null,null,null,null,null,null,null,null,null,null,null,null,null,null,null,null,null,null,null,null,null,null,null,null,null,null,null,null,null,null,null,null,null,null,null,null,null,null,null,null,null,null,null,null,null,null,null,null,null,null,null,null,null,null,null,null,null,null,null,null,null,null,null,0]
[null,null,null,null,null,null,null,null,null,null,null,null,null,null,null,null,null,null,null,null,null,null,null,null,null,null,null,null,null,null,null,null,null,null,null,null,null,null,null,null,null,null,null,null,null,null,null,null,null,null,null,null,null,null,null,null,null,null,null,null,null,null,null,null,0]
[null,null,null,null,null,null,null,null,null,null,null,null,null,null,null,null,null,null,null,null,null,null,null,null,null,null,null,null,null,null,null,null,null,null,null,null,null,null,null,null,null,null,null,null,null,null,null,null,null,null,null,null,null,null,null,null,null,null,null,null,null,null,null,null,0]
[null,null,null,null,null,null,null,null,null,null,null,null,null,null,null,null,null,null,null,null,null,null,null,null,null,null,null,null,null,null,null,null,null,null,null,null,null,null,null,null,null,null,null,null,null,null,null,null,null,null,null,null,null,null,null,null,null,null,null,null,null,null,null,null,0]
[null,null,null,null,null,null,null,null,null,null,null,null,null,null,null,null,null,null,null,null,null,null,null,null,null,null,null,null,null,null,null,null,null,null,null,null,null,null,null,null,null,null,null,null,null,null,null,null,null,null,null,null,null,null,null,null,null,null,null,null,null,null,null,null,0]
[null,null,null,null,null,null,null,null,null,null,null,null,null,null,null,null,null,null,null,null,null,null,null,null,null,null,null,null,null,null,null,null,null,null,null,null,null,null,null,null,null,null,null,null,null,null,null,null,null,null,null,null,null,null,null,null,null,null,null,null,null,null,null,null,0]
[null,null,null,null,null,null,null,null,null,null,null,null,null,null,null,null,null,null,null,null,null,null,null,null,null,null,null,null,null,null,null,null,null,null,null,null,null,null,null,null,null,null,null,null,null,null,null,null,null,null,null,null,null,null,null,null,null,null,null,null,null,null,null,null,0]
[null,null,null,null,null,null,null,null,null,null,null,null,null,null,null,null,null,null,null,null,null,null,null,null,null,null,null,null,null,null,null,null,null,null,null,null,null,null,null,null,null,null,null,null,null,null,null,null,null,null,null,null,null,null,null,null,null,null,null,null,null,null,null,null,0]
[null,null,null,null,null,null,null,null,null,null,null,null,null,null,null,null,null,null,null,null,null,null,null,null,null,null,null,null,null,null,null,null,null,null,null,null,null,null,null,null,null,null,null,null,null,null,null,null,null,null,null,null,null,null,null,null,null,null,null,null,null,null,null,null,0]
[null,null,null,null,null,null,null,null,null,null,null,null,null,null,null,null,null,null,null,null,null,null,null,null,null,null,null,null,null,null,null,null,null,null,null,null,null,null,null,null,null,null,null,null,null,null,null,null,null,null,null,null,null,null,null,null,null,null,null,null,null,null,null,null,0]
[null,null,null,null,null,null,null,null,null,null,null,null,null,null,null,null,null,null,null,null,null,null,null,null,null,null,null,null,null,null,null,null,null,null,null,null,null,null,null,null,null,null,null,null,null,null,null,null,null,null,null,null,null,null,null,null,null,null,null,null,null,null,null,null,0]
[null,null,null,null,null,null,null,null,null,null,null,null,null,null,null,null,null,null,null,null,null,null,null,null,null,null,null,null,null,null,null,null,null,null,null,null,null,null,null,null,null,null,null,null,null,null,null,null,null,null,null,null,null,null,null,null,null,null,null,null,null,null,null,null,0]
[null,null,null,null,null,null,null,null,null,null,null,null,null,null,null,null,null,null,null,null,null,null,null,null,null,null,null,null,null,null,null,null,null,null,null,null,null,null,null,null,null,null,null,null,null,null,null,null,null,null,null,null,null,null,null,null,null,null,null,null,null,null,null,null,0]
[null,null,null,null,null,null,null,null,null,null,null,null,null,null,null,null,null,null,null,null,null,null,null,null,null,null,null,null,null,null,null,null,null,null,null,null,null,null,null,null,null,null,null,null,null,null,null,null,null,null,null,null,null,null,null,null,null,null,null,null,null,null,null,null,0]
[null,null,null,null,null,null,null,null,null,null,null,null,null,null,null,null,null,null,null,null,null,null,null,null,null,null,null,null,null,null,null,null,null,null,null,null,null,null,null,null,null,null,null,null,null,null,null,null,null,null,null,null,null,null,null,null,null,null,null,null,null,null,null,null,0]
[null,null,null,null,null,null,null,null,null,null,null,null,null,null,null,null,null,null,null,null,null,null,null,null,null,null,null,null,null,null,null,null,null,null,null,null,null,null,null,null,null,null,null,null,null,null,null,null,null,null,null,null,null,null,null,null,null,null,null,null,null,null,null,null,0]
[null,null,null,null,null,null,null,null,null,null,null,null,null,null,null,null,null,null,null,null,null,null,null,null,null,null,null,null,null,null,null,null,null,null,null,null,null,null,null,null,null,null,null,null,null,null,null,null,null,null,null,null,null,null,null,null,null,null,null,null,null,null,null,null,0]
[null,null,null,null,null,null,null,null,null,null,null,null,null,null,null,null,null,null,null,null,null,null,null,null,null,null,null,null,null,null,null,null,null,null,null,null,null,null,null,null,null,null,null,null,null,null,null,null,null,null,null,null,null,null,null,null,null,null,null,null,null,null,null,null,0]
[null,null,null,null,null,null,null,null,null,null,null,null,null,null,null,null,null,null,null,null,null,null,null,null,null,null,null,null,null,null,null,null,null,null,null,null,null,null,null,null,null,null,null,null,null,null,null,null,null,null,null,null,null,null,null,null,null,null,null,null,null,null,null,null,0]
[null,null,null,null,null,null,null,null,null,null,null,null,null,null,null,null,null,null,null,null,null,null,null,null,null,null,null,null,null,null,null,null,null,null,null,null,null,null,null,null,null,null,null,null,null,null,null,null,null,null,null,null,null,null,null,null,null,null,null,null,null,null,null,null,0]
[null,null,null,null,null,null,null,null,null,null,null,null,null,null,null,null,null,null,null,null,null,null,null,null,null,null,null,null,null,null,null,null,null,null,null,null,null,null,null,null,null,null,null,null,null,null,null,null,null,null,null,null,null,null,null,null,null,null,null,null,null,null,null,null,0]
[null,null,null,null,null,null,null,null,null,null,null,null,null,null,null,null,null,null,null,null,null,null,null,null,null,null,null,null,null,null,null,null,null,null,null,null,null,null,null,null,null,null,null,null,null,null,null,null,null,null,null,null,null,null,null,null,null,null,null,null,null,null,null,null,0]
[null,null,null,null,null,null,null,null,null,null,null,null,null,null,null,null,null,null,null,null,null,null,null,null,null,null,null,null,null,null,null,null,null,null,null,null,null,null,null,null,null,null,null,null,null,null,null,null,null,null,null,null,null,null,null,null,null,null,null,null,null,null,null,null,0]
[null,null,null,null,null,null,null,null,null,null,null,null,null,null,null,null,null,null,null,null,null,null,null,null,null,null,null,null,null,null,null,null,null,null,null,null,null,null,null,null,null,null,null,null,null,null,null,null,null,null,null,null,null,null,null,null,null,null,null,null,null,null,null,null,0]
[null,null,null,null,null,null,null,null,null,null,null,null,null,null,null,null,null,null,null,null,null,null,null,null,null,null,null,null,null,null,null,null,null,null,null,null,null,null,null,null,null,null,null,null,null,null,null,null,null,null,null,null,null,null,null,null,null,null,null,null,null,null,null,null,0]
[null,null,null,null,null,null,null,null,null,null,null,null,null,null,null,null,null,null,null,null,null,null,null,null,null,null,null,null,null,null,null,null,null,null,null,null,null,null,null,null,null,null,null,null,null,null,null,null,null,null,null,null,null,null,null,null,null,null,null,null,null,null,null,null,0]
[null,null,null,null,null,null,null,null,null,null,null,null,null,null,null,null,null,null,null,null,null,null,null,null,null,null,null,null,null,null,null,null,null,null,null,null,null,null,null,null,null,null,null,null,null,null,null,null,null,null,null,null,null,null,null,null,null,null,null,null,null,null,null,null,0]
[null,null,null,null,null,null,null,null,null,null,null,null,null,null,null,null,null,null,null,null,null,null,null,null,null,null,null,null,null,null,null,null,null,null,null,null,null,null,null,null,null,null,null,null,null,null,null,null,null,null,null,null,null,null,null,null,null,null,null,null,null,null,null,null,0]
[null,null,null,null,null,null,null,null,null,null,null,null,null,null,null,null,null,null,null,null,null,null,null,null,null,null,null,null,null,null,null,null,null,null,null,null,null,null,null,null,null,null,null,null,null,null,null,null,null,null,null,null,null,null,null,null,null,null,null,null,null,null,null,null,0]
[null,null,null,null,null,null,null,null,null,null,null,null,null,null,null,null,null,null,null,null,null,null,null,null,null,null,null,null,null,null,null,null,null,null,null,null,null,null,null,null,null,null,null,null,null,null,null,null,null,null,null,null,null,null,null,null,null,null,null,null,null,null,null,null,0]
[null,null,null,null,null,null,null,null,null,null,null,null,null,null,null,null,null,null,null,null,null,null,null,null,null,null,null,null,null,null,null,null,null,null,null,null,null,null,null,null,null,null,null,null,null,null,null,null,null,null,null,null,null,null,null,null,null,null,null,null,null,null,null,null,0]
[null,null,null,null,null,null,null,null,null,null,null,null,null,null,null,null,null,null,null,null,null,null,null,null,null,null,null,null,null,null,null,null,null,null,null,null,null,null,null,null,null,null,null,null,null,null,null,null,null,null,null,null,null,null,null,null,null,null,null,null,null,null,null,null,0]
[null,null,null,null,null,null,null,null,null,null,null,null,null,null,null,null,null,null,null,null,null,null,null,null,null,null,null,null,null,null,null,null,null,null,null,null,null,null,null,null,null,null,null,null,null,null,null,null,null,null,null,null,null,null,null,null,null,null,null,null,null,null,null,null,0]
[null,null,null,null,null,null,null,null,null,null,null,null,null,null,null,null,null,null,null,null,null,null,null,null,null,null,null,null,null,null,null,null,null,null,null,null,null,null,null,null,null,null,null,null,null,null,null,null,null,null,null,null,null,null,null,null,null,null,null,null,null,null,null,null,0]
[null,null,null,null,null,null,null,null,null,null,null,null,null,null,null,null,null,null,null,null,null,null,null,null,null,null,null,null,null,null,null,null,null,null,null,null,null,null,null,null,null,null,null,null,null,null,null,null,null,null,null,null,null,null,null,null,null,null,null,null,null,null,null,null,0]
[null,null,null,null,null,null,null,null,null,null,null,null,null,null,null,null,null,null,null,null,null,null,null,null,null,null,null,null,null,null,null,null,null,null,null,null,null,null,null,null,null,null,null,null,null,null,null,null,null,null,null,null,null,null,null,null,null,null,null,null,null,null,null,null,0]
[null,null,null,null,null,null,null,null,null,null,null,null,null,null,null,null,null,null,null,null,null,null,null,null,null,null,null,null,null,null,null,null,null,null,null,null,null,null,null,null,null,null,null,null,null,null,null,null,null,null,null,null,null,null,null,null,null,null,null,null,null,null,null,null,0]
[null,null,null,null,null,null,null,null,null,null,null,null,null,null,null,null,null,null,null,null,null,null,null,null,null,null,null,null,null,null,null,null,null,null,null,null,null,null,null,null,null,null,null,null,null,null,null,null,null,null,null,null,null,null,null,null,null,null,null,null,null,null,null,null,0]
[null,null,null,null,null,null,null,null,null,null,null,null,null,null,null,null,null,null,null,null,null,null,null,null,null,null,null,null,null,null,null,null,null,null,null,null,null,null,null,null,null,null,null,null,null,null,null,null,null,null,null,null,null,null,null,null,null,null,null,null,null,null,null,null,0]
[null,null,null,null,null,null,null,null,null,null,null,null,null,null,null,null,null,null,null,null,null,null,null,null,null,null,null,null,null,null,null,null,null,null,null,null,null,null,null,null,null,null,null,null,null,null,null,null,null,null,null,null,null,null,null,null,null,null,null,null,null,null,null,null,0]
[null,null,null,null,null,null,null,null,null,null,null,null,null,null,null,null,null,null,null,null,null,null,null,null,null,null,null,null,null,null,null,null,null,null,null,null,null,null,null,null,null,null,null,null,null,null,null,null,null,null,null,null,null,null,null,null,null,null,null,null,null,null,null,null,0]
[null,null,null,null,null,null,null,null,null,null,null,null,null,null,null,null,null,null,null,null,null,null,null,null,null,null,null,null,null,null,null,null,null,null,null,null,null,null,null,null,null,null,null,null,null,null,null,null,null,null,null,null,null,null,null,null,null,null,null,null,null,null,null,null,0]
[null,null,null,null,null,null,null,null,null,null,null,null,null,null,null,null,null,null,null,null,null,null,null,null,null,null,null,null,null,null,null,null,null,null,null,null,null,null,null,null,null,null,null,null,null,null,null,null,null,null,null,null,null,null,null,null,null,null,null,null,null,null,null,null,0]
[null,null,null,null,null,null,null,null,null,null,null,null,null,null,null,null,null,null,null,null,null,null,null,null,null,null,null,null,null,null,null,null,null,null,null,null,null,null,null,null,null,null,null,null,null,null,null,null,null,null,null,null,null,null,null,null,null,null,null,null,null,null,null,null,0]
[null,null,null,null,null,null,null,null,null,null,null,null,null,null,null,null,null,null,null,null,null,null,null,null,null,null,null,null,null,null,null,null,null,null,null,null,null,null,null,null,null,null,null,null,null,null,null,null,null,null,null,null,null,null,null,null,null,null,null,null,null,null,null,null,0]
[null,null,null,null,null,null,null,null,null,null,null,null,null,null,null,null,null,null,null,null,null,null,null,null,null,null,null,null,null,null,null,null,null,null,null,null,null,null,null,null,null,null,null,null,null,null,null,null,null,null,null,null,null,null,null,null,null,null,null,null,null,null,null,null,0]
[null,null,null,null,null,null,null,null,null,null,null,null,null,null,null,null,null,null,null,null,null,null,null,null,null,null,null,null,null,null,null,null,null,null,null,null,null,null,null,null,null,null,null,null,null,null,null,null,null,null,null,null,null,null,null,null,null,null,null,null,null,null,null,null,0]
[null,null,null,null,null,null,null,null,null,null,null,null,null,null,null,null,null,null,null,null,null,null,null,null,null,null,null,null,null,null,null,null,null,null,null,null,null,null,null,null,null,null,null,null,null,null,null,null,null,null,null,null,null,null,null,null,null,null,null,null,null,null,null,null,0]
[null,null,null,null,null,null,null,null,null,null,null,null,null,null,null,null,null,null,null,null,null,null,null,null,null,null,null,null,null,null,null,null,null,null,null,null,null,null,null,null,null,null,null,null,null,null,null,null,null,null,null,null,null,null,null,null,null,null,null,null,null,null,null,null,0]
[null,null,null,null,null,null,null,null,null,null,null,null,null,null,null,null,null,null,null,null,null,null,null,null,null,null,null,null,null,null,null,null,null,null,null,null,null,null,null,null,null,null,null,null,null,null,null,null,null,null,null,null,null,null,null,null,null,null,null,null,null,null,null,null,0]
[null,null,null,null,null,null,null,null,null,null,null,null,null,null,null,null,null,null,null,null,null,null,null,null,null,null,null,null,null,null,null,null,null,null,null,null,null,null,null,null,null,null,null,null,null,null,null,null,null,null,null,null,null,null,null,null,null,null,null,null,null,null,null,null,0]
[null,null,null,null,null,null,null,null,null,null,null,null,null,null,null,null,null,null,null,null,null,null,null,null,null,null,null,null,null,null,null,null,null,null,null,null,null,null,null,null,null,null,null,null,null,null,null,null,null,null,null,null,null,null,null,null,null,null,null,null,null,null,null,null,0]
[null,null,null,null,null,null,null,null,null,null,null,null,null,null,null,null,null,null,null,null,null,null,null,null,null,null,null,null,null,null,null,null,null,null,null,null,null,null,null,null,null,null,null,null,null,null,null,null,null,null,null,null,null,null,null,null,null,null,null,null,null,null,null,null,0]
[null,null,null,null,null,null,null,null,null,null,null,null,null,null,null,null,null,null,null,null,null,null,null,null,null,null,null,null,null,null,null,null,null,null,null,null,null,null,null,null,null,null,null,null,null,null,null,null,null,null,null,null,null,null,null,null,null,null,null,null,null,null,null,null,0]
[null,null,null,null,null,null,null,null,null,null,null,null,null,null,null,null,null,null,null,null,null,null,null,null,null,null,null,null,null,null,null,null,null,null,null,null,null,null,null,null,null,null,null,null,null,null,null,null,null,null,null,null,null,null,null,null,null,null,null,null,null,null,null,null,0]
[null,null,null,null,null,null,null,null,null,null,null,null,null,null,null,null,null,null,null,null,null,null,null,null,null,null,null,null,null,null,null,null,null,null,null,null,null,null,null,null,null,null,null,null,null,null,null,null,null,null,null,null,null,null,null,null,null,null,null,null,null,null,null,null,0]
[null,null,null,null,null,null,null,null,null,null,null,null,null,null,null,null,null,null,null,null,null,null,null,null,null,null,null,null,null,null,null,null,null,null,null,null,null,null,null,null,null,null,null,null,null,null,null,null,null,null,null,null,null,null,null,null,null,null,null,null,null,null,null,null,0]
[null,null,null,null,null,null,null,null,null,null,null,null,null,null,null,null,null,null,null,null,null,null,null,null,null,null,null,null,null,null,null,null,null,null,null,null,null,null,null,null,null,null,null,null,null,null,null,null,null,null,null,null,null,null,null,null,null,null,null,null,null,null,null,null,0]
[null,null,null,null,null,null,null,null,null,null,null,null,null,null,null,null,null,null,null,null,null,null,null,null,null,null,null,null,null,null,null,null,null,null,null,null,null,null,null,null,null,null,null,null,null,null,null,null,null,null,null,null,null,null,null,null,null,null,null,null,null,null,null,null,0]
[null,null,null,null,null,null,null,null,null,null,null,null,null,null,null,null,null,null,null,null,null,null,null,null,null,null,null,null,null,null,null,null,null,null,null,null,null,null,null,null,null,null,null,null,null,null,null,null,null,null,null,null,null,null,null,null,null,null,null,null,null,null,null,null,0]
[null,null,null,null,null,null,null,null,null,null,null,null,null,null,null,null,null,null,null,null,null,null,null,null,null,null,null,null,null,null,null,null,null,null,null,null,null,null,null,null,null,null,null,null,null,null,null,null,null,null,null,null,null,null,null,null,null,null,null,null,null,null,null,null,0]
[null,null,null,null,null,null,null,null,null,null,null,null,null,null,null,null,null,null,null,null,null,null,null,null,null,null,null,null,null,null,null,null,null,null,null,null,null,null,null,null,null,null,null,null,null,null,null,null,null,null,null,null,null,null,null,null,null,null,null,null,null,null,null,null,{"$f":"COUNTA(C72:BL72)/2","v":0}]
[null,null,null,null,null,null,null,null,null,null,null,null,null,null,null,null,null,null,null,null,null,null,null,null,null,null,null,null,null,null,null,null,null,null,null,null,null,null,null,null,null,null,null,null,null,null,null,null,null,null,null,null,null,null,null,null,null,null,null,null,null,null,null,null,0]
[null,null,null,null,null,null,null,null,null,null,null,null,null,null,null,null,null,null,null,null,null,null,null,null,null,null,null,null,null,null,null,null,null,null,null,null,null,null,null,null,null,null,null,null,null,null,null,null,null,null,null,null,null,null,null,null,null,null,null,null,null,null,null,null,0]
[null,null,null,null,null,null,null,null,null,null,null,null,null,null,null,null,null,null,null,null,null,null,null,null,null,null,null,null,null,null,null,null,null,null,null,null,null,null,null,null,null,null,null,null,null,null,null,null,null,null,null,null,null,null,null,null,null,null,null,null,null,null,null,null,0]
[null,null,null,null,null,null,null,null,null,null,null,null,null,null,null,null,null,null,null,null,null,null,null,null,null,null,null,null,null,null,null,null,null,null,null,null,null,null,null,null,null,null,null,null,null,null,null,null,null,null,null,null,null,null,null,null,null,null,null,null,null,null,null,null,0]
[null,null,null,null,null,null,null,null,null,null,null,null,null,null,null,null,null,null,null,null,null,null,null,null,null,null,null,null,null,null,null,null,null,null,null,null,null,null,null,null,null,null,null,null,null,null,null,null,null,null,null,null,null,null,null,null,null,null,null,null,null,null,null,null,0]
[null,null,null,null,null,null,null,null,null,null,null,null,null,null,null,null,null,null,null,null,null,null,null,null,null,null,null,null,null,null,null,null,null,null,null,null,null,null,null,null,null,null,null,null,null,null,null,null,null,null,null,null,null,null,null,null,null,null,null,null,null,null,null,null,0]
[null,null,null,null,null,null,null,null,null,null,null,null,null,null,null,null,null,null,null,null,null,null,null,null,null,null,null,null,null,null,null,null,null,null,null,null,null,null,null,null,null,null,null,null,null,null,null,null,null,null,null,null,null,null,null,null,null,null,null,null,null,null,null,null,0]
[null,null,null,null,null,null,null,null,null,null,null,null,null,null,null,null,null,null,null,null,null,null,null,null,null,null,null,null,null,null,null,null,null,null,null,null,null,null,null,null,null,null,null,null,null,null,null,null,null,null,null,null,null,null,null,null,null,null,null,null,null,null,null,null,0]
[null,null,null,null,null,null,null,null,null,null,null,null,null,null,null,null,null,null,null,null,null,null,null,null,null,null,null,null,null,null,null,null,null,null,null,null,null,null,null,null,null,null,null,null,null,null,null,null,null,null,null,null,null,null,null,null,null,null,null,null,null,null,null,null,0]
[null,null,null,null,null,null,null,null,null,null,null,null,null,null,null,null,null,null,null,null,null,null,null,null,null,null,null,null,null,null,null,null,null,null,null,null,null,null,null,null,null,null,null,null,null,null,null,null,null,null,null,null,null,null,null,null,null,null,null,null,null,null,null,null,0]
[null,null,null,null,null,null,null,null,null,null,null,null,null,null,null,null,null,null,null,null,null,null,null,null,null,null,null,null,null,null,null,null,null,null,null,null,null,null,null,null,null,null,null,null,null,null,null,null,null,null,null,null,null,null,null,null,null,null,null,null,null,null,null,null,0]
[null,null,null,null,null,null,null,null,null,null,null,null,null,null,null,null,null,null,null,null,null,null,null,null,null,null,null,null,null,null,null,null,null,null,null,null,null,null,null,null,null,null,null,null,null,null,null,null,null,null,null,null,null,null,null,null,null,null,null,null,null,null,null,null,0]
[null,null,null,null,null,null,null,null,null,null,null,null,null,null,null,null,null,null,null,null,null,null,null,null,null,null,null,null,null,null,null,null,null,null,null,null,null,null,null,null,null,null,null,null,null,null,null,null,null,null,null,null,null,null,null,null,null,null,null,null,null,null,null,null,0]
[null,null,null,null,null,null,null,null,null,null,null,null,null,null,null,null,null,null,null,null,null,null,null,null,null,null,null,null,null,null,null,null,null,null,null,null,null,null,null,null,null,null,null,null,null,null,null,null,null,null,null,null,null,null,null,null,null,null,null,null,null,null,null,null,0]
[null,null,null,null,null,null,null,null,null,null,null,null,null,null,null,null,null,null,null,null,null,null,null,null,null,null,null,null,null,null,null,null,null,null,null,null,null,null,null,null,null,null,null,null,null,null,null,null,null,null,null,null,null,null,null,null,null,null,null,null,null,null,null,null,0]
[null,null,null,null,null,null,null,null,null,null,null,null,null,null,null,null,null,null,null,null,null,null,null,null,null,null,null,null,null,null,null,null,null,null,null,null,null,null,null,null,null,null,null,null,null,null,null,null,null,null,null,null,null,null,null,null,null,null,null,null,null,null,null,null,0]
[null,null,null,null,null,null,null,null,null,null,null,null,null,null,null,null,null,null,null,null,null,null,null,null,null,null,null,null,null,null,null,null,null,null,null,null,null,null,null,null,null,null,null,null,null,null,null,null,null,null,null,null,null,null,null,null,null,null,null,null,null,null,null,null,0]
[null,null,null,null,null,null,null,null,null,null,null,null,null,null,null,null,null,null,null,null,null,null,null,null,null,null,null,null,null,null,null,null,null,null,null,null,null,null,null,null,null,null,null,null,null,null,null,null,null,null,null,null,null,null,null,null,null,null,null,null,null,null,null,null,0]
[null,null,null,null,null,null,null,null,null,null,null,null,null,null,null,null,null,null,null,null,null,null,null,null,null,null,null,null,null,null,null,null,null,null,null,null,null,null,null,null,null,null,null,null,null,null,null,null,null,null,null,null,null,null,null,null,null,null,null,null,null,null,null,null,0]
[null,null,null,null,null,null,null,null,null,null,null,null,null,null,null,null,null,null,null,null,null,null,null,null,null,null,null,null,null,null,null,null,null,null,null,null,null,null,null,null,null,null,null,null,null,null,null,null,null,null,null,null,null,null,null,null,null,null,null,null,null,null,null,null,0]
[null,null,null,null,null,null,null,null,null,null,null,null,null,null,null,null,null,null,null,null,null,null,null,null,null,null,null,null,null,null,null,null,null,null,null,null,null,null,null,null,null,null,null,null,null,null,null,null,null,null,null,null,null,null,null,null,null,null,null,null,null,null,null,null,0]
[null,null,null,null,null,null,null,null,null,null,null,null,null,null,null,null,null,null,null,null,null,null,null,null,null,null,null,null,null,null,null,null,null,null,null,null,null,null,null,null,null,null,null,null,null,null,null,null,null,null,null,null,null,null,null,null,null,null,null,null,null,null,null,null,0]
[null,null,null,null,null,null,null,null,null,null,null,null,null,null,null,null,null,null,null,null,null,null,null,null,null,null,null,null,null,null,null,null,null,null,null,null,null,null,null,null,null,null,null,null,null,null,null,null,null,null,null,null,null,null,null,null,null,null,null,null,null,null,null,null,0]
[null,null,null,null,null,null,null,null,null,null,null,null,null,null,null,null,null,null,null,null,null,null,null,null,null,null,null,null,null,null,null,null,null,null,null,null,null,null,null,null,null,null,null,null,null,null,null,null,null,null,null,null,null,null,null,null,null,null,null,null,null,null,null,null,0]
[null,null,null,null,null,null,null,null,null,null,null,null,null,null,null,null,null,null,null,null,null,null,null,null,null,null,null,null,null,null,null,null,null,null,null,null,null,null,null,null,null,null,null,null,null,null,null,null,null,null,null,null,null,null,null,null,null,null,null,null,null,null,null,null,0]
[null,null,null,null,null,null,null,null,null,null,null,null,null,null,null,null,null,null,null,null,null,null,null,null,null,null,null,null,null,null,null,null,null,null,null,null,null,null,null,null,null,null,null,null,null,null,null,null,null,null,null,null,null,null,null,null,null,null,null,null,null,null,null,null,0]
[null,null,null,null,null,null,null,null,null,null,null,null,null,null,null,null,null,null,null,null,null,null,null,null,null,null,null,null,null,null,null,null,null,null,null,null,null,null,null,null,null,null,null,null,null,null,null,null,null,null,null,null,null,null,null,null,null,null,null,null,null,null,null,null,0]
[null,null,null,null,null,null,null,null,null,null,null,null,null,null,null,null,null,null,null,null,null,null,null,null,null,null,null,null,null,null,null,null,null,null,null,null,null,null,null,null,null,null,null,null,null,null,null,null,null,null,null,null,null,null,null,null,null,null,null,null,null,null,null,null,0]

{"sheet":"Août","index":9,"n_rows":100,"n_cols":16384,"rows_kept":100,"cut":false,"hidden":false,"merged":[[17,0,17,1],[18,0,18,1],[19,0,19,1],[20,0,20,1],[13,0,13,1],[8,0,8,1],[9,0,9,1],[12,0,12,1],[10,0,10,1],[11,0,11,1],[14,0,14,1],[15,0,15,1],[16,0,16,1],[7,0,7,1],[4,44,4,45],[4,32,4,33],[4,34,4,35],[4,36,4,37],[4,38,4,39],[4,40,4,41],[4,42,4,43],[4,20,4,21],[4,14,4,15],[4,16,4,17],[4,18,4,19],[4,2,4,3],[4,4,4,5],[4,6,4,7],[4,8,4,9],[4,62,4,63],[6,0,6,1],[4,52,4,53],[4,54,4,55],[4,30,4,31],[4,58,4,59],[4,60,4,61],[4,22,4,23],[4,24,4,25],[4,26,4,27],[4,28,4,29],[4,56,4,57],[4,46,4,47],[4,48,4,49],[4,50,4,51],[4,12,4,13],[4,10,4,11],[1,42,1,46],[3,32,3,33],[3,34,3,35],[3,36,3,37],[3,50,3,51],[3,48,3,49],[3,26,3,27],[3,28,3,29],[3,22,3,23],[3,24,3,25],[3,38,3,39],[3,40,3,41],[3,42,3,43],[3,44,3,45],[3,46,3,47],[3,30,3,31],[1,47,1,49],[1,55,1,59],[1,60,1,62],[3,2,3,3],[3,4,3,5],[3,6,3,7],[3,8,3,9],[3,10,3,11],[3,12,3,13],[1,3,1,7],[1,8,1,10],[1,16,1,20],[1,21,1,23],[1,29,1,33],[1,34,1,36],[3,14,3,15],[3,62,3,63],[3,52,3,53],[3,54,3,55],[3,56,3,57],[3,58,3,59],[3,60,3,61],[3,16,3,17],[3,18,3,19],[3,20,3,21],[26,0,26,1],[27,0,27,1],[28,0,28,1],[29,0,29,1],[30,0,30,1],[21,0,21,1],[22,0,22,1],[23,0,23,1],[24,0,24,1],[25,0,25,1],[36,0,36,1],[37,0,37,1],[38,0,38,1],[39,0,39,1],[40,0,40,1],[31,0,31,1],[32,0,32,1],[33,0,33,1],[34,0,34,1],[35,0,35,1],[46,0,46,1],[47,0,47,1],[48,0,48,1],[49,0,49,1],[50,0,50,1],[41,0,41,1],[42,0,42,1],[43,0,43,1],[44,0,44,1],[45,0,45,1],[56,0,56,1],[57,0,57,1],[58,0,58,1],[59,0,59,1],[60,0,60,1],[51,0,51,1],[52,0,52,1],[53,0,53,1],[54,0,54,1],[55,0,55,1],[66,0,66,1],[67,0,67,1],[68,0,68,1],[69,0,69,1],[70,0,70,1],[61,0,61,1],[62,0,62,1],[63,0,63,1],[64,0,64,1],[65,0,65,1],[76,0,76,1],[77,0,77,1],[78,0,78,1],[79,0,79,1],[80,0,80,1],[71,0,71,1],[72,0,72,1],[73,0,73,1],[74,0,74,1],[75,0,75,1],[86,0,86,1],[87,0,87,1],[88,0,88,1],[89,0,89,1],[90,0,90,1],[81,0,81,1],[82,0,82,1],[83,0,83,1],[84,0,84,1],[85,0,85,1],[96,0,96,1],[97,0,97,1],[98,0,98,1],[99,0,99,1],[91,0,91,1],[92,0,92,1],[93,0,93,1],[94,0,94,1],[95,0,95,1]]}
[1,{"$f":"C5","v":"2014-08-01"}]
[null,null,null,{"$f":"IF(An!$Q$4=\"\",\"\",An!$Q$4)","v":""},null,null,null,null,{"$f":"C5","v":"2014-08-01"},null,null,null,null,"ACCEUIL",null,null,{"$f":"IF(An!$Q$4=\"\",\"\",An!$Q$4)","v":""},null,null,null,null,{"$f":"C5","v":"2014-08-01"},null,null,null,null,"ACCEUIL",null,null,{"$f":"IF(An!$Q$4=\"\",\"\",An!$Q$4)","v":""},null,null,null,null,{"$f":"C5","v":"2014-08-01"},null,null,null,null,"ACCEUIL",null,null,{"$f":"IF(An!$Q$4=\"\",\"\",An!$Q$4)","v":""},null,null,null,null,{"$f":"C5","v":"2014-08-01"},null,null,null,null,"ACCEUIL",null,null,{"$f":"IF(An!$Q$4=\"\",\"\",An!$Q$4)","v":""},null,null,null,null,{"$f":"C5","v":"2014-08-01"},null,null,"ACCEUIL"]
[]
[null,null,{"$f":"IF(C5=\"\",\"\",IF(LOOKUP(C5,Fériés)=C5,\"\",CHOOSE(WEEKDAY(C5,1),\"Dimanche\",\"Lundi\",\"Mardi\",\"Mercredi\",\"Jeudi\",\"Vendredi\",\"Samedi\")))","v":"Vendredi"},null,"Samedi",null,"Dimanche",null,"Lundi",null,"Mardi",null,"Mercredi",null,"Jeudi",null,"Vendredi",null,{"$f":"IF(S5=\"\",\"\",IF(LOOKUP(S5,Fériés)=S5,\"\",CHOOSE(WEEKDAY(S5,1),\"Dimanche\",\"Lundi\",\"Mardi\",\"Mercredi\",\"Jeudi\",\"Vendredi\",\"Samedi\")))","v":"Samedi"},null,"Dimanche",null,"Lundi",null,"Mardi",null,"Mercredi",null,"Jeudi",null,{"$f":"IF(AE5=\"\",\"\",IF(LOOKUP(AE5,Fériés)=AE5,CHOOSE(WEEKDAY(AE5,1),\"Dimanche\",\"Lundi\",\"Mardi\",\"Mercredi\",\"Jeudi\",\"Vendredi\",\"Samedi\",\"\")))","v":"Vendredi"},null,{"$f":"IF(AG5=\"\",\"\",IF(LOOKUP(AG5,Fériés)=AG5,\"\",CHOOSE(WEEKDAY(AG5,1),\"Dimanche\",\"Lundi\",\"Mardi\",\"Mercredi\",\"Jeudi\",\"Vendredi\",\"Samedi\")))","v":"Samedi"},null,{"$f":"IF(AI5=\"\",\"\",IF(LOOKUP(AI5,Fériés)=AI5,\"\",CHOOSE(WEEKDAY(AI5,1),\"Dimanche\",\"Lundi\",\"Mardi\",\"Mercredi\",\"Jeudi\",\"Vendredi\",\"Samedi\")))","v":"Dimanche"},null,"Lundi",null,"Mardi",null,"Mercredi",null,"Jeudi",null,"Vendredi",null,"Samedi",null,{"$f":"IF(AW5=\"\",\"\",IF(LOOKUP(AW5,Fériés)=AW5,\"\",CHOOSE(WEEKDAY(AW5,1),\"Dimanche\",\"Lundi\",\"Mardi\",\"Mercredi\",\"Jeudi\",\"Vendredi\",\"Samedi\")))","v":"Dimanche"},null,{"$f":"IF(AY5=\"\",\"\",IF(LOOKUP(AY5,Fériés)=AY5,\"\",CHOOSE(WEEKDAY(AY5,1),\"Dimanche\",\"Lundi\",\"Mardi\",\"Mercredi\",\"Jeudi\",\"Vendredi\",\"Samedi\")))","v":"Lundi"},null,"Mardi",null,"Mercredi",null,"Jeudi",null,"Vendredi",null,"Samedi",null,"Dimanche"]
[null,null,{"$f":"DATE(Année,8,1)","v":"2014-08-01"},null,{"$f":"IF(C5=\"\",\"\",IF(MONTH(C5+1)<>MONTH(C5),\"\",C5+1))","v":"2014-08-02"},null,{"$f":"IF(E5=\"\",\"\",IF(MONTH(E5+1)<>MONTH(E5),\"\",E5+1))","v":"2014-08-03"},null,{"$f":"IF(G5=\"\",\"\",IF(MONTH(G5+1)<>MONTH(G5),\"\",G5+1))","v":"2014-08-04"},null,{"$f":"IF(I5=\"\",\"\",IF(MONTH(I5+1)<>MONTH(I5),\"\",I5+1))","v":"2014-08-05"},null,{"$f":"IF(K5=\"\",\"\",IF(MONTH(K5+1)<>MONTH(K5),\"\",K5+1))","v":"2014-08-06"},null,{"$f":"IF(M5=\"\",\"\",IF(MONTH(M5+1)<>MONTH(M5),\"\",M5+1))","v":"2014-08-07"},null,{"$f":"IF(O5=\"\",\"\",IF(MONTH(O5+1)<>MONTH(O5),\"\",O5+1))","v":"2014-08-08"},null,{"$f":"IF(Q5=\"\",\"\",IF(MONTH(Q5+1)<>MONTH(Q5),\"\",Q5+1))","v":"2014-08-09"},null,{"$f":"IF(S5=\"\",\"\",IF(MONTH(S5+1)<>MONTH(S5),\"\",S5+1))","v":"2014-08-10"},null,{"$f":"IF(U5=\"\",\"\",IF(MONTH(U5+1)<>MONTH(U5),\"\",U5+1))","v":"2014-08-11"},null,{"$f":"IF(W5=\"\",\"\",IF(MONTH(W5+1)<>MONTH(W5),\"\",W5+1))","v":"2014-08-12"},null,{"$f":"IF(Y5=\"\",\"\",IF(MONTH(Y5+1)<>MONTH(Y5),\"\",Y5+1))","v":"2014-08-13"},null,{"$f":"IF(AA5=\"\",\"\",IF(MONTH(AA5+1)<>MONTH(AA5),\"\",AA5+1))","v":"2014-08-14"},null,{"$f":"IF(AC5=\"\",\"\",IF(MONTH(AC5+1)<>MONTH(AC5),\"\",AC5+1))","v":"2014-08-15"},null,{"$f":"IF(AE5=\"\",\"\",IF(MONTH(AE5+1)<>MONTH(AE5),\"\",AE5+1))","v":"2014-08-16"},null,{"$f":"IF(AG5=\"\",\"\",IF(MONTH(AG5+1)<>MONTH(AG5),\"\",AG5+1))","v":"2014-08-17"},null,{"$f":"IF(AI5=\"\",\"\",IF(MONTH(AI5+1)<>MONTH(AI5),\"\",AI5+1))","v":"2014-08-18"},null,{"$f":"IF(AK5=\"\",\"\",IF(MONTH(AK5+1)<>MONTH(AK5),\"\",AK5+1))","v":"2014-08-19"},null,{"$f":"IF(AM5=\"\",\"\",IF(MONTH(AM5+1)<>MONTH(AM5),\"\",AM5+1))","v":"2014-08-20"},null,{"$f":"IF(AO5=\"\",\"\",IF(MONTH(AO5+1)<>MONTH(AO5),\"\",AO5+1))","v":"2014-08-21"},null,{"$f":"IF(AQ5=\"\",\"\",IF(MONTH(AQ5+1)<>MONTH(AQ5),\"\",AQ5+1))","v":"2014-08-22"},null,{"$f":"IF(AS5=\"\",\"\",IF(MONTH(AS5+1)<>MONTH(AS5),\"\",AS5+1))","v":"2014-08-23"},null,{"$f":"IF(AU5=\"\",\"\",IF(MONTH(AU5+1)<>MONTH(AU5),\"\",AU5+1))","v":"2014-08-24"},null,{"$f":"IF(AW5=\"\",\"\",IF(MONTH(AW5+1)<>MONTH(AW5),\"\",AW5+1))","v":"2014-08-25"},null,{"$f":"IF(AY5=\"\",\"\",IF(MONTH(AY5+1)<>MONTH(AY5),\"\",AY5+1))","v":"2014-08-26"},null,{"$f":"IF(BA5=\"\",\"\",IF(MONTH(BA5+1)<>MONTH(BA5),\"\",BA5+1))","v":"2014-08-27"},null,{"$f":"IF(BC5=\"\",\"\",IF(MONTH(BC5+1)<>MONTH(BC5),\"\",BC5+1))","v":"2014-08-28"},null,{"$f":"IF(BE5=\"\",\"\",IF(MONTH(BE5+1)<>MONTH(BE5),\"\",BE5+1))","v":"2014-08-29"},null,{"$f":"IF(BG5=\"\",\"\",IF(MONTH(BG5+1)<>MONTH(BG5),\"\",BG5+1))","v":"2014-08-30"},null,{"$f":"IF(BI5=\"\",\"\",IF(MONTH(BI5+1)<>MONTH(BI5),\"\",BI5+1))","v":"2014-08-31"}]
[null,null,"Matin","Après midi","Matin","Après midi","Matin","Après midi","Matin","Après midi","Matin","Après midi","Matin","Après midi","Matin","Après midi","Matin","Après midi","Matin","Après midi","Matin","Après midi","Matin","Après midi","Matin","Après midi","Matin","Après midi","Matin","Après midi","Matin","Après midi","Matin","Après midi","Matin","Après midi","Matin","Après midi","Matin","Après midi","Matin","Après midi","Matin","Après midi","Matin","Après midi","Matin","Après midi","Matin","Après midi","Matin","Après midi","Matin","Après midi","Matin","Après midi","Matin","Après midi",{"$f":"IF(BG5=\"\",\"\",\"Matin\")","v":"Matin"},{"$f":"IF(BG5=\"\",\"\",\"Apres midi\")","v":"Apres midi"},{"$f":"IF(BI5=\"\",\"\",\"Matin\")","v":"Matin"},{"$f":"IF(BI5=\"\",\"\",\"Apres midi\")","v":"Apres midi"},{"$f":"IF(BK5=\"\",\"\",\"Matin\")","v":"Matin"},{"$f":"IF(BK5=\"\",\"\",\"Apres midi\")","v":"Apres midi"}]
[null,null,null,null,null,null,null,null,null,null,null,null,null,null,null,null,null,null,null,null,null,null,null,null,null,null,null,null,null,null,null,null,null,null,null,null,null,null,null,null,null,null,null,null,null,null,null,null,null,null,null,null,null,null,null,null,null,null,null,null,null,null,null,null,{"$f":"COUNTA(C7:BL7)/2","v":0}]
[null,null,null,null,null,null,null,null,null,null,null,null,null,null,null,null,null,null,null,null,null,null,null,null,null,null,null,null,null,null,null,null,null,null,null,null,null,null,null,null,null,null,null,null,null,null,null,null,null,null,null,null,null,null,null,null,null,null,null,null,null,null,null,null,{"$f":"COUNTA(C8:BL8)/2","v":0}]
[null,null,null,null,null,null,null,null,null,null,null,null,null,null,null,null,null,null,null,null,null,null,null,null,null,null,null,null,null,null,null,null,null,null,null,null,null,null,null,null,null,null,null,null,null,null,null,null,null,null,null,null,null,null,null,null,null,null,null,null,null,null,null,null,0]
[null,null,null,null,null,null,null,null,null,null,null,null,null,null,null,null,null,null,null,null,null,null,null,null,null,null,null,null,null,null,null,null,null,null,null,null,null,null,null,null,null,null,null,null,null,null,null,null,null,null,null,null,null,null,null,null,null,null,null,null,null,null,null,null,0]
[null,null,null,null,null,null,null,null,null,null,null,null,null,null,null,null,null,null,null,null,null,null,null,null,null,null,null,null,null,null,null,null,null,null,null,null,null,null,null,null,null,null,null,null,null,null,null,null,null,null,null,null,null,null,null,null,null,null,null,null,null,null,null,null,0]
[null,null,null,null,null,null,null,null,null,null,null,null,null,null,null,null,null,null,null,null,null,null,null,null,null,null,null,null,null,null,null,null,null,null,null,null,null,null,null,null,null,null,null,null,null,null,null,null,null,null,null,null,null,null,null,null,null,null,null,null,null,null,null,null,0]
[null,null,null,null,null,null,null,null,null,null,null,null,null,null,null,null,null,null,null,null,null,null,null,null,null,null,null,null,null,null,null,null,null,null,null,null,null,null,null,null,null,null,null,null,null,null,null,null,null,null,null,null,null,null,null,null,null,null,null,null,null,null,null,null,0]
[null,null,null,null,null,null,null,null,null,null,null,null,null,null,null,null,null,null,null,null,null,null,null,null,null,null,null,null,null,null,null,null,null,null,null,null,null,null,null,null,null,null,null,null,null,null,null,null,null,null,null,null,null,null,null,null,null,null,null,null,null,null,null,null,0]
[null,null,null,null,null,null,null,null,null,null,null,null,null,null,null,null,null,null,null,null,null,null,null,null,null,null,null,null,null,null,null,null,null,null,null,null,null,null,null,null,null,null,null,null,null,null,null,null,null,null,null,null,null,null,null,null,null,null,null,null,null,null,null,null,0]
[null,null,null,null,null,null,null,null,null,null,null,null,null,null,null,null,null,null,null,null,null,null,null,null,null,null,null,null,null,null,null,null,null,null,null,null,null,null,null,null,null,null,null,null,null,null,null,null,null,null,null,null,null,null,null,null,null,null,null,null,null,null,null,null,0]
[null,null,null,null,null,null,null,null,null,null,null,null,null,null,null,null,null,null,null,null,null,null,null,null,null,null,null,null,null,null,null,null,null,null,null,null,null,null,null,null,null,null,null,null,null,null,null,null,null,null,null,null,null,null,null,null,null,null,null,null,null,null,null,null,0]
[null,null,null,null,null,null,null,null,null,null,null,null,null,null,null,null,null,null,null,null,null,null,null,null,null,null,null,null,null,null,null,null,null,null,null,null,null,null,null,null,null,null,null,null,null,null,null,null,null,null,null,null,null,null,null,null,null,null,null,null,null,null,null,null,0]
[null,null,null,null,null,null,null,null,null,null,null,null,null,null,null,null,null,null,null,null,null,null,null,null,null,null,null,null,null,null,null,null,null,null,null,null,null,null,null,null,null,null,null,null,null,null,null,null,null,null,null,null,null,null,null,null,null,null,null,null,null,null,null,null,0]
[null,null,null,null,null,null,null,null,null,null,null,null,null,null,null,null,null,null,null,null,null,null,null,null,null,null,null,null,null,null,null,null,null,null,null,null,null,null,null,null,null,null,null,null,null,null,null,null,null,null,null,null,null,null,null,null,null,null,null,null,null,null,null,null,0]
[null,null,null,null,null,null,null,null,null,null,null,null,null,null,null,null,null,null,null,null,null,null,null,null,null,null,null,null,null,null,null,null,null,null,null,null,null,null,null,null,null,null,null,null,null,null,null,null,null,null,null,null,null,null,null,null,null,null,null,null,null,null,null,null,0]
[null,null,null,null,null,null,null,null,null,null,null,null,null,null,null,null,null,null,null,null,null,null,null,null,null,null,null,null,null,null,null,null,null,null,null,null,null,null,null,null,null,null,null,null,null,null,null,null,null,null,null,null,null,null,null,null,null,null,null,null,null,null,null,null,0,null,"ADELONDRADO","ADELONDRADO","ADELONDRADO","ADELONDRADO","ADELONDRADO","ADELONDRADO","ADELONDRADO","ADELONDRADO","ADELONDRADO","ADELONDRADO","ADELONDRADO","ADELONDRADO","ADELONDRADO","ADELONDRADO","ADELONDRADO","ADELONDRADO","ADELONDRADO","ADELONDRADO","ADELONDRADO","ADELONDRADO","ADELONDRADO","ADELONDRADO","ADELONDRADO","ADELONDRADO","ADELONDRADO","ADELONDRADO","ADELONDRADO","ADELONDRADO","ADELONDRADO","ADELONDRADO","ADELONDRADO","ADELONDRADO","ADELONDRADO","ADELONDRADO","ADELONDRADO","ADELONDRADO","ADELONDRADO","ADELONDRADO","ADELONDRADO","ADELONDRADO","ADELONDRADO","ADELONDRADO","ADELONDRADO","ADELONDRADO","ADELONDRADO","ADELONDRADO","ADELONDRADO","ADELONDRADO","ADELONDRADO","ADELONDRADO","ADELONDRADO","ADELONDRADO","ADELONDRADO","ADELONDRADO","ADELONDRADO","ADELONDRADO","ADELONDRADO","ADELONDRADO","ADELONDRADO","ADELONDRADO","ADELONDRADO","ADELONDRADO","ADELONDRADO","ADELONDRADO","ADELONDRADO","ADELONDRADO","ADELONDRADO","ADELONDRADO","ADELONDRADO","ADELONDRADO","ADELONDRADO","ADELONDRADO","ADELONDRADO","ADELONDRADO","ADELONDRADO","ADELONDRADO","ADELONDRADO","ADELONDRADO","ADELONDRADO","ADELONDRADO","ADELONDRADO","ADELONDRADO","ADELONDRADO","ADELONDRADO","ADELONDRADO","ADELONDRADO","ADELONDRADO","ADELONDRADO","ADELONDRADO","ADELONDRADO","ADELONDRADO","ADELONDRADO","ADELONDRADO","ADELONDRADO","ADELONDRADO","ADELONDRADO","ADELONDRADO","ADELONDRADO","ADELONDRADO","ADELONDRADO","ADELONDRADO","ADELONDRADO","ADELONDRADO","ADELONDRADO","ADELONDRADO","ADELONDRADO","ADELONDRADO","ADELONDRADO","ADELONDRADO","ADELONDRADO","ADELONDRADO","ADELONDRADO","ADELONDRADO","ADELONDRADO","ADELONDRADO","ADELONDRADO","ADELONDRADO","ADELONDRADO","ADELONDRADO","ADELONDRADO","ADELONDRADO","ADELONDRADO","ADELONDRADO","ADELONDRADO","ADELONDRADO","ADELONDRADO","ADELONDRADO","ADELONDRADO","ADELONDRADO","ADELONDRADO","ADELONDRADO","ADELONDRADO","ADELONDRADO","ADELONDRADO","ADELONDRADO","ADELONDRADO","ADELONDRADO","ADELONDRADO","ADELONDRADO","ADELONDRADO","ADELONDRADO","ADELONDRADO","ADELONDRADO","ADELONDRADO","ADELONDRADO","ADELONDRADO","ADELONDRADO","ADELONDRADO","ADELONDRADO","ADELONDRADO","ADELONDRADO","ADELONDRADO","ADELONDRADO","ADELONDRADO","ADELONDRADO","ADELONDRADO","ADELONDRADO","ADELONDRADO","ADELONDRADO","ADELONDRADO","ADELONDRADO","ADELONDRADO","ADELONDRADO","ADELONDRADO","ADELONDRADO","ADELONDRADO","ADELONDRADO","ADELONDRADO","ADELONDRADO","ADELONDRADO","ADELONDRADO","ADELONDRADO","ADELONDRADO","ADELONDRADO","ADELONDRADO","ADELONDRADO","ADELONDRADO","ADELONDRADO","ADELONDRADO","ADELONDRADO","ADELONDRADO","ADELONDRADO","ADELONDRADO","ADELONDRADO","ADELONDRADO","ADELONDRADO","ADELONDRADO","ADELONDRADO","ADELONDRADO","ADELONDRADO","ADELONDRADO","ADELONDRADO","ADELONDRADO","ADELONDRADO","ADELONDRADO","ADELONDRADO","ADELONDRADO","ADELONDRADO","ADELONDRADO","ADELONDRADO","ADELONDRADO","ADELONDRADO","ADELONDRADO","ADELONDRADO","ADELONDRADO","ADELONDRADO","ADELONDRADO","ADELONDRADO","ADELONDRADO","ADELONDRADO","ADELONDRADO","ADELONDRADO","ADELONDRADO","ADELONDRADO","ADELONDRADO","ADELONDRADO","ADELONDRADO","ADELONDRADO","ADELONDRADO","ADELONDRADO","ADELONDRADO","ADELONDRADO","ADELONDRADO","ADELONDRADO","ADELONDRADO","ADELONDRADO","ADELONDRADO","ADELONDRADO","ADELONDRADO","ADELONDRADO","ADELONDRADO","ADELONDRADO","ADELONDRADO","ADELONDRADO","ADELONDRADO","ADELONDRADO","ADELONDRADO","ADELONDRADO","ADELONDRADO","ADELONDRADO","ADELONDRADO","ADELONDRADO","ADELONDRADO","ADELONDRADO","ADELONDRADO","ADELONDRADO","ADELONDRADO","ADELONDRADO","ADELONDRADO","ADELONDRADO","ADELONDRADO","ADELONDRADO","ADELONDRADO","ADELONDRADO","ADELONDRADO","ADELONDRADO","ADELONDRADO","ADELONDRADO","ADELONDRADO","ADELONDRADO","ADELONDRADO","ADELONDRADO","ADELONDRADO","ADELONDRADO","ADELONDRADO","ADELONDRADO","ADELONDRADO","ADELONDRADO","ADELONDRADO","ADELONDRADO","ADELONDRADO","ADELONDRADO","ADELONDRADO","ADELONDRADO","ADELONDRADO","ADELONDRADO","ADELONDRADO","ADELONDRADO","ADELONDRADO","ADELONDRADO","ADELONDRADO","ADELONDRADO","ADELONDRADO","ADELONDRADO","ADELONDRADO","ADELONDRADO","ADELONDRADO","ADELONDRADO","ADELONDRADO","ADELONDRADO","ADELONDRADO","ADELONDRADO","ADELONDRADO","ADELONDRADO","ADELONDRADO","ADELONDRADO","ADELONDRADO","ADELONDRADO","ADELONDRADO","ADELONDRADO","ADELONDRADO","ADELONDRADO","ADELONDRADO","ADELONDRADO","ADELONDRADO","ADELONDRADO","ADELONDRADO","ADELONDRADO","ADELONDRADO","ADELONDRADO","ADELONDRADO","ADELONDRADO","ADELONDRADO","ADELONDRADO","ADELONDRADO","ADELONDRADO","ADELONDRADO","ADELONDRADO","ADELONDRADO","ADELONDRADO","ADELONDRADO","ADELONDRADO","ADELONDRADO","ADELONDRADO","ADELONDRADO","ADELONDRADO","ADELONDRADO","ADELONDRADO","ADELONDRADO","ADELONDRADO","ADELONDRADO","ADELONDRADO","ADELONDRADO","ADELONDRADO","ADELONDRADO","ADELONDRADO","ADELONDRADO","ADELONDRADO","ADELONDRADO","ADELONDRADO","ADELONDRADO","ADELONDRADO","ADELONDRADO","ADELONDRADO","ADELONDRADO","ADELONDRADO","ADELONDRADO","ADELONDRADO","ADELONDRADO","ADELONDRADO","ADELONDRADO","ADELONDRADO","ADELONDRADO","ADELONDRADO","ADELONDRADO","ADELONDRADO","ADELONDRADO","ADELONDRADO","ADELONDRADO","ADELONDRADO","ADELONDRADO","ADELONDRADO","ADELONDRADO","ADELONDRADO","ADELONDRADO","ADELONDRADO","ADELONDRADO","ADELONDRADO","ADELONDRADO","ADELONDRADO","ADELONDRADO","ADELONDRADO","ADELONDRADO","ADELONDRADO","ADELONDRADO","ADELONDRADO","ADELONDRADO","ADELONDRADO","ADELONDRADO","ADELONDRADO","ADELONDRADO","ADELONDRADO","ADELONDRADO","ADELONDRADO","ADELONDRADO","ADELONDRADO","ADELONDRADO","ADELONDRADO","ADELONDRADO","ADELONDRADO","ADELONDRADO","ADELONDRADO","ADELONDRADO","ADELONDRADO","ADELONDRADO","ADELONDRADO","ADELONDRADO","ADELONDRADO","ADELONDRADO","ADELONDRADO","ADELONDRADO","ADELONDRADO","ADELONDRADO","ADELONDRADO","ADELONDRADO","ADELONDRADO","ADELONDRADO","ADELONDRADO","ADELONDRADO","ADELONDRADO","ADELONDRADO","ADELONDRADO","ADELONDRADO","ADELONDRADO","ADELONDRADO","ADELONDRADO","ADELONDRADO","ADELONDRADO","ADELONDRADO","ADELONDRADO","ADELONDRADO","ADELONDRADO","ADELONDRADO","ADELONDRADO","ADELONDRADO","ADELONDRADO","ADELONDRADO","ADELONDRADO","ADELONDRADO","ADELONDRADO","ADELONDRADO","ADELONDRADO","ADELONDRADO","ADELONDRADO","ADELONDRADO","ADELONDRADO","ADELONDRADO","ADELONDRADO","ADELONDRADO","ADELONDRADO","ADELONDRADO","ADELONDRADO","ADELONDRADO","ADELONDRADO","ADELONDRADO","ADELONDRADO","ADELONDRADO","ADELONDRADO","ADELONDRADO","ADELONDRADO","ADELONDRADO","ADELONDRADO","ADELONDRADO","ADELONDRADO","ADELONDRADO","ADELONDRADO","ADELONDRADO","ADELONDRADO","ADELONDRADO","ADELONDRADO","ADELONDRADO","ADELONDRADO","ADELONDRADO","ADELONDRADO","ADELONDRADO","ADELONDRADO","ADELONDRADO","ADELONDRADO","ADELONDRADO","ADELONDRADO","ADELONDRADO","ADELONDRADO","ADELONDRADO","ADELONDRADO","ADELONDRADO","ADELONDRADO","ADELONDRADO","ADELONDRADO","ADELONDRADO","ADELONDRADO","ADELONDRADO","ADELONDRADO","ADELONDRADO","ADELONDRADO","ADELONDRADO","ADELONDRADO","ADELONDRADO","ADELONDRADO","ADELONDRADO","ADELONDRADO","ADELONDRADO","ADELONDRADO","ADELONDRADO","ADELONDRADO","ADELONDRADO","ADELONDRADO","ADELONDRADO","ADELONDRADO","ADELONDRADO","ADELONDRADO","ADELONDRADO","ADELONDRADO","ADELONDRADO","ADELONDRADO","ADELONDRADO","ADELONDRADO","ADELONDRADO","ADELONDRADO","ADELONDRADO","ADELONDRADO","ADELONDRADO","ADELONDRADO","ADELONDRADO","ADELONDRADO","ADELONDRADO","ADELONDRADO","ADELONDRADO","ADELONDRADO","ADELONDRADO","ADELONDRADO","ADELONDRADO","ADELONDRADO","ADELONDRADO","ADELONDRADO","ADELONDRADO","ADELONDRADO","ADELONDRADO","ADELONDRADO","ADELONDRADO","ADELONDRADO","ADELONDRADO","ADELONDRADO","ADELONDRADO","ADELONDRADO","ADELONDRADO","ADELONDRADO","ADELONDRADO","ADELONDRADO","ADELONDRADO","ADELONDRADO","ADELONDRADO","ADELONDRADO","ADELONDRADO","ADELONDRADO","ADELONDRADO","ADELONDRADO","ADELONDRADO","ADELONDRADO","ADELONDRADO","ADELONDRADO","ADELONDRADO","ADELONDRADO","ADELONDRADO","ADELONDRADO","ADELONDRADO","ADELONDRADO","ADELONDRADO","ADELONDRADO","ADELONDRADO","ADELONDRADO","ADELONDRADO","ADELONDRADO","ADELONDRADO","ADELONDRADO","ADELONDRADO","ADELONDRADO","ADELONDRADO","ADELONDRADO","ADELONDRADO","ADELONDRADO","ADELONDRADO","ADELONDRADO","ADELONDRADO","ADELONDRADO","ADELONDRADO","ADELONDRADO","ADELONDRADO","ADELONDRADO","ADELONDRADO","ADELONDRADO","ADELONDRADO","ADELONDRADO","ADELONDRADO","ADELONDRADO","ADELONDRADO","ADELONDRADO","ADELONDRADO","ADELONDRADO","ADELONDRADO","ADELONDRADO","ADELONDRADO","ADELONDRADO","ADELONDRADO","ADELONDRADO","ADELONDRADO","ADELONDRADO","ADELONDRADO","ADELONDRADO","ADELONDRADO","ADELONDRADO","ADELONDRADO","ADELONDRADO","ADELONDRADO","ADELONDRADO","ADELONDRADO","ADELONDRADO","ADELONDRADO","ADELONDRADO","ADELONDRADO","ADELONDRADO","ADELONDRADO","ADELONDRADO","ADELONDRADO","ADELONDRADO","ADELONDRADO","ADELONDRADO","ADELONDRADO","ADELONDRADO","ADELONDRADO","ADELONDRADO","ADELONDRADO","ADELONDRADO","ADELONDRADO","ADELONDRADO","ADELONDRADO","ADELONDRADO","ADELONDRADO","ADELONDRADO","ADELONDRADO","ADELONDRADO","ADELONDRADO","ADELONDRADO","ADELONDRADO","ADELONDRADO","ADELONDRADO","ADELONDRADO","ADELONDRADO","ADELONDRADO","ADELONDRADO","ADELONDRADO","ADELONDRADO","ADELONDRADO","ADELONDRADO","ADELONDRADO","ADELONDRADO","ADELONDRADO","ADELONDRADO","ADELONDRADO","ADELONDRADO","ADELONDRADO","ADELONDRADO","ADELONDRADO","ADELONDRADO","ADELONDRADO","ADELONDRADO","ADELONDRADO","ADELONDRADO","ADELONDRADO","ADELONDRADO","ADELONDRADO","ADELONDRADO","ADELONDRADO","ADELONDRADO","ADELONDRADO","ADELONDRADO","ADELONDRADO","ADELONDRADO","ADELONDRADO","ADELONDRADO","ADELONDRADO","ADELONDRADO","ADELONDRADO","ADELONDRADO","ADELONDRADO","ADELONDRADO","ADELONDRADO","ADELONDRADO","ADELONDRADO","ADELONDRADO","ADELONDRADO","ADELONDRADO","ADELONDRADO","ADELONDRADO","ADELONDRADO","ADELONDRADO","ADELONDRADO","ADELONDRADO","ADELONDRADO","ADELONDRADO","ADELONDRADO","ADELONDRADO","ADELONDRADO","ADELONDRADO","ADELONDRADO","ADELONDRADO","ADELONDRADO","ADELONDRADO","ADELONDRADO","ADELONDRADO","ADELONDRADO","ADELONDRADO","ADELONDRADO","ADELONDRADO","ADELONDRADO","ADELONDRADO","ADELONDRADO","ADELONDRADO","ADELONDRADO","ADELONDRADO","ADELONDRADO","ADELONDRADO","ADELONDRADO","ADELONDRADO","ADELONDRADO","ADELONDRADO","ADELONDRADO","ADELONDRADO","ADELONDRADO","ADELONDRADO","ADELONDRADO","ADELONDRADO","ADELONDRADO","ADELONDRADO","ADELONDRADO","ADELONDRADO","ADELONDRADO","ADELONDRADO","ADELONDRADO","ADELONDRADO","ADELONDRADO","ADELONDRADO","ADELONDRADO","ADELONDRADO","ADELONDRADO","ADELONDRADO","ADELONDRADO","ADELONDRADO","ADELONDRADO","ADELONDRADO","ADELONDRADO","ADELONDRADO","ADELONDRADO","ADELONDRADO","ADELONDRADO","ADELONDRADO","ADELONDRADO","ADELONDRADO","ADELONDRADO","ADELONDRADO","ADELONDRADO","ADELONDRADO","ADELONDRADO","ADELONDRADO","ADELONDRADO","ADELONDRADO","ADELONDRADO","ADELONDRADO","ADELONDRADO","ADELONDRADO","ADELONDRADO","ADELONDRADO","ADELONDRADO","ADELONDRADO","ADELONDRADO","ADELONDRADO","ADELONDRADO","ADELONDRADO","ADELONDRADO","ADELONDRADO","ADELONDRADO","ADELONDRADO","ADELONDRADO","ADELONDRADO","ADELONDRADO","ADELONDRADO","ADELONDRADO","ADELONDRADO","ADELONDRADO","ADELONDRADO","ADELONDRADO","ADELONDRADO","ADELONDRADO","ADELONDRADO","ADELONDRADO","ADELONDRADO","ADELONDRADO","ADELONDRADO","ADELONDRADO","ADELONDRADO","ADELONDRADO","ADELONDRADO","ADELONDRADO","ADELONDRADO","ADELONDRADO","ADELONDRADO","ADELONDRADO","ADELONDRADO","ADELONDRADO","ADELONDRADO","ADELONDRADO","ADELONDRADO","ADELONDRADO","ADELONDRADO","ADELONDRADO","ADELONDRADO","ADELONDRADO","ADELONDRADO","ADELONDRADO","ADELONDRADO","ADELONDRADO","ADELONDRADO","ADELONDRADO","ADELONDRADO","ADELONDRADO","ADELONDRADO","ADELONDRADO","ADELONDRADO","ADELONDRADO","ADELONDRADO","ADELONDRADO","ADELONDRADO","ADELONDRADO","ADELONDRADO","ADELONDRADO","ADELONDRADO","ADELONDRADO","ADELONDRADO","ADELONDRADO","ADELONDRADO","ADELONDRADO","ADELONDRADO","ADELONDRADO","ADELONDRADO","ADELONDRADO","ADELONDRADO","ADELONDRADO","ADELONDRADO","ADELONDRADO","ADELONDRADO","ADELONDRADO","ADELONDRADO","ADELONDRADO","ADELONDRADO","ADELONDRADO","ADELONDRADO","ADELONDRADO","ADELONDRADO","ADELONDRADO","ADELONDRADO","ADELONDRADO","ADELONDRADO","ADELONDRADO","ADELONDRADO","ADELONDRADO","ADELONDRADO","ADELONDRADO","ADELONDRADO","ADELONDRADO","ADELONDRADO","ADELONDRADO","ADELONDRADO","ADELONDRADO","ADELONDRADO","ADELONDRADO","ADELONDRADO","ADELONDRADO","ADELONDRADO","ADELONDRADO","ADELONDRADO","ADELONDRADO","ADELONDRADO","ADELONDRADO","ADELONDRADO","ADELONDRADO","ADELONDRADO","ADELONDRADO","ADELONDRADO","ADELONDRADO","ADELONDRADO","ADELONDRADO","ADELONDRADO","ADELONDRADO","ADELONDRADO","ADELONDRADO","ADELONDRADO","ADELONDRADO","ADELONDRADO","ADELONDRADO","ADELONDRADO","ADELONDRADO","ADELONDRADO","ADELONDRADO","ADELONDRADO","ADELONDRADO","ADELONDRADO","ADELONDRADO","ADELONDRADO","ADELONDRADO","ADELONDRADO","ADELONDRADO","ADELONDRADO","ADELONDRADO","ADELONDRADO","ADELONDRADO","ADELONDRADO","ADELONDRADO","ADELONDRADO","ADELONDRADO","ADELONDRADO","ADELONDRADO","ADELONDRADO","ADELONDRADO","ADELONDRADO","ADELONDRADO","ADELONDRADO","ADELONDRADO","ADELONDRADO","ADELONDRADO","ADELONDRADO","ADELONDRADO","ADELONDRADO","ADELONDRADO","ADELONDRADO","ADELONDRADO","ADELONDRADO","ADELONDRADO","ADELONDRADO","ADELONDRADO","ADELONDRADO","ADELONDRADO","ADELONDRADO","ADELONDRADO","ADELONDRADO","ADELONDRADO","ADELONDRADO","ADELONDRADO","ADELONDRADO","ADELONDRADO","ADELONDRADO","ADELONDRADO","ADELONDRADO","ADELONDRADO","ADELONDRADO","ADELONDRADO","ADELONDRADO","ADELONDRADO","ADELONDRADO","ADELONDRADO","ADELONDRADO","ADELONDRADO","ADELONDRADO","ADELONDRADO","ADELONDRADO","ADELONDRADO","ADELONDRADO","ADELONDRADO","ADELONDRADO","ADELONDRADO","ADELONDRADO","ADELONDRADO","ADELONDRADO","ADELONDRADO","ADELONDRADO","ADELONDRADO","ADELONDRADO","ADELONDRADO","ADELONDRADO","ADELONDRADO","ADELONDRADO","ADELONDRADO","ADELONDRADO","ADELONDRADO","ADELONDRADO","ADELONDRADO","ADELONDRADO","ADELONDRADO","ADELONDRADO","ADELONDRADO","ADELONDRADO","ADELONDRADO","ADELONDRADO","ADELONDRADO","ADELONDRADO","ADELONDRADO","ADELONDRADO","ADELONDRADO","ADELONDRADO","ADELONDRADO","ADELONDRADO","ADELONDRADO","ADELONDRADO","ADELONDRADO","ADELONDRADO","ADELONDRADO","ADELONDRADO","ADELONDRADO","ADELONDRADO","ADELONDRADO","ADELONDRADO","ADELONDRADO","ADELONDRADO","ADELONDRADO","ADELONDRADO","ADELONDRADO","ADELONDRADO","ADELONDRADO","ADELONDRADO","ADELONDRADO","ADELONDRADO","ADELONDRADO","ADELONDRADO","ADELONDRADO","ADELONDRADO","ADELONDRADO","ADELONDRADO","ADELONDRADO","ADELONDRADO","ADELONDRADO","ADELONDRADO","ADELONDRADO","ADELONDRADO","ADELONDRADO","ADELONDRADO","ADELONDRADO","ADELONDRADO","ADELONDRADO","ADELONDRADO","ADELONDRADO","ADELONDRADO","ADELONDRADO","ADELONDRADO","ADELONDRADO","ADELONDRADO","ADELONDRADO","ADELONDRADO","ADELONDRADO","ADELONDRADO","ADELONDRADO","ADELONDRADO","ADELONDRADO","ADELONDRADO","ADELONDRADO","ADELONDRADO","ADELONDRADO","ADELONDRADO","ADELONDRADO","ADELONDRADO","ADELONDRADO","ADELONDRADO","ADELONDRADO","ADELONDRADO","ADELONDRADO","ADELONDRADO","ADELONDRADO","ADELONDRADO","ADELONDRADO","ADELONDRADO","ADELONDRADO","ADELONDRADO","ADELONDRADO","ADELONDRADO","ADELONDRADO","ADELONDRADO","ADELONDRADO","ADELONDRADO","ADELONDRADO","ADELONDRADO","ADELONDRADO","ADELONDRADO","ADELONDRADO","ADELONDRADO","ADELONDRADO","ADELONDRADO","ADELONDRADO","ADELONDRADO","ADELONDRADO","ADELONDRADO","ADELONDRADO","ADELONDRADO","ADELONDRADO","ADELONDRADO","ADELONDRADO","ADELONDRADO","ADELONDRADO","ADELONDRADO","ADELONDRADO","ADELONDRADO","ADELONDRADO","ADELONDRADO","ADELONDRADO","ADELONDRADO","ADELONDRADO","ADELONDRADO","ADELONDRADO","ADELONDRADO","ADELONDRADO","ADELONDRADO","ADELONDRADO","ADELONDRADO","ADELONDRADO","ADELONDRADO","ADELONDRADO","ADELONDRADO","ADELONDRADO","ADELONDRADO","ADELONDRADO","ADELONDRADO","ADELONDRADO","ADELONDRADO","ADELONDRADO","ADELONDRADO","ADELONDRADO","ADELONDRADO","ADELONDRADO","ADELONDRADO","ADELONDRADO","ADELONDRADO","ADELONDRADO","ADELONDRADO","ADELONDRADO","ADELONDRADO","ADELONDRADO","ADELONDRADO","ADELONDRADO","ADELONDRADO","ADELONDRADO","ADELONDRADO","ADELONDRADO","ADELONDRADO","ADELONDRADO","ADELONDRADO","ADELONDRADO","ADELONDRADO","ADELONDRADO","ADELONDRADO","ADELONDRADO","ADELONDRADO","ADELONDRADO","ADELONDRADO","ADELONDRADO","ADELONDRADO","ADELONDRADO","ADELONDRADO","ADELONDRADO","ADELONDRADO","ADELONDRADO","ADELONDRADO","ADELONDRADO","ADELONDRADO","ADELONDRADO","ADELONDRADO","ADELONDRADO","ADELONDRADO","ADELONDRADO","ADELONDRADO","ADELONDRADO","ADELONDRADO","ADELONDRADO","ADELONDRADO","ADELONDRADO","ADELONDRADO","ADELONDRADO","ADELONDRADO","ADELONDRADO","ADELONDRADO","ADELONDRADO","ADELONDRADO","ADELONDRADO","ADELONDRADO","ADELONDRADO","ADELONDRADO","ADELONDRADO","ADELONDRADO","ADELONDRADO","ADELONDRADO","ADELONDRADO","ADELONDRADO","ADELONDRADO","ADELONDRADO","ADELONDRADO","ADELONDRADO","ADELONDRADO","ADELONDRADO","ADELONDRADO","ADELONDRADO","ADELONDRADO","ADELONDRADO","ADELONDRADO","ADELONDRADO","ADELONDRADO","ADELONDRADO","ADELONDRADO","ADELONDRADO","ADELONDRADO","ADELONDRADO","ADELONDRADO","ADELONDRADO","ADELONDRADO","ADELONDRADO","ADELONDRADO","ADELONDRADO","ADELONDRADO","ADELONDRADO","ADELONDRADO","ADELONDRADO","ADELONDRADO","ADELONDRADO","ADELONDRADO","ADELONDRADO","ADELONDRADO","ADELONDRADO","ADELONDRADO","ADELONDRADO","ADELONDRADO","ADELONDRADO","ADELONDRADO","ADELONDRADO","ADELONDRADO","ADELONDRADO","ADELONDRADO","ADELONDRADO","ADELONDRADO","ADELONDRADO","ADELONDRADO","ADELONDRADO","ADELONDRADO","ADELONDRADO","ADELONDRADO","ADELONDRADO","ADELONDRADO","ADELONDRADO","ADELONDRADO","ADELONDRADO","ADELONDRADO","ADELONDRADO","ADELONDRADO","ADELONDRADO","ADELONDRADO","ADELONDRADO","ADELONDRADO","ADELONDRADO","ADELONDRADO","ADELONDRADO","ADELONDRADO","ADELONDRADO","ADELONDRADO","ADELONDRADO","ADELONDRADO","ADELONDRADO","ADELONDRADO","ADELONDRADO","ADELONDRADO","ADELONDRADO","ADELONDRADO","ADELONDRADO","ADELONDRADO","ADELONDRADO","ADELONDRADO","ADELONDRADO","ADELONDRADO","ADELONDRADO","ADELONDRADO","ADELONDRADO","ADELONDRADO","ADELONDRADO","ADELONDRADO","ADELONDRADO","ADELONDRADO","ADELONDRADO","ADELONDRADO","ADELONDRADO","ADELONDRADO","ADELONDRADO","ADELONDRADO","ADELONDRADO","ADELONDRADO","ADELONDRADO","ADELONDRADO","ADELONDRADO","ADELONDRADO","ADELONDRADO","ADELONDRADO","ADELONDRADO","ADELONDRADO","ADELONDRADO","ADELONDRADO","ADELONDRADO","ADELONDRADO","ADELONDRADO","ADELONDRADO","ADELONDRADO","ADELONDRADO","ADELONDRADO","ADELONDRADO","ADELONDRADO","ADELONDRADO","ADELONDRADO","ADELONDRADO","ADELONDRADO","ADELONDRADO","ADELONDRADO","ADELONDRADO","ADELONDRADO","ADELONDRADO","ADELONDRADO","ADELONDRADO","ADELONDRADO","ADELONDRADO","ADELONDRADO","ADELONDRADO","ADELONDRADO","ADELONDRADO","ADELONDRADO","ADELONDRADO","ADELONDRADO","ADELONDRADO","ADELONDRADO","ADELONDRADO","ADELONDRADO","ADELONDRADO","ADELONDRADO","ADELONDRADO","ADELONDRADO","ADELONDRADO","ADELONDRADO","ADELONDRADO","ADELONDRADO","ADELONDRADO","ADELONDRADO","ADELONDRADO","ADELONDRADO","ADELONDRADO","ADELONDRADO","ADELONDRADO","ADELONDRADO","ADELONDRADO","ADELONDRADO","ADELONDRADO","ADELONDRADO","ADELONDRADO","ADELONDRADO","ADELONDRADO","ADELONDRADO","ADELONDRADO","ADELONDRADO","ADELONDRADO","ADELONDRADO","ADELONDRADO","ADELONDRADO","ADELONDRADO","ADELONDRADO","ADELONDRADO","ADELONDRADO","ADELONDRADO","ADELONDRADO","ADELONDRADO","ADELONDRADO","ADELONDRADO","ADELONDRADO","ADELONDRADO","ADELONDRADO","ADELONDRADO","ADELONDRADO","ADELONDRADO","ADELONDRADO","ADELONDRADO","ADELONDRADO","ADELONDRADO","ADELONDRADO","ADELONDRADO","ADELONDRADO","ADELONDRADO","ADELONDRADO","ADELONDRADO","ADELONDRADO","ADELONDRADO","ADELONDRADO","ADELONDRADO","ADELONDRADO","ADELONDRADO","ADELONDRADO","ADELONDRADO","ADELONDRADO","ADELONDRADO","ADELONDRADO","ADELONDRADO","ADELONDRADO","ADELONDRADO","ADELONDRADO","ADELONDRADO","ADELONDRADO","ADELONDRADO","ADELONDRADO","ADELONDRADO","ADELONDRADO","ADELONDRADO","ADELONDRADO","ADELONDRADO","ADELONDRADO","ADELONDRADO","ADELONDRADO","ADELONDRADO","ADELONDRADO","ADELONDRADO","ADELONDRADO","ADELONDRADO","ADELONDRADO","ADELONDRADO","ADELONDRADO","ADELONDRADO","ADELONDRADO","ADELONDRADO","ADELONDRADO","ADELONDRADO","ADELONDRADO","ADELONDRADO","ADELONDRADO","ADELONDRADO","ADELONDRADO","ADELONDRADO","ADELONDRADO","ADELONDRADO","ADELONDRADO","ADELONDRADO","ADELONDRADO","ADELONDRADO","ADELONDRADO","ADELONDRADO","ADELONDRADO","ADELONDRADO","ADELONDRADO","ADELONDRADO","ADELONDRADO","ADELONDRADO","ADELONDRADO","ADELONDRADO","ADELONDRADO","ADELONDRADO","ADELONDRADO","ADELONDRADO","ADELONDRADO","ADELONDRADO","ADELONDRADO","ADELONDRADO","ADELONDRADO","ADELONDRADO","ADELONDRADO","ADELONDRADO","ADELONDRADO","ADELONDRADO","ADELONDRADO","ADELONDRADO","ADELONDRADO","ADELONDRADO","ADELONDRADO","ADELONDRADO","ADELONDRADO","ADELONDRADO","ADELONDRADO","ADELONDRADO","ADELONDRADO","ADELONDRADO","ADELONDRADO","ADELONDRADO","ADELONDRADO","ADELONDRADO","ADELONDRADO","ADELONDRADO","ADELONDRADO","ADELONDRADO","ADELONDRADO","ADELONDRADO","ADELONDRADO","ADELONDRADO","ADELONDRADO","ADELONDRADO","ADELONDRADO","ADELONDRADO","ADELONDRADO","ADELONDRADO","ADELONDRADO","ADELONDRADO","ADELONDRADO","ADELONDRADO","ADELONDRADO","ADELONDRADO","ADELONDRADO","ADELONDRADO","ADELONDRADO","ADELONDRADO","ADELONDRADO","ADELONDRADO","ADELONDRADO","ADELONDRADO","ADELONDRADO","ADELONDRADO","ADELONDRADO","ADELONDRADO","ADELONDRADO","ADELONDRADO","ADELONDRADO","ADELONDRADO","ADELONDRADO","ADELONDRADO","ADELONDRADO","ADELONDRADO","ADELONDRADO","ADELONDRADO","ADELONDRADO","ADELONDRADO","ADELONDRADO","ADELONDRADO","ADELONDRADO","ADELONDRADO","ADELONDRADO","ADELONDRADO","ADELONDRADO","ADELONDRADO","ADELONDRADO","ADELONDRADO","ADELONDRADO","ADELONDRADO","ADELONDRADO","ADELONDRADO","ADELONDRADO","ADELONDRADO","ADELONDRADO","ADELONDRADO","ADELONDRADO","ADELONDRADO","ADELONDRADO","ADELONDRADO","ADELONDRADO","ADELONDRADO","ADELONDRADO","ADELONDRADO","ADELONDRADO","ADELONDRADO","ADELONDRADO","ADELONDRADO","ADELONDRADO","ADELONDRADO","ADELONDRADO","ADELONDRADO","ADELONDRADO","ADELONDRADO","ADELONDRADO","ADELONDRADO","ADELONDRADO","ADELONDRADO","ADELONDRADO","ADELONDRADO","ADELONDRADO","ADELONDRADO","ADELONDRADO","ADELONDRADO","ADELONDRADO","ADELONDRADO","ADELONDRADO","ADELONDRADO","ADELONDRADO","ADELONDRADO","ADELONDRADO","ADELONDRADO","ADELONDRADO","ADELONDRADO","ADELONDRADO","ADELONDRADO","ADELONDRADO","ADELONDRADO","ADELONDRADO","ADELONDRADO","ADELONDRADO","ADELONDRADO","ADELONDRADO","ADELONDRADO","ADELONDRADO","ADELONDRADO","ADELONDRADO","ADELONDRADO","ADELONDRADO","ADELONDRADO","ADELONDRADO","ADELONDRADO","ADELONDRADO","ADELONDRADO","ADELONDRADO","ADELONDRADO","ADELONDRADO","ADELONDRADO","ADELONDRADO","ADELONDRADO","ADELONDRADO","ADELONDRADO","ADELONDRADO","ADELONDRADO","ADELONDRADO","ADELONDRADO","ADELONDRADO","ADELONDRADO","ADELONDRADO","ADELONDRADO","ADELONDRADO","ADELONDRADO","ADELONDRADO","ADELONDRADO","ADELONDRADO","ADELONDRADO","ADELONDRADO","ADELONDRADO","ADELONDRADO","ADELONDRADO","ADELONDRADO","ADELONDRADO","ADELONDRADO","ADELONDRADO","ADELONDRADO","ADELONDRADO","ADELONDRADO","ADELONDRADO","ADELONDRADO","ADELONDRADO","ADELONDRADO","ADELONDRADO","ADELONDRADO","ADELONDRADO","ADELONDRADO","ADELONDRADO","ADELONDRADO","ADELONDRADO","ADELONDRADO","ADELONDRADO","ADELONDRADO","ADELONDRADO","ADELONDRADO","ADELONDRADO","ADELONDRADO","ADELONDRADO","ADELONDRADO","ADELONDRADO","ADELONDRADO","ADELONDRADO","ADELONDRADO","ADELONDRADO","ADELONDRADO","ADELONDRADO","ADELONDRADO","ADELONDRADO","ADELONDRADO","ADELONDRADO","ADELONDRADO","ADELONDRADO","ADELONDRADO","ADELONDRADO","ADELONDRADO","ADELONDRADO","ADELONDRADO","ADELONDRADO","ADELONDRADO","ADELONDRADO","ADELONDRADO","ADELONDRADO","ADELONDRADO","ADELONDRADO","ADELONDRADO","ADELONDRADO","ADELONDRADO","ADELONDRADO","ADELONDRADO","ADELONDRADO","ADELONDRADO","ADELONDRADO","ADELONDRADO","ADELONDRADO","ADELONDRADO","ADELONDRADO","ADELONDRADO","ADELONDRADO","ADELONDRADO","ADELONDRADO","ADELONDRADO","ADELONDRADO","ADELONDRADO","ADELONDRADO","ADELONDRADO","ADELONDRADO","ADELONDRADO","ADELONDRADO","ADELONDRADO","ADELONDRADO","ADELONDRADO","ADELONDRADO","ADELONDRADO","ADELONDRADO","ADELONDRADO","ADELONDRADO","ADELONDRADO","ADELONDRADO","ADELONDRADO","ADELONDRADO","ADELONDRADO","ADELONDRADO","ADELONDRADO","ADELONDRADO","ADELONDRADO","ADELONDRADO","ADELONDRADO","ADELONDRADO","ADELONDRADO","ADELONDRADO","ADELONDRADO","ADELONDRADO","ADELONDRADO","ADELONDRADO","ADELONDRADO","ADELONDRADO","ADELONDRADO","ADELONDRADO","ADELONDRADO","ADELONDRADO","ADELONDRADO","ADELONDRADO","ADELONDRADO","ADELONDRADO","ADELONDRADO","ADELONDRADO","ADELONDRADO","ADELONDRADO","ADELONDRADO","ADELONDRADO","ADELONDRADO","ADELONDRADO","ADELONDRADO","ADELONDRADO","ADELONDRADO","ADELONDRADO","ADELONDRADO","ADELONDRADO","ADELONDRADO","ADELONDRADO","ADELONDRADO","ADELONDRADO","ADELONDRADO","ADELONDRADO","ADELONDRADO","ADELONDRADO","ADELONDRADO","ADELONDRADO","ADELONDRADO","ADELONDRADO","ADELONDRADO","ADELONDRADO","ADELONDRADO","ADELONDRADO","ADELONDRADO","ADELONDRADO","ADELONDRADO","ADELONDRADO","ADELONDRADO","ADELONDRADO","ADELONDRADO","ADELONDRADO","ADELONDRADO","ADELONDRADO","ADELONDRADO","ADELONDRADO","ADELONDRADO","ADELONDRADO","ADELONDRADO","ADELONDRADO","ADELONDRADO","ADELONDRADO","ADELONDRADO","ADELONDRADO","ADELONDRADO","ADELONDRADO","ADELONDRADO","ADELONDRADO","ADELONDRADO","ADELONDRADO","ADELONDRADO","ADELONDRADO","ADELONDRADO","ADELONDRADO","ADELONDRADO","ADELONDRADO","ADELONDRADO","ADELONDRADO","ADELONDRADO","ADELONDRADO","ADELONDRADO","ADELONDRADO","ADELONDRADO","ADELONDRADO","ADELONDRADO","ADELONDRADO","ADELONDRADO","ADELONDRADO","ADELONDRADO","ADELONDRADO","ADELONDRADO","ADELONDRADO","ADELONDRADO","ADELONDRADO","ADELONDRADO","ADELONDRADO","ADELONDRADO","ADELONDRADO","ADELONDRADO","ADELONDRADO","ADELONDRADO","ADELONDRADO","ADELONDRADO","ADELONDRADO","ADELONDRADO","ADELONDRADO","ADELONDRADO","ADELONDRADO","ADELONDRADO","ADELONDRADO","ADELONDRADO","ADELONDRADO","ADELONDRADO","ADELONDRADO","ADELONDRADO","ADELONDRADO","ADELONDRADO","ADELONDRADO","ADELONDRADO","ADELONDRADO","ADELONDRADO","ADELONDRADO","ADELONDRADO","ADELONDRADO","ADELONDRADO","ADELONDRADO","ADELONDRADO","ADELONDRADO","ADELONDRADO","ADELONDRADO","ADELONDRADO","ADELONDRADO","ADELONDRADO","ADELONDRADO","ADELONDRADO","ADELONDRADO","ADELONDRADO","ADELONDRADO","ADELONDRADO","ADELONDRADO","ADELONDRADO","ADELONDRADO","ADELONDRADO","ADELONDRADO","ADELONDRADO","ADELONDRADO","ADELONDRADO","ADELONDRADO","ADELONDRADO","ADELONDRADO","ADELONDRADO","ADELONDRADO","ADELONDRADO","ADELONDRADO","ADELONDRADO","ADELONDRADO","ADELONDRADO","ADELONDRADO","ADELONDRADO","ADELONDRADO","ADELONDRADO","ADELONDRADO","ADELONDRADO","ADELONDRADO","ADELONDRADO","ADELONDRADO","ADELONDRADO","ADELONDRADO","ADELONDRADO","ADELONDRADO","ADELONDRADO","ADELONDRADO","ADELONDRADO","ADELONDRADO","ADELONDRADO","ADELONDRADO","ADELONDRADO","ADELONDRADO","ADELONDRADO","ADELONDRADO","ADELONDRADO","ADELONDRADO","ADELONDRADO","ADELONDRADO","ADELONDRADO","ADELONDRADO","ADELONDRADO","ADELONDRADO","ADELONDRADO","ADELONDRADO","ADELONDRADO","ADELONDRADO","ADELONDRADO","ADELONDRADO","ADELONDRADO","ADELONDRADO","ADELONDRADO","ADELONDRADO","ADELONDRADO","ADELONDRADO","ADELONDRADO","ADELONDRADO","ADELONDRADO","ADELONDRADO","ADELONDRADO","ADELONDRADO","ADELONDRADO","ADELONDRADO","ADELONDRADO","ADELONDRADO","ADELONDRADO","ADELONDRADO","ADELONDRADO","ADELONDRADO","ADELONDRADO","ADELONDRADO","ADELONDRADO","ADELONDRADO","ADELONDRADO","ADELONDRADO","ADELONDRADO","ADELONDRADO","ADELONDRADO","ADELONDRADO","ADELONDRADO","ADELONDRADO","ADELONDRADO","ADELONDRADO","ADELONDRADO","ADELONDRADO","ADELONDRADO","ADELONDRADO","ADELONDRADO","ADELONDRADO","ADELONDRADO","ADELONDRADO","ADELONDRADO","ADELONDRADO","ADELONDRADO","ADELONDRADO","ADELONDRADO","ADELONDRADO","ADELONDRADO","ADELONDRADO","ADELONDRADO","ADELONDRADO","ADELONDRADO","ADELONDRADO","ADELONDRADO","ADELONDRADO","ADELONDRADO","ADELONDRADO","ADELONDRADO","ADELONDRADO","ADELONDRADO","ADELONDRADO","ADELONDRADO","ADELONDRADO","ADELONDRADO","ADELONDRADO","ADELONDRADO","ADELONDRADO","ADELONDRADO","ADELONDRADO","ADELONDRADO","ADELONDRADO","ADELONDRADO","ADELONDRADO","ADELONDRADO","ADELONDRADO","ADELONDRADO","ADELONDRADO","ADELONDRADO","ADELONDRADO","ADELONDRADO","ADELONDRADO","ADELONDRADO","ADELONDRADO","ADELONDRADO","ADELONDRADO","ADELONDRADO","ADELONDRADO","ADELONDRADO","ADELONDRADO","ADELONDRADO","ADELONDRADO","ADELONDRADO","ADELONDRADO","ADELONDRADO","ADELONDRADO","ADELONDRADO","ADELONDRADO","ADELONDRADO","ADELONDRADO","ADELONDRADO","ADELONDRADO","ADELONDRADO","ADELONDRADO","ADELONDRADO","ADELONDRADO","ADELONDRADO","ADELONDRADO","ADELONDRADO","ADELONDRADO","ADELONDRADO","ADELONDRADO","ADELONDRADO","ADELONDRADO","ADELONDRADO","ADELONDRADO","ADELONDRADO","ADELONDRADO","ADELONDRADO","ADELONDRADO","ADELONDRADO","ADELONDRADO","ADELONDRADO","ADELONDRADO","ADELONDRADO","ADELONDRADO","ADELONDRADO","ADELONDRADO","ADELONDRADO","ADELONDRADO","ADELONDRADO","ADELONDRADO","ADELONDRADO","ADELONDRADO","ADELONDRADO","ADELONDRADO","ADELONDRADO","ADELONDRADO","ADELONDRADO","ADELONDRADO","ADELONDRADO","ADELONDRADO","ADELONDRADO","ADELONDRADO","ADELONDRADO","ADELONDRADO","ADELONDRADO","ADELONDRADO","ADELONDRADO","ADELONDRADO","ADELONDRADO","ADELONDRADO","ADELONDRADO","ADELONDRADO","ADELONDRADO","ADELONDRADO","ADELONDRADO","ADELONDRADO","ADELONDRADO","ADELONDRADO","ADELONDRADO","ADELONDRADO","ADELONDRADO","ADELONDRADO","ADELONDRADO","ADELONDRADO","ADELONDRADO","ADELONDRADO","ADELONDRADO","ADELONDRADO","ADELONDRADO","ADELONDRADO","ADELONDRADO","ADELONDRADO","ADELONDRADO","ADELONDRADO","ADELONDRADO","ADELONDRADO","ADELONDRADO","ADELONDRADO","ADELONDRADO","ADELONDRADO","ADELONDRADO","ADELONDRADO","ADELONDRADO","ADELONDRADO","ADELONDRADO","ADELONDRADO","ADELONDRADO","ADELONDRADO","ADELONDRADO","ADELONDRADO","ADELONDRADO","ADELONDRADO","ADELONDRADO","ADELONDRADO","ADELONDRADO","ADELONDRADO","ADELONDRADO","ADELONDRADO","ADELONDRADO","ADELONDRADO","ADELONDRADO","ADELONDRADO","ADELONDRADO","ADELONDRADO","ADELONDRADO","ADELONDRADO","ADELONDRADO","ADELONDRADO","ADELONDRADO","ADELONDRADO","ADELONDRADO","ADELONDRADO","ADELONDRADO","ADELONDRADO","ADELONDRADO","ADELONDRADO","ADELONDRADO","ADELONDRADO","ADELONDRADO","ADELONDRADO","ADELONDRADO","ADELONDRADO","ADELONDRADO","ADELONDRADO","ADELONDRADO","ADELONDRADO","ADELONDRADO","ADELONDRADO","ADELONDRADO","ADELONDRADO","ADELONDRADO","ADELONDRADO","ADELONDRADO","ADELONDRADO","ADELONDRADO","ADELONDRADO","ADELONDRADO","ADELONDRADO","ADELONDRADO","ADELONDRADO","ADELONDRADO","ADELONDRADO","ADELONDRADO","ADELONDRADO","ADELONDRADO","ADELONDRADO","ADELONDRADO","ADELONDRADO","ADELONDRADO","ADELONDRADO","ADELONDRADO","ADELONDRADO","ADELONDRADO","ADELONDRADO","ADELONDRADO","ADELONDRADO","ADELONDRADO","ADELONDRADO","ADELONDRADO","ADELONDRADO","ADELONDRADO","ADELONDRADO","ADELONDRADO","ADELONDRADO","ADELONDRADO","ADELONDRADO","ADELONDRADO","ADELONDRADO","ADELONDRADO","ADELONDRADO","ADELONDRADO","ADELONDRADO","ADELONDRADO","ADELONDRADO","ADELONDRADO","ADELONDRADO","ADELONDRADO","ADELONDRADO","ADELONDRADO","ADELONDRADO","ADELONDRADO","ADELONDRADO","ADELONDRADO","ADELONDRADO","ADELONDRADO","ADELONDRADO","ADELONDRADO","ADELONDRADO","ADELONDRADO","ADELONDRADO","ADELONDRADO","ADELONDRADO","ADELONDRADO","ADELONDRADO","ADELONDRADO","ADELONDRADO","ADELONDRADO","ADELONDRADO","ADELONDRADO","ADELONDRADO","ADELONDRADO","ADELONDRADO","ADELONDRADO","ADELONDRADO","ADELONDRADO","ADELONDRADO","ADELONDRADO","ADELONDRADO","ADELONDRADO","ADELONDRADO","ADELONDRADO","ADELONDRADO","ADELONDRADO","ADELONDRADO","ADELONDRADO","ADELONDRADO","ADELONDRADO","ADELONDRADO","ADELONDRADO","ADELONDRADO","ADELONDRADO","ADELONDRADO","ADELONDRADO","ADELONDRADO","ADELONDRADO","ADELONDRADO","ADELONDRADO","ADELONDRADO","ADELONDRADO","ADELONDRADO","ADELONDRADO","ADELONDRADO","ADELONDRADO","ADELONDRADO","ADELONDRADO","ADELONDRADO","ADELONDRADO","ADELONDRADO","ADELONDRADO","ADELONDRADO","ADELONDRADO","ADELONDRADO","ADELONDRADO","ADELONDRADO","ADELONDRADO","ADELONDRADO","ADELONDRADO","ADELONDRADO","ADELONDRADO","ADELONDRADO","ADELONDRADO","ADELONDRADO","ADELONDRADO","ADELONDRADO","ADELONDRADO","ADELONDRADO","ADELONDRADO","ADELONDRADO","ADELONDRADO","ADELONDRADO","ADELONDRADO","ADELONDRADO","ADELONDRADO","ADELONDRADO","ADELONDRADO","ADELONDRADO","ADELONDRADO","ADELONDRADO","ADELONDRADO","ADELONDRADO","ADELONDRADO","ADELONDRADO","ADELONDRADO","ADELONDRADO","ADELONDRADO","ADELONDRADO","ADELONDRADO","ADELONDRADO","ADELONDRADO","ADELONDRADO","ADELONDRADO","ADELONDRADO","ADELONDRADO","ADELONDRADO","ADELONDRADO","ADELONDRADO","ADELONDRADO","ADELONDRADO","ADELONDRADO","ADELONDRADO","ADELONDRADO","ADELONDRADO","ADELONDRADO","ADELONDRADO","ADELONDRADO","ADELONDRADO","ADELONDRADO","ADELONDRADO","ADELONDRADO","ADELONDRADO","ADELONDRADO","ADELONDRADO","ADELONDRADO","ADELONDRADO","ADELONDRADO","ADELONDRADO","ADELONDRADO","ADELONDRADO","ADELONDRADO","ADELONDRADO","ADELONDRADO","ADELONDRADO","ADELONDRADO","ADELONDRADO","ADELONDRADO","ADELONDRADO","ADELONDRADO","ADELONDRADO","ADELONDRADO","ADELONDRADO","ADELONDRADO","ADELONDRADO","ADELONDRADO","ADELONDRADO","ADELONDRADO","ADELONDRADO","ADELONDRADO","ADELONDRADO","ADELONDRADO","ADELONDRADO","ADELONDRADO","ADELONDRADO","ADELONDRADO","ADELONDRADO","ADELONDRADO","ADELONDRADO","ADELONDRADO","ADELONDRADO","ADELONDRADO","ADELONDRADO","ADELONDRADO","ADELONDRADO","ADELONDRADO","ADELONDRADO","ADELONDRADO","ADELONDRADO","ADELONDRADO","ADELONDRADO","ADELONDRADO","ADELONDRADO","ADELONDRADO","ADELONDRADO","ADELONDRADO","ADELONDRADO","ADELONDRADO","ADELONDRADO","ADELONDRADO","ADELONDRADO","ADELONDRADO","ADELONDRADO","ADELONDRADO","ADELONDRADO","ADELONDRADO","ADELONDRADO","ADELONDRADO","ADELONDRADO","ADELONDRADO","ADELONDRADO","ADELONDRADO","ADELONDRADO","ADELONDRADO","ADELONDRADO","ADELONDRADO","ADELONDRADO","ADELONDRADO","ADELONDRADO","ADELONDRADO","ADELONDRADO","ADELONDRADO","ADELONDRADO","ADELONDRADO","ADELONDRADO","ADELONDRADO","ADELONDRADO","ADELONDRADO","ADELONDRADO","ADELONDRADO","ADELONDRADO","ADELONDRADO","ADELONDRADO","ADELONDRADO","ADELONDRADO","ADELONDRADO","ADELONDRADO","ADELONDRADO","ADELONDRADO","ADELONDRADO","ADELONDRADO","ADELONDRADO","ADELONDRADO","ADELONDRADO","ADELONDRADO","ADELONDRADO","ADELONDRADO","ADELONDRADO","ADELONDRADO","ADELONDRADO","ADELONDRADO","ADELONDRADO","ADELONDRADO","ADELONDRADO","ADELONDRADO","ADELONDRADO","ADELONDRADO","ADELONDRADO","ADELONDRADO","ADELONDRADO","ADELONDRADO","ADELONDRADO","ADELONDRADO","ADELONDRADO","ADELONDRADO","ADELONDRADO","ADELONDRADO","ADELONDRADO","ADELONDRADO","ADELONDRADO","ADELONDRADO","ADELONDRADO","ADELONDRADO","ADELONDRADO","ADELONDRADO","ADELONDRADO","ADELONDRADO","ADELONDRADO","ADELONDRADO","ADELONDRADO","ADELONDRADO","ADELONDRADO","ADELONDRADO","ADELONDRADO","ADELONDRADO","ADELONDRADO","ADELONDRADO","ADELONDRADO","ADELONDRADO","ADELONDRADO","ADELONDRADO","ADELONDRADO","ADELONDRADO","ADELONDRADO","ADELONDRADO","ADELONDRADO","ADELONDRADO","ADELONDRADO","ADELONDRADO","ADELONDRADO","ADELONDRADO","ADELONDRADO","ADELONDRADO","ADELONDRADO","ADELONDRADO","ADELONDRADO","ADELONDRADO","ADELONDRADO","ADELONDRADO","ADELONDRADO","ADELONDRADO","ADELONDRADO","ADELONDRADO","ADELONDRADO","ADELONDRADO","ADELONDRADO","ADELONDRADO","ADELONDRADO","ADELONDRADO","ADELONDRADO","ADELONDRADO","ADELONDRADO","ADELONDRADO","ADELONDRADO","ADELONDRADO","ADELONDRADO","ADELONDRADO","ADELONDRADO","ADELONDRADO","ADELONDRADO","ADELONDRADO","ADELONDRADO","ADELONDRADO","ADELONDRADO","ADELONDRADO","ADELONDRADO","ADELONDRADO","ADELONDRADO","ADELONDRADO","ADELONDRADO","ADELONDRADO","ADELONDRADO","ADELONDRADO","ADELONDRADO","ADELONDRADO","ADELONDRADO","ADELONDRADO","ADELONDRADO","ADELONDRADO","ADELONDRADO","ADELONDRADO","ADELONDRADO","ADELONDRADO","ADELONDRADO","ADELONDRADO","ADELONDRADO","ADELONDRADO","ADELONDRADO","ADELONDRADO","ADELONDRADO","ADELONDRADO","ADELONDRADO","ADELONDRADO","ADELONDRADO","ADELONDRADO","ADELONDRADO","ADELONDRADO","ADELONDRADO","ADELONDRADO","ADELONDRADO","ADELONDRADO","ADELONDRADO","ADELONDRADO","ADELONDRADO","ADELONDRADO","ADELONDRADO","ADELONDRADO","ADELONDRADO","ADELONDRADO","ADELONDRADO","ADELONDRADO","ADELONDRADO","ADELONDRADO","ADELONDRADO","ADELONDRADO","ADELONDRADO","ADELONDRADO","ADELONDRADO","ADELONDRADO","ADELONDRADO","ADELONDRADO","ADELONDRADO","ADELONDRADO","ADELONDRADO","ADELONDRADO","ADELONDRADO","ADELONDRADO","ADELONDRADO","ADELONDRADO","ADELONDRADO","ADELONDRADO","ADELONDRADO","ADELONDRADO","ADELONDRADO","ADELONDRADO","ADELONDRADO","ADELONDRADO","ADELONDRADO","ADELONDRADO","ADELONDRADO","ADELONDRADO","ADELONDRADO","ADELONDRADO","ADELONDRADO","ADELONDRADO","ADELONDRADO","ADELONDRADO","ADELONDRADO","ADELONDRADO","ADELONDRADO","ADELONDRADO","ADELONDRADO","ADELONDRADO","ADELONDRADO","ADELONDRADO","ADELONDRADO","ADELONDRADO","ADELONDRADO","ADELONDRADO","ADELONDRADO","ADELONDRADO","ADELONDRADO","ADELONDRADO","ADELONDRADO","ADELONDRADO","ADELONDRADO","ADELONDRADO","ADELONDRADO","ADELONDRADO","ADELONDRADO","ADELONDRADO","ADELONDRADO","ADELONDRADO","ADELONDRADO","ADELONDRADO","ADELONDRADO","ADELONDRADO","ADELONDRADO","ADELONDRADO","ADELONDRADO","ADELONDRADO","ADELONDRADO","ADELONDRADO","ADELONDRADO","ADELONDRADO","ADELONDRADO","ADELONDRADO","ADELONDRADO","ADELONDRADO","ADELONDRADO","ADELONDRADO","ADELONDRADO","ADELONDRADO","ADELONDRADO","ADELONDRADO","ADELONDRADO","ADELONDRADO","ADELONDRADO","ADELONDRADO","ADELONDRADO","ADELONDRADO","ADELONDRADO","ADELONDRADO","ADELONDRADO","ADELONDRADO","ADELONDRADO","ADELONDRADO","ADELONDRADO","ADELONDRADO","ADELONDRADO","ADELONDRADO","ADELONDRADO","ADELONDRADO","ADELONDRADO","ADELONDRADO","ADELONDRADO","ADELONDRADO","ADELONDRADO","ADELONDRADO","ADELONDRADO","ADELONDRADO","ADELONDRADO","ADELONDRADO","ADELONDRADO","ADELONDRADO","ADELONDRADO","ADELONDRADO","ADELONDRADO","ADELONDRADO","ADELONDRADO","ADELONDRADO","ADELONDRADO","ADELONDRADO","ADELONDRADO","ADELONDRADO","ADELONDRADO","ADELONDRADO","ADELONDRADO","ADELONDRADO","ADELONDRADO","ADELONDRADO","ADELONDRADO","ADELONDRADO","ADELONDRADO","ADELONDRADO","ADELONDRADO","ADELONDRADO","ADELONDRADO","ADELONDRADO","ADELONDRADO","ADELONDRADO","ADELONDRADO","ADELONDRADO","ADELONDRADO","ADELONDRADO","ADELONDRADO","ADELONDRADO","ADELONDRADO","ADELONDRADO","ADELONDRADO","ADELONDRADO","ADELONDRADO","ADELONDRADO","ADELONDRADO","ADELONDRADO","ADELONDRADO","ADELONDRADO","ADELONDRADO","ADELONDRADO","ADELONDRADO","ADELONDRADO","ADELONDRADO","ADELONDRADO","ADELONDRADO","ADELONDRADO","ADELONDRADO","ADELONDRADO","ADELONDRADO","ADELONDRADO","ADELONDRADO","ADELONDRADO","ADELONDRADO","ADELONDRADO","ADELONDRADO","ADELONDRADO","ADELONDRADO","ADELONDRADO","ADELONDRADO","ADELONDRADO","ADELONDRADO","ADELONDRADO","ADELONDRADO","ADELONDRADO","ADELONDRADO","ADELONDRADO","ADELONDRADO","ADELONDRADO","ADELONDRADO","ADELONDRADO","ADELONDRADO","ADELONDRADO","ADELONDRADO","ADELONDRADO","ADELONDRADO","ADELONDRADO","ADELONDRADO","ADELONDRADO","ADELONDRADO","ADELONDRADO","ADELONDRADO","ADELONDRADO","ADELONDRADO","ADELONDRADO","ADELONDRADO","ADELONDRADO","ADELONDRADO","ADELONDRADO","ADELONDRADO","ADELONDRADO","ADELONDRADO","ADELONDRADO","ADELONDRADO","ADELONDRADO","ADELONDRADO","ADELONDRADO","ADELONDRADO","ADELONDRADO","ADELONDRADO","ADELONDRADO","ADELONDRADO","ADELONDRADO","ADELONDRADO","ADELONDRADO","ADELONDRADO","ADELONDRADO","ADELONDRADO","ADELONDRADO","ADELONDRADO","ADELONDRADO","ADELONDRADO","ADELONDRADO","ADELONDRADO","ADELONDRADO","ADELONDRADO","ADELONDRADO","ADELONDRADO","ADELONDRADO","ADELONDRADO","ADELONDRADO","ADELONDRADO","ADELONDRADO","ADELONDRADO","ADELONDRADO","ADELONDRADO","ADELONDRADO","ADELONDRADO","ADELONDRADO","ADELONDRADO","ADELONDRADO","ADELONDRADO","ADELONDRADO","ADELONDRADO","ADELONDRADO","ADELONDRADO","ADELONDRADO","ADELONDRADO","ADELONDRADO","ADELONDRADO","ADELONDRADO","ADELONDRADO","ADELONDRADO","ADELONDRADO","ADELONDRADO","ADELONDRADO","ADELONDRADO","ADELONDRADO","ADELONDRADO","ADELONDRADO","ADELONDRADO","ADELONDRADO","ADELONDRADO","ADELONDRADO","ADELONDRADO","ADELONDRADO","ADELONDRADO","ADELONDRADO","ADELONDRADO","ADELONDRADO","ADELONDRADO","ADELONDRADO","ADELONDRADO","ADELONDRADO","ADELONDRADO","ADELONDRADO","ADELONDRADO","ADELONDRADO","ADELONDRADO","ADELONDRADO","ADELONDRADO","ADELONDRADO","ADELONDRADO","ADELONDRADO","ADELONDRADO","ADELONDRADO","ADELONDRADO","ADELONDRADO","ADELONDRADO","ADELONDRADO","ADELONDRADO","ADELONDRADO","ADELONDRADO","ADELONDRADO","ADELONDRADO","ADELONDRADO","ADELONDRADO","ADELONDRADO","ADELONDRADO","ADELONDRADO","ADELONDRADO","ADELONDRADO","ADELONDRADO","ADELONDRADO","ADELONDRADO","ADELONDRADO","ADELONDRADO","ADELONDRADO","ADELONDRADO","ADELONDRADO","ADELONDRADO","ADELONDRADO","ADELONDRADO","ADELONDRADO","ADELONDRADO","ADELONDRADO","ADELONDRADO","ADELONDRADO","ADELONDRADO","ADELONDRADO","ADELONDRADO","ADELONDRADO","ADELONDRADO","ADELONDRADO","ADELONDRADO","ADELONDRADO","ADELONDRADO","ADELONDRADO","ADELONDRADO","ADELONDRADO","ADELONDRADO","ADELONDRADO","ADELONDRADO","ADELONDRADO","ADELONDRADO","ADELONDRADO","ADELONDRADO","ADELONDRADO","ADELONDRADO","ADELONDRADO","ADELONDRADO","ADELONDRADO","ADELONDRADO","ADELONDRADO","ADELONDRADO","ADELONDRADO","ADELONDRADO","ADELONDRADO","ADELONDRADO","ADELONDRADO","ADELONDRADO","ADELONDRADO","ADELONDRADO","ADELONDRADO","ADELONDRADO","ADELONDRADO","ADELONDRADO","ADELONDRADO","ADELONDRADO","ADELONDRADO","ADELONDRADO","ADELONDRADO","ADELONDRADO","ADELONDRADO","ADELONDRADO","ADELONDRADO","ADELONDRADO","ADELONDRADO","ADELONDRADO","ADELONDRADO","ADELONDRADO","ADELONDRADO","ADELONDRADO","ADELONDRADO","ADELONDRADO","ADELONDRADO","ADELONDRADO","ADELONDRADO","ADELONDRADO","ADELONDRADO","ADELONDRADO","ADELONDRADO","ADELONDRADO","ADELONDRADO","ADELONDRADO","ADELONDRADO","ADELONDRADO","ADELONDRADO","ADELONDRADO","ADELONDRADO","ADELONDRADO","ADELONDRADO","ADELONDRADO","ADELONDRADO","ADELONDRADO","ADELONDRADO","ADELONDRADO","ADELONDRADO","ADELONDRADO","ADELONDRADO","ADELONDRADO","ADELONDRADO","ADELONDRADO","ADELONDRADO","ADELONDRADO","ADELONDRADO","ADELONDRADO","ADELONDRADO","ADELONDRADO","ADELONDRADO","ADELONDRADO","ADELONDRADO","ADELONDRADO","ADELONDRADO","ADELONDRADO","ADELONDRADO","ADELONDRADO","ADELONDRADO","ADELONDRADO","ADELONDRADO","ADELONDRADO","ADELONDRADO","ADELONDRADO","ADELONDRADO","ADELONDRADO","ADELONDRADO","ADELONDRADO","ADELONDRADO","ADELONDRADO","ADELONDRADO","ADELONDRADO","ADELONDRADO","ADELONDRADO","ADELONDRADO","ADELONDRADO","ADELONDRADO","ADELONDRADO","ADELONDRADO","ADELONDRADO","ADELONDRADO","ADELONDRADO","ADELONDRADO","ADELONDRADO","ADELONDRADO","ADELONDRADO","ADELONDRADO","ADELONDRADO","ADELONDRADO","ADELONDRADO","ADELONDRADO","ADELONDRADO","ADELONDRADO","ADELONDRADO","ADELONDRADO","ADELONDRADO","ADELONDRADO","ADELONDRADO","ADELONDRADO","ADELONDRADO","ADELONDRADO","ADELONDRADO","ADELONDRADO","ADELONDRADO","ADELONDRADO","ADELONDRADO","ADELONDRADO","ADELONDRADO","ADELONDRADO","ADELONDRADO","ADELONDRADO","ADELONDRADO","ADELONDRADO","ADELONDRADO","ADELONDRADO","ADELONDRADO","ADELONDRADO","ADELONDRADO","ADELONDRADO","ADELONDRADO","ADELONDRADO","ADELONDRADO","ADELONDRADO","ADELONDRADO","ADELONDRADO","ADELONDRADO","ADELONDRADO","ADELONDRADO","ADELONDRADO","ADELONDRADO","ADELONDRADO","ADELONDRADO","ADELONDRADO","ADELONDRADO","ADELONDRADO","ADELONDRADO","ADELONDRADO","ADELONDRADO","ADELONDRADO","ADELONDRADO","ADELONDRADO","ADELONDRADO","ADELONDRADO","ADELONDRADO","ADELONDRADO","ADELONDRADO","ADELONDRADO","ADELONDRADO","ADELONDRADO","ADELONDRADO","ADELONDRADO","ADELONDRADO","ADELONDRADO","ADELONDRADO","ADELONDRADO","ADELONDRADO","ADELONDRADO","ADELONDRADO","ADELONDRADO","ADELONDRADO","ADELONDRADO","ADELONDRADO","ADELONDRADO","ADELONDRADO","ADELONDRADO","ADELONDRADO","ADELONDRADO","ADELONDRADO","ADELONDRADO","ADELONDRADO","ADELONDRADO","ADELONDRADO","ADELONDRADO","ADELONDRADO","ADELONDRADO","ADELONDRADO","ADELONDRADO","ADELONDRADO","ADELONDRADO","ADELONDRADO","ADELONDRADO","ADELONDRADO","ADELONDRADO","ADELONDRADO","ADELONDRADO","ADELONDRADO","ADELONDRADO","ADELONDRADO","ADELONDRADO","ADELONDRADO","ADELONDRADO","ADELONDRADO","ADELONDRADO","ADELONDRADO","ADELONDRADO","ADELONDRADO","ADELONDRADO","ADELONDRADO","ADELONDRADO","ADELONDRADO","ADELONDRADO","ADELONDRADO","ADELONDRADO","ADELONDRADO","ADELONDRADO","ADELONDRADO","ADELONDRADO","ADELONDRADO","ADELONDRADO","ADELONDRADO","ADELONDRADO","ADELONDRADO","ADELONDRADO","ADELONDRADO","ADELONDRADO","ADELONDRADO","ADELONDRADO","ADELONDRADO","ADELONDRADO","ADELONDRADO","ADELONDRADO","ADELONDRADO","ADELONDRADO","ADELONDRADO","ADELONDRADO","ADELONDRADO","ADELONDRADO","ADELONDRADO","ADELONDRADO","ADELONDRADO","ADELONDRADO","ADELONDRADO","ADELONDRADO","ADELONDRADO","ADELONDRADO","ADELONDRADO","ADELONDRADO","ADELONDRADO","ADELONDRADO","ADELONDRADO","ADELONDRADO","ADELONDRADO","ADELONDRADO","ADELONDRADO","ADELONDRADO","ADELONDRADO","ADELONDRADO","ADELONDRADO","ADELONDRADO","ADELONDRADO","ADELONDRADO","ADELONDRADO","ADELONDRADO","ADELONDRADO","ADELONDRADO","ADELONDRADO","ADELONDRADO","ADELONDRADO","ADELONDRADO","ADELONDRADO","ADELONDRADO","ADELONDRADO","ADELONDRADO","ADELONDRADO","ADELONDRADO","ADELONDRADO","ADELONDRADO","ADELONDRADO","ADELONDRADO","ADELONDRADO","ADELONDRADO","ADELONDRADO","ADELONDRADO","ADELONDRADO","ADELONDRADO","ADELONDRADO","ADELONDRADO","ADELONDRADO","ADELONDRADO","ADELONDRADO","ADELONDRADO","ADELONDRADO","ADELONDRADO","ADELONDRADO","ADELONDRADO","ADELONDRADO","ADELONDRADO","ADELONDRADO","ADELONDRADO","ADELONDRADO","ADELONDRADO","ADELONDRADO","ADELONDRADO","ADELONDRADO","ADELONDRADO","ADELONDRADO","ADELONDRADO","ADELONDRADO","ADELONDRADO","ADELONDRADO","ADELONDRADO","ADELONDRADO","ADELONDRADO","ADELONDRADO","ADELONDRADO","ADELONDRADO","ADELONDRADO","ADELONDRADO","ADELONDRADO","ADELONDRADO","ADELONDRADO","ADELONDRADO","ADELONDRADO","ADELONDRADO","ADELONDRADO","ADELONDRADO","ADELONDRADO","ADELONDRADO","ADELONDRADO","ADELONDRADO","ADELONDRADO","ADELONDRADO","ADELONDRADO","ADELONDRADO","ADELONDRADO","ADELONDRADO","ADELONDRADO","ADELONDRADO","ADELONDRADO","ADELONDRADO","ADELONDRADO","ADELONDRADO","ADELONDRADO","ADELONDRADO","ADELONDRADO","ADELONDRADO","ADELONDRADO","ADELONDRADO","ADELONDRADO","ADELONDRADO","ADELONDRADO","ADELONDRADO","ADELONDRADO","ADELONDRADO","ADELONDRADO","ADELONDRADO","ADELONDRADO","ADELONDRADO","ADELONDRADO","ADELONDRADO","ADELONDRADO","ADELONDRADO","ADELONDRADO","ADELONDRADO","ADELONDRADO","ADELONDRADO","ADELONDRADO","ADELONDRADO","ADELONDRADO","ADELONDRADO","ADELONDRADO","ADELONDRADO","ADELONDRADO","ADELONDRADO","ADELONDRADO","ADELONDRADO","ADELONDRADO","ADELONDRADO","ADELONDRADO","ADELONDRADO","ADELONDRADO","ADELONDRADO","ADELONDRADO","ADELONDRADO","ADELONDRADO","ADELONDRADO","ADELONDRADO","ADELONDRADO","ADELONDRADO","ADELONDRADO","ADELONDRADO","ADELONDRADO","ADELONDRADO","ADELONDRADO","ADELONDRADO","ADELONDRADO","ADELONDRADO","ADELONDRADO","ADELONDRADO","ADELONDRADO","ADELONDRADO","ADELONDRADO","ADELONDRADO","ADELONDRADO","ADELONDRADO","ADELONDRADO","ADELONDRADO","ADELONDRADO","ADELONDRADO","ADELONDRADO","ADELONDRADO","ADELONDRADO","ADELONDRADO","ADELONDRADO","ADELONDRADO","ADELONDRADO","ADELONDRADO","ADELONDRADO","ADELONDRADO","ADELONDRADO","ADELONDRADO","ADELONDRADO","ADELONDRADO","ADELONDRADO","ADELONDRADO","ADELONDRADO","ADELONDRADO","ADELONDRADO","ADELONDRADO","ADELONDRADO","ADELONDRADO","ADELONDRADO","ADELONDRADO","ADELONDRADO","ADELONDRADO","ADELONDRADO","ADELONDRADO","ADELONDRADO","ADELONDRADO","ADELONDRADO","ADELONDRADO","ADELONDRADO","ADELONDRADO","ADELONDRADO","ADELONDRADO","ADELONDRADO","ADELONDRADO","ADELONDRADO","ADELONDRADO","ADELONDRADO","ADELONDRADO","ADELONDRADO","ADELONDRADO","ADELONDRADO","ADELONDRADO","ADELONDRADO","ADELONDRADO","ADELONDRADO","ADELONDRADO","ADELONDRADO","ADELONDRADO","ADELONDRADO","ADELONDRADO","ADELONDRADO","ADELONDRADO","ADELONDRADO","ADELONDRADO","ADELONDRADO","ADELONDRADO","ADELONDRADO","ADELONDRADO","ADELONDRADO","ADELONDRADO","ADELONDRADO","ADELONDRADO","ADELONDRADO","ADELONDRADO","ADELONDRADO","ADELONDRADO","ADELONDRADO","ADELONDRADO","ADELONDRADO","ADELONDRADO","ADELONDRADO","ADELONDRADO","ADELONDRADO","ADELONDRADO","ADELONDRADO","ADELONDRADO","ADELONDRADO","ADELONDRADO","ADELONDRADO","ADELONDRADO","ADELONDRADO","ADELONDRADO","ADELONDRADO","ADELONDRADO","ADELONDRADO","ADELONDRADO","ADELONDRADO","ADELONDRADO","ADELONDRADO","ADELONDRADO","ADELONDRADO","ADELONDRADO","ADELONDRADO","ADELONDRADO","ADELONDRADO","ADELONDRADO","ADELONDRADO","ADELONDRADO","ADELONDRADO","ADELONDRADO","ADELONDRADO","ADELONDRADO","ADELONDRADO","ADELONDRADO","ADELONDRADO","ADELONDRADO","ADELONDRADO","ADELONDRADO","ADELONDRADO","ADELONDRADO","ADELONDRADO","ADELONDRADO","ADELONDRADO","ADELONDRADO","ADELONDRADO","ADELONDRADO","ADELONDRADO","ADELONDRADO","ADELONDRADO","ADELONDRADO","ADELONDRADO","ADELONDRADO","ADELONDRADO","ADELONDRADO","ADELONDRADO","ADELONDRADO","ADELONDRADO","ADELONDRADO","ADELONDRADO","ADELONDRADO","ADELONDRADO","ADELONDRADO","ADELONDRADO","ADELONDRADO","ADELONDRADO","ADELONDRADO","ADELONDRADO","ADELONDRADO","ADELONDRADO","ADELONDRADO","ADELONDRADO","ADELONDRADO","ADELONDRADO","ADELONDRADO","ADELONDRADO","ADELONDRADO","ADELONDRADO","ADELONDRADO","ADELONDRADO","ADELONDRADO","ADELONDRADO","ADELONDRADO","ADELONDRADO","ADELONDRADO","ADELONDRADO","ADELONDRADO","ADELONDRADO","ADELONDRADO","ADELONDRADO","ADELONDRADO","ADELONDRADO","ADELONDRADO","ADELONDRADO","ADELONDRADO","ADELONDRADO","ADELONDRADO","ADELONDRADO","ADELONDRADO","ADELONDRADO","ADELONDRADO","ADELONDRADO","ADELONDRADO","ADELONDRADO","ADELONDRADO","ADELONDRADO","ADELONDRADO","ADELONDRADO","ADELONDRADO","ADELONDRADO","ADELONDRADO","ADELONDRADO","ADELONDRADO","ADELONDRADO","ADELONDRADO","ADELONDRADO","ADELONDRADO","ADELONDRADO","ADELONDRADO","ADELONDRADO","ADELONDRADO","ADELONDRADO","ADELONDRADO","ADELONDRADO","ADELONDRADO","ADELONDRADO","ADELONDRADO","ADELONDRADO","ADELONDRADO","ADELONDRADO","ADELONDRADO","ADELONDRADO","ADELONDRADO","ADELONDRADO","ADELONDRADO","ADELONDRADO","ADELONDRADO","ADELONDRADO","ADELONDRADO","ADELONDRADO","ADELONDRADO","ADELONDRADO","ADELONDRADO","ADELONDRADO","ADELONDRADO","ADELONDRADO","ADELONDRADO","ADELONDRADO","ADELONDRADO","ADELONDRADO","ADELONDRADO","ADELONDRADO","ADELONDRADO","ADELONDRADO","ADELONDRADO","ADELONDRADO","ADELONDRADO","ADELONDRADO","ADELONDRADO","ADELONDRADO","ADELONDRADO","ADELONDRADO","ADELONDRADO","ADELONDRADO","ADELONDRADO","ADELONDRADO","ADELONDRADO","ADELONDRADO","ADELONDRADO","ADELONDRADO","ADELONDRADO","ADELONDRADO","ADELONDRADO","ADELONDRADO","ADELONDRADO","ADELONDRADO","ADELONDRADO","ADELONDRADO","ADELONDRADO","ADELONDRADO","ADELONDRADO","ADELONDRADO","ADELONDRADO","ADELONDRADO","ADELONDRADO","ADELONDRADO","ADELONDRADO","ADELONDRADO","ADELONDRADO","ADELONDRADO","ADELONDRADO","ADELONDRADO","ADELONDRADO","ADELONDRADO","ADELONDRADO","ADELONDRADO","ADELONDRADO","ADELONDRADO","ADELONDRADO","ADELONDRADO","ADELONDRADO","ADELONDRADO","ADELONDRADO","ADELONDRADO","ADELONDRADO","ADELONDRADO","ADELONDRADO","ADELONDRADO","ADELONDRADO","ADELONDRADO","ADELONDRADO","ADELONDRADO","ADELONDRADO","ADELONDRADO","ADELONDRADO","ADELONDRADO","ADELONDRADO","ADELONDRADO","ADELONDRADO","ADELONDRADO","ADELONDRADO","ADELONDRADO","ADELONDRADO","ADELONDRADO","ADELONDRADO","ADELONDRADO","ADELONDRADO","ADELONDRADO","ADELONDRADO","ADELONDRADO","ADELONDRADO","ADELONDRADO","ADELONDRADO","ADELONDRADO","ADELONDRADO","ADELONDRADO","ADELONDRADO","ADELONDRADO","ADELONDRADO","ADELONDRADO","ADELONDRADO","ADELONDRADO","ADELONDRADO","ADELONDRADO","ADELONDRADO","ADELONDRADO","ADELONDRADO","ADELONDRADO","ADELONDRADO","ADELONDRADO","ADELONDRADO","ADELONDRADO","ADELONDRADO","ADELONDRADO","ADELONDRADO","ADELONDRADO","ADELONDRADO","ADELONDRADO","ADELONDRADO","ADELONDRADO","ADELONDRADO","ADELONDRADO","ADELONDRADO","ADELONDRADO","ADELONDRADO","ADELONDRADO","ADELONDRADO","ADELONDRADO","ADELONDRADO","ADELONDRADO","ADELONDRADO","ADELONDRADO","ADELONDRADO","ADELONDRADO","ADELONDRADO","ADELONDRADO","ADELONDRADO","ADELONDRADO","ADELONDRADO","ADELONDRADO","ADELONDRADO","ADELONDRADO","ADELONDRADO","ADELONDRADO","ADELONDRADO","ADELONDRADO","ADELONDRADO","ADELONDRADO","ADELONDRADO","ADELONDRADO","ADELONDRADO","ADELONDRADO","ADELONDRADO","ADELONDRADO","ADELONDRADO","ADELONDRADO","ADELONDRADO","ADELONDRADO","ADELONDRADO","ADELONDRADO","ADELONDRADO","ADELONDRADO","ADELONDRADO","ADELONDRADO","ADELONDRADO","ADELONDRADO","ADELONDRADO","ADELONDRADO","ADELONDRADO","ADELONDRADO","ADELONDRADO","ADELONDRADO","ADELONDRADO","ADELONDRADO","ADELONDRADO","ADELONDRADO","ADELONDRADO","ADELONDRADO","ADELONDRADO","ADELONDRADO","ADELONDRADO","ADELONDRADO","ADELONDRADO","ADELONDRADO","ADELONDRADO","ADELONDRADO","ADELONDRADO","ADELONDRADO","ADELONDRADO","ADELONDRADO","ADELONDRADO","ADELONDRADO","ADELONDRADO","ADELONDRADO","ADELONDRADO","ADELONDRADO","ADELONDRADO","ADELONDRADO","ADELONDRADO","ADELONDRADO","ADELONDRADO","ADELONDRADO","ADELONDRADO","ADELONDRADO","ADELONDRADO","ADELONDRADO","ADELONDRADO","ADELONDRADO","ADELONDRADO","ADELONDRADO","ADELONDRADO","ADELONDRADO","ADELONDRADO","ADELONDRADO","ADELONDRADO","ADELONDRADO","ADELONDRADO","ADELONDRADO","ADELONDRADO","ADELONDRADO","ADELONDRADO","ADELONDRADO","ADELONDRADO","ADELONDRADO","ADELONDRADO","ADELONDRADO","ADELONDRADO","ADELONDRADO","ADELONDRADO","ADELONDRADO","ADELONDRADO","ADELONDRADO","ADELONDRADO","ADELONDRADO","ADELONDRADO","ADELONDRADO","ADELONDRADO","ADELONDRADO","ADELONDRADO","ADELONDRADO","ADELONDRADO","ADELONDRADO","ADELONDRADO","ADELONDRADO","ADELONDRADO","ADELONDRADO","ADELONDRADO","ADELONDRADO","ADELONDRADO","ADELONDRADO","ADELONDRADO","ADELONDRADO","ADELONDRADO","ADELONDRADO","ADELONDRADO","ADELONDRADO","ADELONDRADO","ADELONDRADO","ADELONDRADO","ADELONDRADO","ADELONDRADO","ADELONDRADO","ADELONDRADO","ADELONDRADO","ADELONDRADO","ADELONDRADO","ADELONDRADO","ADELONDRADO","ADELONDRADO","ADELONDRADO","ADELONDRADO","ADELONDRADO","ADELONDRADO","ADELONDRADO","ADELONDRADO","ADELONDRADO","ADELONDRADO","ADELONDRADO","ADELONDRADO","ADELONDRADO","ADELONDRADO","ADELONDRADO","ADELONDRADO","ADELONDRADO","ADELONDRADO","ADELONDRADO","ADELONDRADO","ADELONDRADO","ADELONDRADO","ADELONDRADO","ADELONDRADO","ADELONDRADO","ADELONDRADO","ADELONDRADO","ADELONDRADO","ADELONDRADO","ADELONDRADO","ADELONDRADO","ADELONDRADO","ADELONDRADO","ADELONDRADO","ADELONDRADO","ADELONDRADO","ADELONDRADO","ADELONDRADO","ADELONDRADO","ADELONDRADO","ADELONDRADO","ADELONDRADO","ADELONDRADO","ADELONDRADO","ADELONDRADO","ADELONDRADO","ADELONDRADO","ADELONDRADO","ADELONDRADO","ADELONDRADO","ADELONDRADO","ADELONDRADO","ADELONDRADO","ADELONDRADO","ADELONDRADO","ADELONDRADO","ADELONDRADO","ADELONDRADO","ADELONDRADO","ADELONDRADO","ADELONDRADO","ADELONDRADO","ADELONDRADO","ADELONDRADO","ADELONDRADO","ADELONDRADO","ADELONDRADO","ADELONDRADO","ADELONDRADO","ADELONDRADO","ADELONDRADO","ADELONDRADO","ADELONDRADO","ADELONDRADO","ADELONDRADO","ADELONDRADO","ADELONDRADO","ADELONDRADO","ADELONDRADO","ADELONDRADO","ADELONDRADO","ADELONDRADO","ADELONDRADO","ADELONDRADO","ADELONDRADO","ADELONDRADO","ADELONDRADO","ADELONDRADO","ADELONDRADO","ADELONDRADO","ADELONDRADO","ADELONDRADO","ADELONDRADO","ADELONDRADO","ADELONDRADO","ADELONDRADO","ADELONDRADO","ADELONDRADO","ADELONDRADO","ADELONDRADO","ADELONDRADO","ADELONDRADO","ADELONDRADO","ADELONDRADO","ADELONDRADO","ADELONDRADO","ADELONDRADO","ADELONDRADO","ADELONDRADO","ADELONDRADO","ADELONDRADO","ADELONDRADO","ADELONDRADO","ADELONDRADO","ADELONDRADO","ADELONDRADO","ADELONDRADO","ADELONDRADO","ADELONDRADO","ADELONDRADO","ADELONDRADO","ADELONDRADO","ADELONDRADO","ADELONDRADO","ADELONDRADO","ADELONDRADO","ADELONDRADO","ADELONDRADO","ADELONDRADO","ADELONDRADO","ADELONDRADO","ADELONDRADO","ADELONDRADO","ADELONDRADO","ADELONDRADO","ADELONDRADO","ADELONDRADO","ADELONDRADO","ADELONDRADO","ADELONDRADO","ADELONDRADO","ADELONDRADO","ADELONDRADO","ADELONDRADO","ADELONDRADO","ADELONDRADO","ADELONDRADO","ADELONDRADO","ADELONDRADO","ADELONDRADO","ADELONDRADO","ADELONDRADO","ADELONDRADO","ADELONDRADO","ADELONDRADO","ADELONDRADO","ADELONDRADO","ADELONDRADO","ADELONDRADO","ADELONDRADO","ADELONDRADO","ADELONDRADO","ADELONDRADO","ADELONDRADO","ADELONDRADO","ADELONDRADO","ADELONDRADO","ADELONDRADO","ADELONDRADO","ADELONDRADO","ADELONDRADO","ADELONDRADO","ADELONDRADO","ADELONDRADO","ADELONDRADO","ADELONDRADO","ADELONDRADO","ADELONDRADO","ADELONDRADO","ADELONDRADO","ADELONDRADO","ADELONDRADO","ADELONDRADO","ADELONDRADO","ADELONDRADO","ADELONDRADO","ADELONDRADO","ADELONDRADO","ADELONDRADO","ADELONDRADO","ADELONDRADO","ADELONDRADO","ADELONDRADO","ADELONDRADO","ADELONDRADO","ADELONDRADO","ADELONDRADO","ADELONDRADO","ADELONDRADO","ADELONDRADO","ADELONDRADO","ADELONDRADO","ADELONDRADO","ADELONDRADO","ADELONDRADO","ADELONDRADO","ADELONDRADO","ADELONDRADO","ADELONDRADO","ADELONDRADO","ADELONDRADO","ADELONDRADO","ADELONDRADO","ADELONDRADO","ADELONDRADO","ADELONDRADO","ADELONDRADO","ADELONDRADO","ADELONDRADO","ADELONDRADO","ADELONDRADO","ADELONDRADO","ADELONDRADO","ADELONDRADO","ADELONDRADO","ADELONDRADO","ADELONDRADO","ADELONDRADO","ADELONDRADO","ADELONDRADO","ADELONDRADO","ADELONDRADO","ADELONDRADO","ADELONDRADO","ADELONDRADO","ADELONDRADO","ADELONDRADO","ADELONDRADO","ADELONDRADO","ADELONDRADO","ADELONDRADO","ADELONDRADO","ADELONDRADO","ADELONDRADO","ADELONDRADO","ADELONDRADO","ADELONDRADO","ADELONDRADO","ADELONDRADO","ADELONDRADO","ADELONDRADO","ADELONDRADO","ADELONDRADO","ADELONDRADO","ADELONDRADO","ADELONDRADO","ADELONDRADO","ADELONDRADO","ADELONDRADO","ADELONDRADO","ADELONDRADO","ADELONDRADO","ADELONDRADO","ADELONDRADO","ADELONDRADO","ADELONDRADO","ADELONDRADO","ADELONDRADO","ADELONDRADO","ADELONDRADO","ADELONDRADO","ADELONDRADO","ADELONDRADO","ADELONDRADO","ADELONDRADO","ADELONDRADO","ADELONDRADO","ADELONDRADO","ADELONDRADO","ADELONDRADO","ADELONDRADO","ADELONDRADO","ADELONDRADO","ADELONDRADO","ADELONDRADO","ADELONDRADO","ADELONDRADO","ADELONDRADO","ADELONDRADO","ADELONDRADO","ADELONDRADO","ADELONDRADO","ADELONDRADO","ADELONDRADO","ADELONDRADO","ADELONDRADO","ADELONDRADO","ADELONDRADO","ADELONDRADO","ADELONDRADO","ADELONDRADO","ADELONDRADO","ADELONDRADO","ADELONDRADO","ADELONDRADO","ADELONDRADO","ADELONDRADO","ADELONDRADO","ADELONDRADO","ADELONDRADO","ADELONDRADO","ADELONDRADO","ADELONDRADO","ADELONDRADO","ADELONDRADO","ADELONDRADO","ADELONDRADO","ADELONDRADO","ADELONDRADO","ADELONDRADO","ADELONDRADO","ADELONDRADO","ADELONDRADO","ADELONDRADO","ADELONDRADO","ADELONDRADO","ADELONDRADO","ADELONDRADO","ADELONDRADO","ADELONDRADO","ADELONDRADO","ADELONDRADO","ADELONDRADO","ADELONDRADO","ADELONDRADO","ADELONDRADO","ADELONDRADO","ADELONDRADO","ADELONDRADO","ADELONDRADO","ADELONDRADO","ADELONDRADO","ADELONDRADO","ADELONDRADO","ADELONDRADO","ADELONDRADO","ADELONDRADO","ADELONDRADO","ADELONDRADO","ADELONDRADO","ADELONDRADO","ADELONDRADO","ADELONDRADO","ADELONDRADO","ADELONDRADO","ADELONDRADO","ADELONDRADO","ADELONDRADO","ADELONDRADO","ADELONDRADO","ADELONDRADO","ADELONDRADO","ADELONDRADO","ADELONDRADO","ADELONDRADO","ADELONDRADO","ADELONDRADO","ADELONDRADO","ADELONDRADO","ADELONDRADO","ADELONDRADO","ADELONDRADO","ADELONDRADO","ADELONDRADO","ADELONDRADO","ADELONDRADO","ADELONDRADO","ADELONDRADO","ADELONDRADO","ADELONDRADO","ADELONDRADO","ADELONDRADO","ADELONDRADO","ADELONDRADO","ADELONDRADO","ADELONDRADO","ADELONDRADO","ADELONDRADO","ADELONDRADO","ADELONDRADO","ADELONDRADO","ADELONDRADO","ADELONDRADO","ADELONDRADO","ADELONDRADO","ADELONDRADO","ADELONDRADO","ADELONDRADO","ADELONDRADO","ADELONDRADO","ADELONDRADO","ADELONDRADO","ADELONDRADO","ADELONDRADO","ADELONDRADO","ADELONDRADO","ADELONDRADO","ADELONDRADO","ADELONDRADO","ADELONDRADO","ADELONDRADO","ADELONDRADO","ADELONDRADO","ADELONDRADO","ADELONDRADO","ADELONDRADO","ADELONDRADO","ADELONDRADO","ADELONDRADO","ADELONDRADO","ADELONDRADO","ADELONDRADO","ADELONDRADO","ADELONDRADO","ADELONDRADO","ADELONDRADO","ADELONDRADO","ADELONDRADO","ADELONDRADO","ADELONDRADO","ADELONDRADO","ADELONDRADO","ADELONDRADO","ADELONDRADO","ADELONDRADO","ADELONDRADO","ADELONDRADO","ADELONDRADO","ADELONDRADO","ADELONDRADO","ADELONDRADO","ADELONDRADO","ADELONDRADO","ADELONDRADO","ADELONDRADO","ADELONDRADO","ADELONDRADO","ADELONDRADO","ADELONDRADO","ADELONDRADO","ADELONDRADO","ADELONDRADO","ADELONDRADO","ADELONDRADO","ADELONDRADO","ADELONDRADO","ADELONDRADO","ADELONDRADO","ADELONDRADO","ADELONDRADO","ADELONDRADO","ADELONDRADO","ADELONDRADO","ADELONDRADO","ADELONDRADO","ADELONDRADO","ADELONDRADO","ADELONDRADO","ADELONDRADO","ADELONDRADO","ADELONDRADO","ADELONDRADO","ADELONDRADO","ADELONDRADO","ADELONDRADO","ADELONDRADO","ADELONDRADO","ADELONDRADO","ADELONDRADO","ADELONDRADO","ADELONDRADO","ADELONDRADO","ADELONDRADO","ADELONDRADO","ADELONDRADO","ADELONDRADO","ADELONDRADO","ADELONDRADO","ADELONDRADO","ADELONDRADO","ADELONDRADO","ADELONDRADO","ADELONDRADO","ADELONDRADO","ADELONDRADO","ADELONDRADO","ADELONDRADO","ADELONDRADO","ADELONDRADO","ADELONDRADO","ADELONDRADO","ADELONDRADO","ADELONDRADO","ADELONDRADO","ADELONDRADO","ADELONDRADO","ADELONDRADO","ADELONDRADO","ADELONDRADO","ADELONDRADO","ADELONDRADO","ADELONDRADO","ADELONDRADO","ADELONDRADO","ADELONDRADO","ADELONDRADO","ADELONDRADO","ADELONDRADO","ADELONDRADO","ADELONDRADO","ADELONDRADO","ADELONDRADO","ADELONDRADO","ADELONDRADO","ADELONDRADO","ADELONDRADO","ADELONDRADO","ADELONDRADO","ADELONDRADO","ADELONDRADO","ADELONDRADO","ADELONDRADO","ADELONDRADO","ADELONDRADO","ADELONDRADO","ADELONDRADO","ADELONDRADO","ADELONDRADO","ADELONDRADO","ADELONDRADO","ADELONDRADO","ADELONDRADO","ADELONDRADO","ADELONDRADO","ADELONDRADO","ADELONDRADO","ADELONDRADO","ADELONDRADO","ADELONDRADO","ADELONDRADO","ADELONDRADO","ADELONDRADO","ADELONDRADO","ADELONDRADO","ADELONDRADO","ADELONDRADO","ADELONDRADO","ADELONDRADO","ADELONDRADO","ADELONDRADO","ADELONDRADO","ADELONDRADO","ADELONDRADO","ADELONDRADO","ADELONDRADO","ADELONDRADO","ADELONDRADO","ADELONDRADO","ADELONDRADO","ADELONDRADO","ADELONDRADO","ADELONDRADO","ADELONDRADO","ADELONDRADO","ADELONDRADO","ADELONDRADO","ADELONDRADO","ADELONDRADO","ADELONDRADO","ADELONDRADO","ADELONDRADO","ADELONDRADO","ADELONDRADO","ADELONDRADO","ADELONDRADO","ADELONDRADO","ADELONDRADO","ADELONDRADO","ADELONDRADO","ADELONDRADO","ADELONDRADO","ADELONDRADO","ADELONDRADO","ADELONDRADO","ADELONDRADO","ADELONDRADO","ADELONDRADO","ADELONDRADO","ADELONDRADO","ADELONDRADO","ADELONDRADO","ADELONDRADO","ADELONDRADO","ADELONDRADO","ADELONDRADO","ADELONDRADO","ADELONDRADO","ADELONDRADO","ADELONDRADO","ADELONDRADO","ADELONDRADO","ADELONDRADO","ADELONDRADO","ADELONDRADO","ADELONDRADO","ADELONDRADO","ADELONDRADO","ADELONDRADO","ADELONDRADO","ADELONDRADO","ADELONDRADO","ADELONDRADO","ADELONDRADO","ADELONDRADO","ADELONDRADO","ADELONDRADO","ADELONDRADO","ADELONDRADO","ADELONDRADO","ADELONDRADO","ADELONDRADO","ADELONDRADO","ADELONDRADO","ADELONDRADO","ADELONDRADO","ADELONDRADO","ADELONDRADO","ADELONDRADO","ADELONDRADO","ADELONDRADO","ADELONDRADO","ADELONDRADO","ADELONDRADO","ADELONDRADO","ADELONDRADO","ADELONDRADO","ADELONDRADO","ADELONDRADO","ADELONDRADO","ADELONDRADO","ADELONDRADO","ADELONDRADO","ADELONDRADO","ADELONDRADO","ADELONDRADO","ADELONDRADO","ADELONDRADO","ADELONDRADO","ADELONDRADO","ADELONDRADO","ADELONDRADO","ADELONDRADO","ADELONDRADO","ADELONDRADO","ADELONDRADO","ADELONDRADO","ADELONDRADO","ADELONDRADO","ADELONDRADO","ADELONDRADO","ADELONDRADO","ADELONDRADO","ADELONDRADO","ADELONDRADO","ADELONDRADO","ADELONDRADO","ADELONDRADO","ADELONDRADO","ADELONDRADO","ADELONDRADO","ADELONDRADO","ADELONDRADO","ADELONDRADO","ADELONDRADO","ADELONDRADO","ADELONDRADO","ADELONDRADO","ADELONDRADO","ADELONDRADO","ADELONDRADO","ADELONDRADO","ADELONDRADO","ADELONDRADO","ADELONDRADO","ADELONDRADO","ADELONDRADO","ADELONDRADO","ADELONDRADO","ADELONDRADO","ADELONDRADO","ADELONDRADO","ADELONDRADO","ADELONDRADO","ADELONDRADO","ADELONDRADO","ADELONDRADO","ADELONDRADO","ADELONDRADO","ADELONDRADO","ADELONDRADO","ADELONDRADO","ADELONDRADO","ADELONDRADO","ADELONDRADO","ADELONDRADO","ADELONDRADO","ADELONDRADO","ADELONDRADO","ADELONDRADO","ADELONDRADO","ADELONDRADO","ADELONDRADO","ADELONDRADO","ADELONDRADO","ADELONDRADO","ADELONDRADO","ADELONDRADO","ADELONDRADO","ADELONDRADO","ADELONDRADO","ADELONDRADO","ADELONDRADO","ADELONDRADO","ADELONDRADO","ADELONDRADO","ADELONDRADO","ADELONDRADO","ADELONDRADO","ADELONDRADO","ADELONDRADO","ADELONDRADO","ADELONDRADO","ADELONDRADO","ADELONDRADO","ADELONDRADO","ADELONDRADO","ADELONDRADO","ADELONDRADO","ADELONDRADO","ADELONDRADO","ADELONDRADO","ADELONDRADO","ADELONDRADO","ADELONDRADO","ADELONDRADO","ADELONDRADO","ADELONDRADO","ADELONDRADO","ADELONDRADO","ADELONDRADO","ADELONDRADO","ADELONDRADO","ADELONDRADO","ADELONDRADO","ADELONDRADO","ADELONDRADO","ADELONDRADO","ADELONDRADO","ADELONDRADO","ADELONDRADO","ADELONDRADO","ADELONDRADO","ADELONDRADO","ADELONDRADO","ADELONDRADO","ADELONDRADO","ADELONDRADO","ADELONDRADO","ADELONDRADO","ADELONDRADO","ADELONDRADO","ADELONDRADO","ADELONDRADO","ADELONDRADO","ADELONDRADO","ADELONDRADO","ADELONDRADO","ADELONDRADO","ADELONDRADO","ADELONDRADO","ADELONDRADO","ADELONDRADO","ADELONDRADO","ADELONDRADO","ADELONDRADO","ADELONDRADO","ADELONDRADO","ADELONDRADO","ADELONDRADO","ADELONDRADO","ADELONDRADO","ADELONDRADO","ADELONDRADO","ADELONDRADO","ADELONDRADO","ADELONDRADO","ADELONDRADO","ADELONDRADO","ADELONDRADO","ADELONDRADO","ADELONDRADO","ADELONDRADO","ADELONDRADO","ADELONDRADO","ADELONDRADO","ADELONDRADO","ADELONDRADO","ADELONDRADO","ADELONDRADO","ADELONDRADO","ADELONDRADO","ADELONDRADO","ADELONDRADO","ADELONDRADO","ADELONDRADO","ADELONDRADO","ADELONDRADO","ADELONDRADO","ADELONDRADO","ADELONDRADO","ADELONDRADO","ADELONDRADO","ADELONDRADO","ADELONDRADO","ADELONDRADO","ADELONDRADO","ADELONDRADO","ADELONDRADO","ADELONDRADO","ADELONDRADO","ADELONDRADO","ADELONDRADO","ADELONDRADO","ADELONDRADO","ADELONDRADO","ADELONDRADO","ADELONDRADO","ADELONDRADO","ADELONDRADO","ADELONDRADO","ADELONDRADO","ADELONDRADO","ADELONDRADO","ADELONDRADO","ADELONDRADO","ADELONDRADO","ADELONDRADO","ADELONDRADO","ADELONDRADO","ADELONDRADO","ADELONDRADO","ADELONDRADO","ADELONDRADO","ADELONDRADO","ADELONDRADO","ADELONDRADO","ADELONDRADO","ADELONDRADO","ADELONDRADO","ADELONDRADO","ADELONDRADO","ADELONDRADO","ADELONDRADO","ADELONDRADO","ADELONDRADO","ADELONDRADO","ADELONDRADO","ADELONDRADO","ADELONDRADO","ADELONDRADO","ADELONDRADO","ADELONDRADO","ADELONDRADO","ADELONDRADO","ADELONDRADO","ADELONDRADO","ADELONDRADO","ADELONDRADO","ADELONDRADO","ADELONDRADO","ADELONDRADO","ADELONDRADO","ADELONDRADO","ADELONDRADO","ADELONDRADO","ADELONDRADO","ADELONDRADO","ADELONDRADO","ADELONDRADO","ADELONDRADO","ADELONDRADO","ADELONDRADO","ADELONDRADO","ADELONDRADO","ADELONDRADO","ADELONDRADO","ADELONDRADO","ADELONDRADO","ADELONDRADO","ADELONDRADO","ADELONDRADO","ADELONDRADO","ADELONDRADO","ADELONDRADO","ADELONDRADO","ADELONDRADO","ADELONDRADO","ADELONDRADO","ADELONDRADO","ADELONDRADO","ADELONDRADO","ADELONDRADO","ADELONDRADO","ADELONDRADO","ADELONDRADO","ADELONDRADO","ADELONDRADO","ADELONDRADO","ADELONDRADO","ADELONDRADO","ADELONDRADO","ADELONDRADO","ADELONDRADO","ADELONDRADO","ADELONDRADO","ADELONDRADO","ADELONDRADO","ADELONDRADO","ADELONDRADO","ADELONDRADO","ADELONDRADO","ADELONDRADO","ADELONDRADO","ADELONDRADO","ADELONDRADO","ADELONDRADO","ADELONDRADO","ADELONDRADO","ADELONDRADO","ADELONDRADO","ADELONDRADO","ADELONDRADO","ADELONDRADO","ADELONDRADO","ADELONDRADO","ADELONDRADO","ADELONDRADO","ADELONDRADO","ADELONDRADO","ADELONDRADO","ADELONDRADO","ADELONDRADO","ADELONDRADO","ADELONDRADO","ADELONDRADO","ADELONDRADO","ADELONDRADO","ADELONDRADO","ADELONDRADO","ADELONDRADO","ADELONDRADO","ADELONDRADO","ADELONDRADO","ADELONDRADO","ADELONDRADO","ADELONDRADO","ADELONDRADO","ADELONDRADO","ADELONDRADO","ADELONDRADO","ADELONDRADO","ADELONDRADO","ADELONDRADO","ADELONDRADO","ADELONDRADO","ADELONDRADO","ADELONDRADO","ADELONDRADO","ADELONDRADO","ADELONDRADO","ADELONDRADO","ADELONDRADO","ADELONDRADO","ADELONDRADO","ADELONDRADO","ADELONDRADO","ADELONDRADO","ADELONDRADO","ADELONDRADO","ADELONDRADO","ADELONDRADO","ADELONDRADO","ADELONDRADO","ADELONDRADO","ADELONDRADO","ADELONDRADO","ADELONDRADO","ADELONDRADO","ADELONDRADO","ADELONDRADO","ADELONDRADO","ADELONDRADO","ADELONDRADO","ADELONDRADO","ADELONDRADO","ADELONDRADO","ADELONDRADO","ADELONDRADO","ADELONDRADO","ADELONDRADO","ADELONDRADO","ADELONDRADO","ADELONDRADO","ADELONDRADO","ADELONDRADO","ADELONDRADO","ADELONDRADO","ADELONDRADO","ADELONDRADO","ADELONDRADO","ADELONDRADO","ADELONDRADO","ADELONDRADO","ADELONDRADO","ADELONDRADO","ADELONDRADO","ADELONDRADO","ADELONDRADO","ADELONDRADO","ADELONDRADO","ADELONDRADO","ADELONDRADO","ADELONDRADO","ADELONDRADO","ADELONDRADO","ADELONDRADO","ADELONDRADO","ADELONDRADO","ADELONDRADO","ADELONDRADO","ADELONDRADO","ADELONDRADO","ADELONDRADO","ADELONDRADO","ADELONDRADO","ADELONDRADO","ADELONDRADO","ADELONDRADO","ADELONDRADO","ADELONDRADO","ADELONDRADO","ADELONDRADO","ADELONDRADO","ADELONDRADO","ADELONDRADO","ADELONDRADO","ADELONDRADO","ADELONDRADO","ADELONDRADO","ADELONDRADO","ADELONDRADO","ADELONDRADO","ADELONDRADO","ADELONDRADO","ADELONDRADO","ADELONDRADO","ADELONDRADO","ADELONDRADO","ADELONDRADO","ADELONDRADO","ADELONDRADO","ADELONDRADO","ADELONDRADO","ADELONDRADO","ADELONDRADO","ADELONDRADO","ADELONDRADO","ADELONDRADO","ADELONDRADO","ADELONDRADO","ADELONDRADO","ADELONDRADO","ADELONDRADO","ADELONDRADO","ADELONDRADO","ADELONDRADO","ADELONDRADO","ADELONDRADO","ADELONDRADO","ADELONDRADO","ADELONDRADO","ADELONDRADO","ADELONDRADO","ADELONDRADO","ADELONDRADO","ADELONDRADO","ADELONDRADO","ADELONDRADO","ADELONDRADO","ADELONDRADO","ADELONDRADO","ADELONDRADO","ADELONDRADO","ADELONDRADO","ADELONDRADO","ADELONDRADO","ADELONDRADO","ADELONDRADO","ADELONDRADO","ADELONDRADO","ADELONDRADO","ADELONDRADO","ADELONDRADO","ADELONDRADO","ADELONDRADO","ADELONDRADO","ADELONDRADO","ADELONDRADO","ADELONDRADO","ADELONDRADO","ADELONDRADO","ADELONDRADO","ADELONDRADO","ADELONDRADO","ADELONDRADO","ADELONDRADO","ADELONDRADO","ADELONDRADO","ADELONDRADO","ADELONDRADO","ADELONDRADO","ADELONDRADO","ADELONDRADO","ADELONDRADO","ADELONDRADO","ADELONDRADO","ADELONDRADO","ADELONDRADO","ADELONDRADO","ADELONDRADO","ADELONDRADO","ADELONDRADO","ADELONDRADO","ADELONDRADO","ADELONDRADO","ADELONDRADO","ADELONDRADO","ADELONDRADO","ADELONDRADO","ADELONDRADO","ADELONDRADO","ADELONDRADO","ADELONDRADO","ADELONDRADO","ADELONDRADO","ADELONDRADO","ADELONDRADO","ADELONDRADO","ADELONDRADO","ADELONDRADO","ADELONDRADO","ADELONDRADO","ADELONDRADO","ADELONDRADO","ADELONDRADO","ADELONDRADO","ADELONDRADO","ADELONDRADO","ADELONDRADO","ADELONDRADO","ADELONDRADO","ADELONDRADO","ADELONDRADO","ADELONDRADO","ADELONDRADO","ADELONDRADO","ADELONDRADO","ADELONDRADO","ADELONDRADO","ADELONDRADO","ADELONDRADO","ADELONDRADO","ADELONDRADO","ADELONDRADO","ADELONDRADO","ADELONDRADO","ADELONDRADO","ADELONDRADO","ADELONDRADO","ADELONDRADO","ADELONDRADO","ADELONDRADO","ADELONDRADO","ADELONDRADO","ADELONDRADO","ADELONDRADO","ADELONDRADO","ADELONDRADO","ADELONDRADO","ADELONDRADO","ADELONDRADO","ADELONDRADO","ADELONDRADO","ADELONDRADO","ADELONDRADO","ADELONDRADO","ADELONDRADO","ADELONDRADO","ADELONDRADO","ADELONDRADO","ADELONDRADO","ADELONDRADO","ADELONDRADO","ADELONDRADO","ADELONDRADO","ADELONDRADO","ADELONDRADO","ADELONDRADO","ADELONDRADO","ADELONDRADO","ADELONDRADO","ADELONDRADO","ADELONDRADO","ADELONDRADO","ADELONDRADO","ADELONDRADO","ADELONDRADO","ADELONDRADO","ADELONDRADO","ADELONDRADO","ADELONDRADO","ADELONDRADO","ADELONDRADO","ADELONDRADO","ADELONDRADO","ADELONDRADO","ADELONDRADO","ADELONDRADO","ADELONDRADO","ADELONDRADO","ADELONDRADO","ADELONDRADO","ADELONDRADO","ADELONDRADO","ADELONDRADO","ADELONDRADO","ADELONDRADO","ADELONDRADO","ADELONDRADO","ADELONDRADO","ADELONDRADO","ADELONDRADO","ADELONDRADO","ADELONDRADO","ADELONDRADO","ADELONDRADO","ADELONDRADO","ADELONDRADO","ADELONDRADO","ADELONDRADO","ADELONDRADO","ADELONDRADO","ADELONDRADO","ADELONDRADO","ADELONDRADO","ADELONDRADO","ADELONDRADO","ADELONDRADO","ADELONDRADO","ADELONDRADO","ADELONDRADO","ADELONDRADO","ADELONDRADO","ADELONDRADO","ADELONDRADO","ADELONDRADO","ADELONDRADO","ADELONDRADO","ADELONDRADO","ADELONDRADO","ADELONDRADO","ADELONDRADO","ADELONDRADO","ADELONDRADO","ADELONDRADO","ADELONDRADO","ADELONDRADO","ADELONDRADO","ADELONDRADO","ADELONDRADO","ADELONDRADO","ADELONDRADO","ADELONDRADO","ADELONDRADO","ADELONDRADO","ADELONDRADO","ADELONDRADO","ADELONDRADO","ADELONDRADO","ADELONDRADO","ADELONDRADO","ADELONDRADO","ADELONDRADO","ADELONDRADO","ADELONDRADO","ADELONDRADO","ADELONDRADO","ADELONDRADO","ADELONDRADO","ADELONDRADO","ADELONDRADO","ADELONDRADO","ADELONDRADO","ADELONDRADO","ADELONDRADO","ADELONDRADO","ADELONDRADO","ADELONDRADO","ADELONDRADO","ADELONDRADO","ADELONDRADO","ADELONDRADO","ADELONDRADO","ADELONDRADO","ADELONDRADO","ADELONDRADO","ADELONDRADO","ADELONDRADO","ADELONDRADO","ADELONDRADO","ADELONDRADO","ADELONDRADO","ADELONDRADO","ADELONDRADO","ADELONDRADO","ADELONDRADO","ADELONDRADO","ADELONDRADO","ADELONDRADO","ADELONDRADO","ADELONDRADO","ADELONDRADO","ADELONDRADO","ADELONDRADO","ADELONDRADO","ADELONDRADO","ADELONDRADO","ADELONDRADO","ADELONDRADO","ADELONDRADO","ADELONDRADO","ADELONDRADO","ADELONDRADO","ADELONDRADO","ADELONDRADO","ADELONDRADO","ADELONDRADO","ADELONDRADO","ADELONDRADO","ADELONDRADO","ADELONDRADO","ADELONDRADO","ADELONDRADO","ADELONDRADO","ADELONDRADO","ADELONDRADO","ADELONDRADO","ADELONDRADO","ADELONDRADO","ADELONDRADO","ADELONDRADO","ADELONDRADO","ADELONDRADO","ADELONDRADO","ADELONDRADO","ADELONDRADO","ADELONDRADO","ADELONDRADO","ADELONDRADO","ADELONDRADO","ADELONDRADO","ADELONDRADO","ADELONDRADO","ADELONDRADO","ADELONDRADO","ADELONDRADO","ADELONDRADO","ADELONDRADO","ADELONDRADO","ADELONDRADO","ADELONDRADO","ADELONDRADO","ADELONDRADO","ADELONDRADO","ADELONDRADO","ADELONDRADO","ADELONDRADO","ADELONDRADO","ADELONDRADO","ADELONDRADO","ADELONDRADO","ADELONDRADO","ADELONDRADO","ADELONDRADO","ADELONDRADO","ADELONDRADO","ADELONDRADO","ADELONDRADO","ADELONDRADO","ADELONDRADO","ADELONDRADO","ADELONDRADO","ADELONDRADO","ADELONDRADO","ADELONDRADO","ADELONDRADO","ADELONDRADO","ADELONDRADO","ADELONDRADO","ADELONDRADO","ADELONDRADO","ADELONDRADO","ADELONDRADO","ADELONDRADO","ADELONDRADO","ADELONDRADO","ADELONDRADO","ADELONDRADO","ADELONDRADO","ADELONDRADO","ADELONDRADO","ADELONDRADO","ADELONDRADO","ADELONDRADO","ADELONDRADO","ADELONDRADO","ADELONDRADO","ADELONDRADO","ADELONDRADO","ADELONDRADO","ADELONDRADO","ADELONDRADO","ADELONDRADO","ADELONDRADO","ADELONDRADO","ADELONDRADO","ADELONDRADO","ADELONDRADO","ADELONDRADO","ADELONDRADO","ADELONDRADO","ADELONDRADO","ADELONDRADO","ADELONDRADO","ADELONDRADO","ADELONDRADO","ADELONDRADO","ADELONDRADO","ADELONDRADO","ADELONDRADO","ADELONDRADO","ADELONDRADO","ADELONDRADO","ADELONDRADO","ADELONDRADO","ADELONDRADO","ADELONDRADO","ADELONDRADO","ADELONDRADO","ADELONDRADO","ADELONDRADO","ADELONDRADO","ADELONDRADO","ADELONDRADO","ADELONDRADO","ADELONDRADO","ADELONDRADO","ADELONDRADO","ADELONDRADO","ADELONDRADO","ADELONDRADO","ADELONDRADO","ADELONDRADO","ADELONDRADO","ADELONDRADO","ADELONDRADO","ADELONDRADO","ADELONDRADO","ADELONDRADO","ADELONDRADO","ADELONDRADO","ADELONDRADO","ADELONDRADO","ADELONDRADO","ADELONDRADO","ADELONDRADO","ADELONDRADO","ADELONDRADO","ADELONDRADO","ADELONDRADO","ADELONDRADO","ADELONDRADO","ADELONDRADO","ADELONDRADO","ADELONDRADO","ADELONDRADO","ADELONDRADO","ADELONDRADO","ADELONDRADO","ADELONDRADO","ADELONDRADO","ADELONDRADO","ADELONDRADO","ADELONDRADO","ADELONDRADO","ADELONDRADO","ADELONDRADO","ADELONDRADO","ADELONDRADO","ADELONDRADO","ADELONDRADO","ADELONDRADO","ADELONDRADO","ADELONDRADO","ADELONDRADO","ADELONDRADO","ADELONDRADO","ADELONDRADO","ADELONDRADO","ADELONDRADO","ADELONDRADO","ADELONDRADO","ADELONDRADO","ADELONDRADO","ADELONDRADO","ADELONDRADO","ADELONDRADO","ADELONDRADO","ADELONDRADO","ADELONDRADO","ADELONDRADO","ADELONDRADO","ADELONDRADO","ADELONDRADO","ADELONDRADO","ADELONDRADO","ADELONDRADO","ADELONDRADO","ADELONDRADO","ADELONDRADO","ADELONDRADO","ADELONDRADO","ADELONDRADO","ADELONDRADO","ADELONDRADO","ADELONDRADO","ADELONDRADO","ADELONDRADO","ADELONDRADO","ADELONDRADO","ADELONDRADO","ADELONDRADO","ADELONDRADO","ADELONDRADO","ADELONDRADO","ADELONDRADO","ADELONDRADO","ADELONDRADO","ADELONDRADO","ADELONDRADO","ADELONDRADO","ADELONDRADO","ADELONDRADO","ADELONDRADO","ADELONDRADO","ADELONDRADO","ADELONDRADO","ADELONDRADO","ADELONDRADO","ADELONDRADO","ADELONDRADO","ADELONDRADO","ADELONDRADO","ADELONDRADO","ADELONDRADO","ADELONDRADO","ADELONDRADO","ADELONDRADO","ADELONDRADO","ADELONDRADO","ADELONDRADO","ADELONDRADO","ADELONDRADO","ADELONDRADO","ADELONDRADO","ADELONDRADO","ADELONDRADO","ADELONDRADO","ADELONDRADO","ADELONDRADO","ADELONDRADO","ADELONDRADO","ADELONDRADO","ADELONDRADO","ADELONDRADO","ADELONDRADO","ADELONDRADO","ADELONDRADO","ADELONDRADO","ADELONDRADO","ADELONDRADO","ADELONDRADO","ADELONDRADO","ADELONDRADO","ADELONDRADO","ADELONDRADO","ADELONDRADO","ADELONDRADO","ADELONDRADO","ADELONDRADO","ADELONDRADO","ADELONDRADO","ADELONDRADO","ADELONDRADO","ADELONDRADO","ADELONDRADO","ADELONDRADO","ADELONDRADO","ADELONDRADO","ADELONDRADO","ADELONDRADO","ADELONDRADO","ADELONDRADO","ADELONDRADO","ADELONDRADO","ADELONDRADO","ADELONDRADO","ADELONDRADO","ADELONDRADO","ADELONDRADO","ADELONDRADO","ADELONDRADO","ADELONDRADO","ADELONDRADO","ADELONDRADO","ADELONDRADO","ADELONDRADO","ADELONDRADO","ADELONDRADO","ADELONDRADO","ADELONDRADO","ADELONDRADO","ADELONDRADO","ADELONDRADO","ADELONDRADO","ADELONDRADO","ADELONDRADO","ADELONDRADO","ADELONDRADO","ADELONDRADO","ADELONDRADO","ADELONDRADO","ADELONDRADO","ADELONDRADO","ADELONDRADO","ADELONDRADO","ADELONDRADO","ADELONDRADO","ADELONDRADO","ADELONDRADO","ADELONDRADO","ADELONDRADO","ADELONDRADO","ADELONDRADO","ADELONDRADO","ADELONDRADO","ADELONDRADO","ADELONDRADO","ADELONDRADO","ADELONDRADO","ADELONDRADO","ADELONDRADO","ADELONDRADO","ADELONDRADO","ADELONDRADO","ADELONDRADO","ADELONDRADO","ADELONDRADO","ADELONDRADO","ADELONDRADO","ADELONDRADO","ADELONDRADO","ADELONDRADO","ADELONDRADO","ADELONDRADO","ADELONDRADO","ADELONDRADO","ADELONDRADO","ADELONDRADO","ADELONDRADO","ADELONDRADO","ADELONDRADO","ADELONDRADO","ADELONDRADO","ADELONDRADO","ADELONDRADO","ADELONDRADO","ADELONDRADO","ADELONDRADO","ADELONDRADO","ADELONDRADO","ADELONDRADO","ADELONDRADO","ADELONDRADO","ADELONDRADO","ADELONDRADO","ADELONDRADO","ADELONDRADO","ADELONDRADO","ADELONDRADO","ADELONDRADO","ADELONDRADO","ADELONDRADO","ADELONDRADO","ADELONDRADO","ADELONDRADO","ADELONDRADO","ADELONDRADO","ADELONDRADO","ADELONDRADO","ADELONDRADO","ADELONDRADO","ADELONDRADO","ADELONDRADO","ADELONDRADO","ADELONDRADO","ADELONDRADO","ADELONDRADO","ADELONDRADO","ADELONDRADO","ADELONDRADO","ADELONDRADO","ADELONDRADO","ADELONDRADO","ADELONDRADO","ADELONDRADO","ADELONDRADO","ADELONDRADO","ADELONDRADO","ADELONDRADO","ADELONDRADO","ADELONDRADO","ADELONDRADO","ADELONDRADO","ADELONDRADO","ADELONDRADO","ADELONDRADO","ADELONDRADO","ADELONDRADO","ADELONDRADO","ADELONDRADO","ADELONDRADO","ADELONDRADO","ADELONDRADO","ADELONDRADO","ADELONDRADO","ADELONDRADO","ADELONDRADO","ADELONDRADO","ADELONDRADO","ADELONDRADO","ADELONDRADO","ADELONDRADO","ADELONDRADO","ADELONDRADO","ADELONDRADO","ADELONDRADO","ADELONDRADO","ADELONDRADO","ADELONDRADO","ADELONDRADO","ADELONDRADO","ADELONDRADO","ADELONDRADO","ADELONDRADO","ADELONDRADO","ADELONDRADO","ADELONDRADO","ADELONDRADO","ADELONDRADO","ADELONDRADO","ADELONDRADO","ADELONDRADO","ADELONDRADO","ADELONDRADO","ADELONDRADO","ADELONDRADO","ADELONDRADO","ADELONDRADO","ADELONDRADO","ADELONDRADO","ADELONDRADO","ADELONDRADO","ADELONDRADO","ADELONDRADO","ADELONDRADO","ADELONDRADO","ADELONDRADO","ADELONDRADO","ADELONDRADO","ADELONDRADO","ADELONDRADO","ADELONDRADO","ADELONDRADO","ADELONDRADO","ADELONDRADO","ADELONDRADO","ADELONDRADO","ADELONDRADO","ADELONDRADO","ADELONDRADO","ADELONDRADO","ADELONDRADO","ADELONDRADO","ADELONDRADO","ADELONDRADO","ADELONDRADO","ADELONDRADO","ADELONDRADO","ADELONDRADO","ADELONDRADO","ADELONDRADO","ADELONDRADO","ADELONDRADO","ADELONDRADO","ADELONDRADO","ADELONDRADO","ADELONDRADO","ADELONDRADO","ADELONDRADO","ADELONDRADO","ADELONDRADO","ADELONDRADO","ADELONDRADO","ADELONDRADO","ADELONDRADO","ADELONDRADO","ADELONDRADO","ADELONDRADO","ADELONDRADO","ADELONDRADO","ADELONDRADO","ADELONDRADO","ADELONDRADO","ADELONDRADO","ADELONDRADO","ADELONDRADO","ADELONDRADO","ADELONDRADO","ADELONDRADO","ADELONDRADO","ADELONDRADO","ADELONDRADO","ADELONDRADO","ADELONDRADO","ADELONDRADO","ADELONDRADO","ADELONDRADO","ADELONDRADO","ADELONDRADO","ADELONDRADO","ADELONDRADO","ADELONDRADO","ADELONDRADO","ADELONDRADO","ADELONDRADO","ADELONDRADO","ADELONDRADO","ADELONDRADO","ADELONDRADO","ADELONDRADO","ADELONDRADO","ADELONDRADO","ADELONDRADO","ADELONDRADO","ADELONDRADO","ADELONDRADO","ADELONDRADO","ADELONDRADO","ADELONDRADO","ADELONDRADO","ADELONDRADO","ADELONDRADO","ADELONDRADO","ADELONDRADO","ADELONDRADO","ADELONDRADO","ADELONDRADO","ADELONDRADO","ADELONDRADO","ADELONDRADO","ADELONDRADO","ADELONDRADO","ADELONDRADO","ADELONDRADO","ADELONDRADO","ADELONDRADO","ADELONDRADO","ADELONDRADO","ADELONDRADO","ADELONDRADO","ADELONDRADO","ADELONDRADO","ADELONDRADO","ADELONDRADO","ADELONDRADO","ADELONDRADO","ADELONDRADO","ADELONDRADO","ADELONDRADO","ADELONDRADO","ADELONDRADO","ADELONDRADO","ADELONDRADO","ADELONDRADO","ADELONDRADO","ADELONDRADO","ADELONDRADO","ADELONDRADO","ADELONDRADO","ADELONDRADO","ADELONDRADO","ADELONDRADO","ADELONDRADO","ADELONDRADO","ADELONDRADO","ADELONDRADO","ADELONDRADO","ADELONDRADO","ADELONDRADO","ADELONDRADO","ADELONDRADO","ADELONDRADO","ADELONDRADO","ADELONDRADO","ADELONDRADO","ADELONDRADO","ADELONDRADO","ADELONDRADO","ADELONDRADO","ADELONDRADO","ADELONDRADO","ADELONDRADO","ADELONDRADO","ADELONDRADO","ADELONDRADO","ADELONDRADO","ADELONDRADO","ADELONDRADO","ADELONDRADO","ADELONDRADO","ADELONDRADO","ADELONDRADO","ADELONDRADO","ADELONDRADO","ADELONDRADO","ADELONDRADO","ADELONDRADO","ADELONDRADO","ADELONDRADO","ADELONDRADO","ADELONDRADO","ADELONDRADO","ADELONDRADO","ADELONDRADO","ADELONDRADO","ADELONDRADO","ADELONDRADO","ADELONDRADO","ADELONDRADO","ADELONDRADO","ADELONDRADO","ADELONDRADO","ADELONDRADO","ADELONDRADO","ADELONDRADO","ADELONDRADO","ADELONDRADO","ADELONDRADO","ADELONDRADO","ADELONDRADO","ADELONDRADO","ADELONDRADO","ADELONDRADO","ADELONDRADO","ADELONDRADO","ADELONDRADO","ADELONDRADO","ADELONDRADO","ADELONDRADO","ADELONDRADO","ADELONDRADO","ADELONDRADO","ADELONDRADO","ADELONDRADO","ADELONDRADO","ADELONDRADO","ADELONDRADO","ADELONDRADO","ADELONDRADO","ADELONDRADO","ADELONDRADO","ADELONDRADO","ADELONDRADO","ADELONDRADO","ADELONDRADO","ADELONDRADO","ADELONDRADO","ADELONDRADO","ADELONDRADO","ADELONDRADO","ADELONDRADO","ADELONDRADO","ADELONDRADO","ADELONDRADO","ADELONDRADO","ADELONDRADO","ADELONDRADO","ADELONDRADO","ADELONDRADO","ADELONDRADO","ADELONDRADO","ADELONDRADO","ADELONDRADO","ADELONDRADO","ADELONDRADO","ADELONDRADO","ADELONDRADO","ADELONDRADO","ADELONDRADO","ADELONDRADO","ADELONDRADO","ADELONDRADO","ADELONDRADO","ADELONDRADO","ADELONDRADO","ADELONDRADO","ADELONDRADO","ADELONDRADO","ADELONDRADO","ADELONDRADO","ADELONDRADO","ADELONDRADO","ADELONDRADO","ADELONDRADO","ADELONDRADO","ADELONDRADO","ADELONDRADO","ADELONDRADO","ADELONDRADO","ADELONDRADO","ADELONDRADO","ADELONDRADO","ADELONDRADO","ADELONDRADO","ADELONDRADO","ADELONDRADO","ADELONDRADO","ADELONDRADO","ADELONDRADO","ADELONDRADO","ADELONDRADO","ADELONDRADO","ADELONDRADO","ADELONDRADO","ADELONDRADO","ADELONDRADO","ADELONDRADO","ADELONDRADO","ADELONDRADO","ADELONDRADO","ADELONDRADO","ADELONDRADO","ADELONDRADO","ADELONDRADO","ADELONDRADO","ADELONDRADO","ADELONDRADO","ADELONDRADO","ADELONDRADO","ADELONDRADO","ADELONDRADO","ADELONDRADO","ADELONDRADO","ADELONDRADO","ADELONDRADO","ADELONDRADO","ADELONDRADO","ADELONDRADO","ADELONDRADO","ADELONDRADO","ADELONDRADO","ADELONDRADO","ADELONDRADO","ADELONDRADO","ADELONDRADO","ADELONDRADO","ADELONDRADO","ADELONDRADO","ADELONDRADO","ADELONDRADO","ADELONDRADO","ADELONDRADO","ADELONDRADO","ADELONDRADO","ADELONDRADO","ADELONDRADO","ADELONDRADO","ADELONDRADO","ADELONDRADO","ADELONDRADO","ADELONDRADO","ADELONDRADO","ADELONDRADO","ADELONDRADO","ADELONDRADO","ADELONDRADO","ADELONDRADO","ADELONDRADO","ADELONDRADO","ADELONDRADO","ADELONDRADO","ADELONDRADO","ADELONDRADO","ADELONDRADO","ADELONDRADO","ADELONDRADO","ADELONDRADO","ADELONDRADO","ADELONDRADO","ADELONDRADO","ADELONDRADO","ADELONDRADO","ADELONDRADO","ADELONDRADO","ADELONDRADO","ADELONDRADO","ADELONDRADO","ADELONDRADO","ADELONDRADO","ADELONDRADO","ADELONDRADO","ADELONDRADO","ADELONDRADO","ADELONDRADO","ADELONDRADO","ADELONDRADO","ADELONDRADO","ADELONDRADO","ADELONDRADO","ADELONDRADO","ADELONDRADO","ADELONDRADO","ADELONDRADO","ADELONDRADO","ADELONDRADO","ADELONDRADO","ADELONDRADO","ADELONDRADO","ADELONDRADO","ADELONDRADO","ADELONDRADO","ADELONDRADO","ADELONDRADO","ADELONDRADO","ADELONDRADO","ADELONDRADO","ADELONDRADO","ADELONDRADO","ADELONDRADO","ADELONDRADO","ADELONDRADO","ADELONDRADO","ADELONDRADO","ADELONDRADO","ADELONDRADO","ADELONDRADO","ADELONDRADO","ADELONDRADO","ADELONDRADO","ADELONDRADO","ADELONDRADO","ADELONDRADO","ADELONDRADO","ADELONDRADO","ADELONDRADO","ADELONDRADO","ADELONDRADO","ADELONDRADO","ADELONDRADO","ADELONDRADO","ADELONDRADO","ADELONDRADO","ADELONDRADO","ADELONDRADO","ADELONDRADO","ADELONDRADO","ADELONDRADO","ADELONDRADO","ADELONDRADO","ADELONDRADO","ADELONDRADO","ADELONDRADO","ADELONDRADO","ADELONDRADO","ADELONDRADO","ADELONDRADO","ADELONDRADO","ADELONDRADO","ADELONDRADO","ADELONDRADO","ADELONDRADO","ADELONDRADO","ADELONDRADO","ADELONDRADO","ADELONDRADO","ADELONDRADO","ADELONDRADO","ADELONDRADO","ADELONDRADO","ADELONDRADO","ADELONDRADO","ADELONDRADO","ADELONDRADO","ADELONDRADO","ADELONDRADO","ADELONDRADO","ADELONDRADO","ADELONDRADO","ADELONDRADO","ADELONDRADO","ADELONDRADO","ADELONDRADO","ADELONDRADO","ADELONDRADO","ADELONDRADO","ADELONDRADO","ADELONDRADO","ADELONDRADO","ADELONDRADO","ADELONDRADO","ADELONDRADO","ADELONDRADO","ADELONDRADO","ADELONDRADO","ADELONDRADO","ADELONDRADO","ADELONDRADO","ADELONDRADO","ADELONDRADO","ADELONDRADO","ADELONDRADO","ADELONDRADO","ADELONDRADO","ADELONDRADO","ADELONDRADO","ADELONDRADO","ADELONDRADO","ADELONDRADO","ADELONDRADO","ADELONDRADO","ADELONDRADO","ADELONDRADO","ADELONDRADO","ADELONDRADO","ADELONDRADO","ADELONDRADO","ADELONDRADO","ADELONDRADO","ADELONDRADO","ADELONDRADO","ADELONDRADO","ADELONDRADO","ADELONDRADO","ADELONDRADO","ADELONDRADO","ADELONDRADO","ADELONDRADO","ADELONDRADO","ADELONDRADO","ADELONDRADO","ADELONDRADO","ADELONDRADO","ADELONDRADO","ADELONDRADO","ADELONDRADO","ADELONDRADO","ADELONDRADO","ADELONDRADO","ADELONDRADO","ADELONDRADO","ADELONDRADO","ADELONDRADO","ADELONDRADO","ADELONDRADO","ADELONDRADO","ADELONDRADO","ADELONDRADO","ADELONDRADO","ADELONDRADO","ADELONDRADO","ADELONDRADO","ADELONDRADO","ADELONDRADO","ADELONDRADO","ADELONDRADO","ADELONDRADO","ADELONDRADO","ADELONDRADO","ADELONDRADO","ADELONDRADO","ADELONDRADO","ADELONDRADO","ADELONDRADO","ADELONDRADO","ADELONDRADO","ADELONDRADO","ADELONDRADO","ADELONDRADO","ADELONDRADO","ADELONDRADO","ADELONDRADO","ADELONDRADO","ADELONDRADO","ADELONDRADO","ADELONDRADO","ADELONDRADO","ADELONDRADO","ADELONDRADO","ADELONDRADO","ADELONDRADO","ADELONDRADO","ADELONDRADO","ADELONDRADO","ADELONDRADO","ADELONDRADO","ADELONDRADO","ADELONDRADO","ADELONDRADO","ADELONDRADO","ADELONDRADO","ADELONDRADO","ADELONDRADO","ADELONDRADO","ADELONDRADO","ADELONDRADO","ADELONDRADO","ADELONDRADO","ADELONDRADO","ADELONDRADO","ADELONDRADO","ADELONDRADO","ADELONDRADO","ADELONDRADO","ADELONDRADO","ADELONDRADO","ADELONDRADO","ADELONDRADO","ADELONDRADO","ADELONDRADO","ADELONDRADO","ADELONDRADO","ADELONDRADO","ADELONDRADO","ADELONDRADO","ADELONDRADO","ADELONDRADO","ADELONDRADO","ADELONDRADO","ADELONDRADO","ADELONDRADO","ADELONDRADO","ADELONDRADO","ADELONDRADO","ADELONDRADO","ADELONDRADO","ADELONDRADO","ADELONDRADO","ADELONDRADO","ADELONDRADO","ADELONDRADO","ADELONDRADO","ADELONDRADO","ADELONDRADO","ADELONDRADO","ADELONDRADO","ADELONDRADO","ADELONDRADO","ADELONDRADO","ADELONDRADO","ADELONDRADO","ADELONDRADO","ADELONDRADO","ADELONDRADO","ADELONDRADO","ADELONDRADO","ADELONDRADO","ADELONDRADO","ADELONDRADO","ADELONDRADO","ADELONDRADO","ADELONDRADO","ADELONDRADO","ADELONDRADO","ADELONDRADO","ADELONDRADO","ADELONDRADO","ADELONDRADO","ADELONDRADO","ADELONDRADO","ADELONDRADO","ADELONDRADO","ADELONDRADO","ADELONDRADO","ADELONDRADO","ADELONDRADO","ADELONDRADO","ADELONDRADO","ADELONDRADO","ADELONDRADO","ADELONDRADO","ADELONDRADO","ADELONDRADO","ADELONDRADO","ADELONDRADO","ADELONDRADO","ADELONDRADO","ADELONDRADO","ADELONDRADO","ADELONDRADO","ADELONDRADO","ADELONDRADO","ADELONDRADO","ADELONDRADO","ADELONDRADO","ADELONDRADO","ADELONDRADO","ADELONDRADO","ADELONDRADO","ADELONDRADO","ADELONDRADO","ADELONDRADO","ADELONDRADO","ADELONDRADO","ADELONDRADO","ADELONDRADO","ADELONDRADO","ADELONDRADO","ADELONDRADO","ADELONDRADO","ADELONDRADO","ADELONDRADO","ADELONDRADO","ADELONDRADO","ADELONDRADO","ADELONDRADO","ADELONDRADO","ADELONDRADO","ADELONDRADO","ADELONDRADO","ADELONDRADO","ADELONDRADO","ADELONDRADO","ADELONDRADO","ADELONDRADO","ADELONDRADO","ADELONDRADO","ADELONDRADO","ADELONDRADO","ADELONDRADO","ADELONDRADO","ADELONDRADO","ADELONDRADO","ADELONDRADO","ADELONDRADO","ADELONDRADO","ADELONDRADO","ADELONDRADO","ADELONDRADO","ADELONDRADO","ADELONDRADO","ADELONDRADO","ADELONDRADO","ADELONDRADO","ADELONDRADO","ADELONDRADO","ADELONDRADO","ADELONDRADO","ADELONDRADO","ADELONDRADO","ADELONDRADO","ADELONDRADO","ADELONDRADO","ADELONDRADO","ADELONDRADO","ADELONDRADO","ADELONDRADO","ADELONDRADO","ADELONDRADO","ADELONDRADO","ADELONDRADO","ADELONDRADO","ADELONDRADO","ADELONDRADO","ADELONDRADO","ADELONDRADO","ADELONDRADO","ADELONDRADO","ADELONDRADO","ADELONDRADO","ADELONDRADO","ADELONDRADO","ADELONDRADO","ADELONDRADO","ADELONDRADO","ADELONDRADO","ADELONDRADO","ADELONDRADO","ADELONDRADO","ADELONDRADO","ADELONDRADO","ADELONDRADO","ADELONDRADO","ADELONDRADO","ADELONDRADO","ADELONDRADO","ADELONDRADO","ADELONDRADO","ADELONDRADO","ADELONDRADO","ADELONDRADO","ADELONDRADO","ADELONDRADO","ADELONDRADO","ADELONDRADO","ADELONDRADO","ADELONDRADO","ADELONDRADO","ADELONDRADO","ADELONDRADO","ADELONDRADO","ADELONDRADO","ADELONDRADO","ADELONDRADO","ADELONDRADO","ADELONDRADO","ADELONDRADO","ADELONDRADO","ADELONDRADO","ADELONDRADO","ADELONDRADO","ADELONDRADO","ADELONDRADO","ADELONDRADO","ADELONDRADO","ADELONDRADO","ADELONDRADO","ADELONDRADO","ADELONDRADO","ADELONDRADO","ADELONDRADO","ADELONDRADO","ADELONDRADO","ADELONDRADO","ADELONDRADO","ADELONDRADO","ADELONDRADO","ADELONDRADO","ADELONDRADO","ADELONDRADO","ADELONDRADO","ADELONDRADO","ADELONDRADO","ADELONDRADO","ADELONDRADO","ADELONDRADO","ADELONDRADO","ADELONDRADO","ADELONDRADO","ADELONDRADO","ADELONDRADO","ADELONDRADO","ADELONDRADO","ADELONDRADO","ADELONDRADO","ADELONDRADO","ADELONDRADO","ADELONDRADO","ADELONDRADO","ADELONDRADO","ADELONDRADO","ADELONDRADO","ADELONDRADO","ADELONDRADO","ADELONDRADO","ADELONDRADO","ADELONDRADO","ADELONDRADO","ADELONDRADO","ADELONDRADO","ADELONDRADO","ADELONDRADO","ADELONDRADO","ADELONDRADO","ADELONDRADO","ADELONDRADO","ADELONDRADO","ADELONDRADO","ADELONDRADO","ADELONDRADO","ADELONDRADO","ADELONDRADO","ADELONDRADO","ADELONDRADO","ADELONDRADO","ADELONDRADO","ADELONDRADO","ADELONDRADO","ADELONDRADO","ADELONDRADO","ADELONDRADO","ADELONDRADO","ADELONDRADO","ADELONDRADO","ADELONDRADO","ADELONDRADO","ADELONDRADO","ADELONDRADO","ADELONDRADO","ADELONDRADO","ADELONDRADO","ADELONDRADO","ADELONDRADO","ADELONDRADO","ADELONDRADO","ADELONDRADO","ADELONDRADO","ADELONDRADO","ADELONDRADO","ADELONDRADO","ADELONDRADO","ADELONDRADO","ADELONDRADO","ADELONDRADO","ADELONDRADO","ADELONDRADO","ADELONDRADO","ADELONDRADO","ADELONDRADO","ADELONDRADO","ADELONDRADO","ADELONDRADO","ADELONDRADO","ADELONDRADO","ADELONDRADO","ADELONDRADO","ADELONDRADO","ADELONDRADO","ADELONDRADO","ADELONDRADO","ADELONDRADO","ADELONDRADO","ADELONDRADO","ADELONDRADO","ADELONDRADO","ADELONDRADO","ADELONDRADO","ADELONDRADO","ADELONDRADO","ADELONDRADO","ADELONDRADO","ADELONDRADO","ADELONDRADO","ADELONDRADO","ADELONDRADO","ADELONDRADO","ADELONDRADO","ADELONDRADO","ADELONDRADO","ADELONDRADO","ADELONDRADO","ADELONDRADO","ADELONDRADO","ADELONDRADO","ADELONDRADO","ADELONDRADO","ADELONDRADO","ADELONDRADO","ADELONDRADO","ADELONDRADO","ADELONDRADO","ADELONDRADO","ADELONDRADO","ADELONDRADO","ADELONDRADO","ADELONDRADO","ADELONDRADO","ADELONDRADO","ADELONDRADO","ADELONDRADO","ADELONDRADO","ADELONDRADO","ADELONDRADO","ADELONDRADO","ADELONDRADO","ADELONDRADO","ADELONDRADO","ADELONDRADO","ADELONDRADO","ADELONDRADO","ADELONDRADO","ADELONDRADO","ADELONDRADO","ADELONDRADO","ADELONDRADO","ADELONDRADO","ADELONDRADO","ADELONDRADO","ADELONDRADO","ADELONDRADO","ADELONDRADO","ADELONDRADO","ADELONDRADO","ADELONDRADO","ADELONDRADO","ADELONDRADO","ADELONDRADO","ADELONDRADO","ADELONDRADO","ADELONDRADO","ADELONDRADO","ADELONDRADO","ADELONDRADO","ADELONDRADO","ADELONDRADO","ADELONDRADO","ADELONDRADO","ADELONDRADO","ADELONDRADO","ADELONDRADO","ADELONDRADO","ADELONDRADO","ADELONDRADO","ADELONDRADO","ADELONDRADO","ADELONDRADO","ADELONDRADO","ADELONDRADO","ADELONDRADO","ADELONDRADO","ADELONDRADO","ADELONDRADO","ADELONDRADO","ADELONDRADO","ADELONDRADO","ADELONDRADO","ADELONDRADO","ADELONDRADO","ADELONDRADO","ADELONDRADO","ADELONDRADO","ADELONDRADO","ADELONDRADO","ADELONDRADO","ADELONDRADO","ADELONDRADO","ADELONDRADO","ADELONDRADO","ADELONDRADO","ADELONDRADO","ADELONDRADO","ADELONDRADO","ADELONDRADO","ADELONDRADO","ADELONDRADO","ADELONDRADO","ADELONDRADO","ADELONDRADO","ADELONDRADO","ADELONDRADO","ADELONDRADO","ADELONDRADO","ADELONDRADO","ADELONDRADO","ADELONDRADO","ADELONDRADO","ADELONDRADO","ADELONDRADO","ADELONDRADO","ADELONDRADO","ADELONDRADO","ADELONDRADO","ADELONDRADO","ADELONDRADO","ADELONDRADO","ADELONDRADO","ADELONDRADO","ADELONDRADO","ADELONDRADO","ADELONDRADO","ADELONDRADO","ADELONDRADO","ADELONDRADO","ADELONDRADO","ADELONDRADO","ADELONDRADO","ADELONDRADO","ADELONDRADO","ADELONDRADO","ADELONDRADO","ADELONDRADO","ADELONDRADO","ADELONDRADO","ADELONDRADO","ADELONDRADO","ADELONDRADO","ADELONDRADO","ADELONDRADO","ADELONDRADO","ADELONDRADO","ADELONDRADO","ADELONDRADO","ADELONDRADO","ADELONDRADO","ADELONDRADO","ADELONDRADO","ADELONDRADO","ADELONDRADO","ADELONDRADO","ADELONDRADO","ADELONDRADO","ADELONDRADO","ADELONDRADO","ADELONDRADO","ADELONDRADO","ADELONDRADO","ADELONDRADO","ADELONDRADO","ADELONDRADO","ADELONDRADO","ADELONDRADO","ADELONDRADO","ADELONDRADO","ADELONDRADO","ADELONDRADO","ADELONDRADO","ADELONDRADO","ADELONDRADO","ADELONDRADO","ADELONDRADO","ADELONDRADO","ADELONDRADO","ADELONDRADO","ADELONDRADO","ADELONDRADO","ADELONDRADO","ADELONDRADO","ADELONDRADO","ADELONDRADO","ADELONDRADO","ADELONDRADO","ADELONDRADO","ADELONDRADO","ADELONDRADO","ADELONDRADO","ADELONDRADO","ADELONDRADO","ADELONDRADO","ADELONDRADO","ADELONDRADO","ADELONDRADO","ADELONDRADO","ADELONDRADO","ADELONDRADO","ADELONDRADO","ADELONDRADO","ADELONDRADO","ADELONDRADO","ADELONDRADO","ADELONDRADO","ADELONDRADO","ADELONDRADO","ADELONDRADO","ADELONDRADO","ADELONDRADO","ADELONDRADO","ADELONDRADO","ADELONDRADO","ADELONDRADO","ADELONDRADO","ADELONDRADO","ADELONDRADO","ADELONDRADO","ADELONDRADO","ADELONDRADO","ADELONDRADO","ADELONDRADO","ADELONDRADO","ADELONDRADO","ADELONDRADO","ADELONDRADO","ADELONDRADO","ADELONDRADO","ADELONDRADO","ADELONDRADO","ADELONDRADO","ADELONDRADO","ADELONDRADO","ADELONDRADO","ADELONDRADO","ADELONDRADO","ADELONDRADO","ADELONDRADO","ADELONDRADO","ADELONDRADO","ADELONDRADO","ADELONDRADO","ADELONDRADO","ADELONDRADO","ADELONDRADO","ADELONDRADO","ADELONDRADO","ADELONDRADO","ADELONDRADO","ADELONDRADO","ADELONDRADO","ADELONDRADO","ADELONDRADO","ADELONDRADO","ADELONDRADO","ADELONDRADO","ADELONDRADO","ADELONDRADO","ADELONDRADO","ADELONDRADO","ADELONDRADO","ADELONDRADO","ADELONDRADO","ADELONDRADO","ADELONDRADO","ADELONDRADO","ADELONDRADO","ADELONDRADO","ADELONDRADO","ADELONDRADO","ADELONDRADO","ADELONDRADO","ADELONDRADO","ADELONDRADO","ADELONDRADO","ADELONDRADO","ADELONDRADO","ADELONDRADO","ADELONDRADO","ADELONDRADO","ADELONDRADO","ADELONDRADO","ADELONDRADO","ADELONDRADO","ADELONDRADO","ADELONDRADO","ADELONDRADO","ADELONDRADO","ADELONDRADO","ADELONDRADO","ADELONDRADO","ADELONDRADO","ADELONDRADO","ADELONDRADO","ADELONDRADO","ADELONDRADO","ADELONDRADO","ADELONDRADO","ADELONDRADO","ADELONDRADO","ADELONDRADO","ADELONDRADO","ADELONDRADO","ADELONDRADO","ADELONDRADO","ADELONDRADO","ADELONDRADO","ADELONDRADO","ADELONDRADO","ADELONDRADO","ADELONDRADO","ADELONDRADO","ADELONDRADO","ADELONDRADO","ADELONDRADO","ADELONDRADO","ADELONDRADO","ADELONDRADO","ADELONDRADO","ADELONDRADO","ADELONDRADO","ADELONDRADO","ADELONDRADO","ADELONDRADO","ADELONDRADO","ADELONDRADO","ADELONDRADO","ADELONDRADO","ADELONDRADO","ADELONDRADO","ADELONDRADO","ADELONDRADO","ADELONDRADO","ADELONDRADO","ADELONDRADO","ADELONDRADO","ADELONDRADO","ADELONDRADO","ADELONDRADO","ADELONDRADO","ADELONDRADO","ADELONDRADO","ADELONDRADO","ADELONDRADO","ADELONDRADO","ADELONDRADO","ADELONDRADO","ADELONDRADO","ADELONDRADO","ADELONDRADO","ADELONDRADO","ADELONDRADO","ADELONDRADO","ADELONDRADO","ADELONDRADO","ADELONDRADO","ADELONDRADO","ADELONDRADO","ADELONDRADO","ADELONDRADO","ADELONDRADO","ADELONDRADO","ADELONDRADO","ADELONDRADO","ADELONDRADO","ADELONDRADO","ADELONDRADO","ADELONDRADO","ADELONDRADO","ADELONDRADO","ADELONDRADO","ADELONDRADO","ADELONDRADO","ADELONDRADO","ADELONDRADO","ADELONDRADO","ADELONDRADO","ADELONDRADO","ADELONDRADO","ADELONDRADO","ADELONDRADO","ADELONDRADO","ADELONDRADO","ADELONDRADO","ADELONDRADO","ADELONDRADO","ADELONDRADO","ADELONDRADO","ADELONDRADO","ADELONDRADO","ADELONDRADO","ADELONDRADO","ADELONDRADO","ADELONDRADO","ADELONDRADO","ADELONDRADO","ADELONDRADO","ADELONDRADO","ADELONDRADO","ADELONDRADO","ADELONDRADO","ADELONDRADO","ADELONDRADO","ADELONDRADO","ADELONDRADO","ADELONDRADO","ADELONDRADO","ADELONDRADO","ADELONDRADO","ADELONDRADO","ADELONDRADO","ADELONDRADO","ADELONDRADO","ADELONDRADO","ADELONDRADO","ADELONDRADO","ADELONDRADO","ADELONDRADO","ADELONDRADO","ADELONDRADO","ADELONDRADO","ADELONDRADO","ADELONDRADO","ADELONDRADO","ADELONDRADO","ADELONDRADO","ADELONDRADO","ADELONDRADO","ADELONDRADO","ADELONDRADO","ADELONDRADO","ADELONDRADO","ADELONDRADO","ADELONDRADO","ADELONDRADO","ADELONDRADO","ADELONDRADO","ADELONDRADO","ADELONDRADO","ADELONDRADO","ADELONDRADO","ADELONDRADO","ADELONDRADO","ADELONDRADO","ADELONDRADO","ADELONDRADO","ADELONDRADO","ADELONDRADO","ADELONDRADO","ADELONDRADO","ADELONDRADO","ADELONDRADO","ADELONDRADO","ADELONDRADO","ADELONDRADO","ADELONDRADO","ADELONDRADO","ADELONDRADO","ADELONDRADO","ADELONDRADO","ADELONDRADO","ADELONDRADO","ADELONDRADO","ADELONDRADO","ADELONDRADO","ADELONDRADO","ADELONDRADO","ADELONDRADO","ADELONDRADO","ADELONDRADO","ADELONDRADO","ADELONDRADO","ADELONDRADO","ADELONDRADO","ADELONDRADO","ADELONDRADO","ADELONDRADO","ADELONDRADO","ADELONDRADO","ADELONDRADO","ADELONDRADO","ADELONDRADO","ADELONDRADO","ADELONDRADO","ADELONDRADO","ADELONDRADO","ADELONDRADO","ADELONDRADO","ADELONDRADO","ADELONDRADO","ADELONDRADO","ADELONDRADO","ADELONDRADO","ADELONDRADO","ADELONDRADO","ADELONDRADO","ADELONDRADO","ADELONDRADO","ADELONDRADO","ADELONDRADO","ADELONDRADO","ADELONDRADO","ADELONDRADO","ADELONDRADO","ADELONDRADO","ADELONDRADO","ADELONDRADO","ADELONDRADO","ADELONDRADO","ADELONDRADO","ADELONDRADO","ADELONDRADO","ADELONDRADO","ADELONDRADO","ADELONDRADO","ADELONDRADO","ADELONDRADO","ADELONDRADO","ADELONDRADO","ADELONDRADO","ADELONDRADO","ADELONDRADO","ADELONDRADO","ADELONDRADO","ADELONDRADO","ADELONDRADO","ADELONDRADO","ADELONDRADO","ADELONDRADO","ADELONDRADO","ADELONDRADO","ADELONDRADO","ADELONDRADO","ADELONDRADO","ADELONDRADO","ADELONDRADO","ADELONDRADO","ADELONDRADO","ADELONDRADO","ADELONDRADO","ADELONDRADO","ADELONDRADO","ADELONDRADO","ADELONDRADO","ADELONDRADO","ADELONDRADO","ADELONDRADO","ADELONDRADO","ADELONDRADO","ADELONDRADO","ADELONDRADO","ADELONDRADO","ADELONDRADO","ADELONDRADO","ADELONDRADO","ADELONDRADO","ADELONDRADO","ADELONDRADO","ADELONDRADO","ADELONDRADO","ADELONDRADO","ADELONDRADO","ADELONDRADO","ADELONDRADO","ADELONDRADO","ADELONDRADO","ADELONDRADO","ADELONDRADO","ADELONDRADO","ADELONDRADO","ADELONDRADO","ADELONDRADO","ADELONDRADO","ADELONDRADO","ADELONDRADO","ADELONDRADO","ADELONDRADO","ADELONDRADO","ADELONDRADO","ADELONDRADO","ADELONDRADO","ADELONDRADO","ADELONDRADO","ADELONDRADO","ADELONDRADO","ADELONDRADO","ADELONDRADO","ADELONDRADO","ADELONDRADO","ADELONDRADO","ADELONDRADO","ADELONDRADO","ADELONDRADO","ADELONDRADO","ADELONDRADO","ADELONDRADO","ADELONDRADO","ADELONDRADO","ADELONDRADO","ADELONDRADO","ADELONDRADO","ADELONDRADO","ADELONDRADO","ADELONDRADO","ADELONDRADO","ADELONDRADO","ADELONDRADO","ADELONDRADO","ADELONDRADO","ADELONDRADO","ADELONDRADO","ADELONDRADO","ADELONDRADO","ADELONDRADO","ADELONDRADO","ADELONDRADO","ADELONDRADO","ADELONDRADO","ADELONDRADO","ADELONDRADO","ADELONDRADO","ADELONDRADO","ADELONDRADO","ADELONDRADO","ADELONDRADO","ADELONDRADO","ADELONDRADO","ADELONDRADO","ADELONDRADO","ADELONDRADO","ADELONDRADO","ADELONDRADO","ADELONDRADO","ADELONDRADO","ADELONDRADO","ADELONDRADO","ADELONDRADO","ADELONDRADO","ADELONDRADO","ADELONDRADO","ADELONDRADO","ADELONDRADO","ADELONDRADO","ADELONDRADO","ADELONDRADO","ADELONDRADO","ADELONDRADO","ADELONDRADO","ADELONDRADO","ADELONDRADO","ADELONDRADO","ADELONDRADO","ADELONDRADO","ADELONDRADO","ADELONDRADO","ADELONDRADO","ADELONDRADO","ADELONDRADO","ADELONDRADO","ADELONDRADO","ADELONDRADO","ADELONDRADO","ADELONDRADO","ADELONDRADO","ADELONDRADO","ADELONDRADO","ADELONDRADO","ADELONDRADO","ADELONDRADO","ADELONDRADO","ADELONDRADO","ADELONDRADO","ADELONDRADO","ADELONDRADO","ADELONDRADO","ADELONDRADO","ADELONDRADO","ADELONDRADO","ADELONDRADO","ADELONDRADO","ADELONDRADO","ADELONDRADO","ADELONDRADO","ADELONDRADO","ADELONDRADO","ADELONDRADO","ADELONDRADO","ADELONDRADO","ADELONDRADO","ADELONDRADO","ADELONDRADO","ADELONDRADO","ADELONDRADO","ADELONDRADO","ADELONDRADO","ADELONDRADO","ADELONDRADO","ADELONDRADO","ADELONDRADO","ADELONDRADO","ADELONDRADO","ADELONDRADO","ADELONDRADO","ADELONDRADO","ADELONDRADO","ADELONDRADO","ADELONDRADO","ADELONDRADO","ADELONDRADO","ADELONDRADO","ADELONDRADO","ADELONDRADO","ADELONDRADO","ADELONDRADO","ADELONDRADO","ADELONDRADO","ADELONDRADO","ADELONDRADO","ADELONDRADO","ADELONDRADO","ADELONDRADO","ADELONDRADO","ADELONDRADO","ADELONDRADO","ADELONDRADO","ADELONDRADO","ADELONDRADO","ADELONDRADO","ADELONDRADO","ADELONDRADO","ADELONDRADO","ADELONDRADO","ADELONDRADO","ADELONDRADO","ADELONDRADO","ADELONDRADO","ADELONDRADO","ADELONDRADO","ADELONDRADO","ADELONDRADO","ADELONDRADO","ADELONDRADO","ADELONDRADO","ADELONDRADO","ADELONDRADO","ADELONDRADO","ADELONDRADO","ADELONDRADO","ADELONDRADO","ADELONDRADO","ADELONDRADO","ADELONDRADO","ADELONDRADO","ADELONDRADO","ADELONDRADO","ADELONDRADO","ADELONDRADO","ADELONDRADO","ADELONDRADO","ADELONDRADO","ADELONDRADO","ADELONDRADO","ADELONDRADO","ADELONDRADO","ADELONDRADO","ADELONDRADO","ADELONDRADO","ADELONDRADO","ADELONDRADO","ADELONDRADO","ADELONDRADO","ADELONDRADO","ADELONDRADO","ADELONDRADO","ADELONDRADO","ADELONDRADO","ADELONDRADO","ADELONDRADO","ADELONDRADO","ADELONDRADO","ADELONDRADO","ADELONDRADO","ADELONDRADO","ADELONDRADO","ADELONDRADO","ADELONDRADO","ADELONDRADO","ADELONDRADO","ADELONDRADO","ADELONDRADO","ADELONDRADO","ADELONDRADO","ADELONDRADO","ADELONDRADO","ADELONDRADO","ADELONDRADO","ADELONDRADO","ADELONDRADO","ADELONDRADO","ADELONDRADO","ADELONDRADO","ADELONDRADO","ADELONDRADO","ADELONDRADO","ADELONDRADO","ADELONDRADO","ADELONDRADO","ADELONDRADO","ADELONDRADO","ADELONDRADO","ADELONDRADO","ADELONDRADO","ADELONDRADO","ADELONDRADO","ADELONDRADO","ADELONDRADO","ADELONDRADO","ADELONDRADO","ADELONDRADO","ADELONDRADO","ADELONDRADO","ADELONDRADO","ADELONDRADO","ADELONDRADO","ADELONDRADO","ADELONDRADO","ADELONDRADO","ADELONDRADO","ADELONDRADO","ADELONDRADO","ADELONDRADO","ADELONDRADO","ADELONDRADO","ADELONDRADO","ADELONDRADO","ADELONDRADO","ADELONDRADO","ADELONDRADO","ADELONDRADO","ADELONDRADO","ADELONDRADO","ADELONDRADO","ADELONDRADO","ADELONDRADO","ADELONDRADO","ADELONDRADO","ADELONDRADO","ADELONDRADO","ADELONDRADO","ADELONDRADO","ADELONDRADO","ADELONDRADO","ADELONDRADO","ADELONDRADO","ADELONDRADO","ADELONDRADO","ADELONDRADO","ADELONDRADO","ADELONDRADO","ADELONDRADO","ADELONDRADO","ADELONDRADO","ADELONDRADO","ADELONDRADO","ADELONDRADO","ADELONDRADO","ADELONDRADO","ADELONDRADO","ADELONDRADO","ADELONDRADO","ADELONDRADO","ADELONDRADO","ADELONDRADO","ADELONDRADO","ADELONDRADO","ADELONDRADO","ADELONDRADO","ADELONDRADO","ADELONDRADO","ADELONDRADO","ADELONDRADO","ADELONDRADO","ADELONDRADO","ADELONDRADO","ADELONDRADO","ADELONDRADO","ADELONDRADO","ADELONDRADO","ADELONDRADO","ADELONDRADO","ADELONDRADO","ADELONDRADO","ADELONDRADO","ADELONDRADO","ADELONDRADO","ADELONDRADO","ADELONDRADO","ADELONDRADO","ADELONDRADO","ADELONDRADO","ADELONDRADO","ADELONDRADO","ADELONDRADO","ADELONDRADO","ADELONDRADO","ADELONDRADO","ADELONDRADO","ADELONDRADO","ADELONDRADO","ADELONDRADO","ADELONDRADO","ADELONDRADO","ADELONDRADO","ADELONDRADO","ADELONDRADO","ADELONDRADO","ADELONDRADO","ADELONDRADO","ADELONDRADO","ADELONDRADO","ADELONDRADO","ADELONDRADO","ADELONDRADO","ADELONDRADO","ADELONDRADO","ADELONDRADO","ADELONDRADO","ADELONDRADO","ADELONDRADO","ADELONDRADO","ADELONDRADO","ADELONDRADO","ADELONDRADO","ADELONDRADO","ADELONDRADO","ADELONDRADO","ADELONDRADO","ADELONDRADO","ADELONDRADO","ADELONDRADO","ADELONDRADO","ADELONDRADO","ADELONDRADO","ADELONDRADO","ADELONDRADO","ADELONDRADO","ADELONDRADO","ADELONDRADO","ADELONDRADO","ADELONDRADO","ADELONDRADO","ADELONDRADO","ADELONDRADO","ADELONDRADO","ADELONDRADO","ADELONDRADO","ADELONDRADO","ADELONDRADO","ADELONDRADO","ADELONDRADO","ADELONDRADO","ADELONDRADO","ADELONDRADO","ADELONDRADO","ADELONDRADO","ADELONDRADO","ADELONDRADO","ADELONDRADO","ADELONDRADO","ADELONDRADO","ADELONDRADO","ADELONDRADO","ADELONDRADO","ADELONDRADO","ADELONDRADO","ADELONDRADO","ADELONDRADO","ADELONDRADO","ADELONDRADO","ADELONDRADO","ADELONDRADO","ADELONDRADO","ADELONDRADO","ADELONDRADO","ADELONDRADO","ADELONDRADO","ADELONDRADO","ADELONDRADO","ADELONDRADO","ADELONDRADO","ADELONDRADO","ADELONDRADO","ADELONDRADO","ADELONDRADO","ADELONDRADO","ADELONDRADO","ADELONDRADO","ADELONDRADO","ADELONDRADO","ADELONDRADO","ADELONDRADO","ADELONDRADO","ADELONDRADO","ADELONDRADO","ADELONDRADO","ADELONDRADO","ADELONDRADO","ADELONDRADO","ADELONDRADO","ADELONDRADO","ADELONDRADO","ADELONDRADO","ADELONDRADO","ADELONDRADO","ADELONDRADO","ADELONDRADO","ADELONDRADO","ADELONDRADO","ADELONDRADO","ADELONDRADO","ADELONDRADO","ADELONDRADO","ADELONDRADO","ADELONDRADO","ADELONDRADO","ADELONDRADO","ADELONDRADO","ADELONDRADO","ADELONDRADO","ADELONDRADO","ADELONDRADO","ADELONDRADO","ADELONDRADO","ADELONDRADO","ADELONDRADO","ADELONDRADO","ADELONDRADO","ADELONDRADO","ADELONDRADO","ADELONDRADO","ADELONDRADO","ADELONDRADO","ADELONDRADO","ADELONDRADO","ADELONDRADO","ADELONDRADO","ADELONDRADO","ADELONDRADO","ADELONDRADO","ADELONDRADO","ADELONDRADO","ADELONDRADO","ADELONDRADO","ADELONDRADO","ADELONDRADO","ADELONDRADO","ADELONDRADO","ADELONDRADO","ADELONDRADO","ADELONDRADO","ADELONDRADO","ADELONDRADO","ADELONDRADO","ADELONDRADO","ADELONDRADO","ADELONDRADO","ADELONDRADO","ADELONDRADO","ADELONDRADO","ADELONDRADO","ADELONDRADO","ADELONDRADO","ADELONDRADO","ADELONDRADO","ADELONDRADO","ADELONDRADO","ADELONDRADO","ADELONDRADO","ADELONDRADO","ADELONDRADO","ADELONDRADO","ADELONDRADO","ADELONDRADO","ADELONDRADO","ADELONDRADO","ADELONDRADO","ADELONDRADO","ADELONDRADO","ADELONDRADO","ADELONDRADO","ADELONDRADO","ADELONDRADO","ADELONDRADO","ADELONDRADO","ADELONDRADO","ADELONDRADO","ADELONDRADO","ADELONDRADO","ADELONDRADO","ADELONDRADO","ADELONDRADO","ADELONDRADO","ADELONDRADO","ADELONDRADO","ADELONDRADO","ADELONDRADO","ADELONDRADO","ADELONDRADO","ADELONDRADO","ADELONDRADO","ADELONDRADO","ADELONDRADO","ADELONDRADO","ADELONDRADO","ADELONDRADO","ADELONDRADO","ADELONDRADO","ADELONDRADO","ADELONDRADO","ADELONDRADO","ADELONDRADO","ADELONDRADO","ADELONDRADO","ADELONDRADO","ADELONDRADO","ADELONDRADO","ADELONDRADO","ADELONDRADO","ADELONDRADO","ADELONDRADO","ADELONDRADO","ADELONDRADO","ADELONDRADO","ADELONDRADO","ADELONDRADO","ADELONDRADO","ADELONDRADO","ADELONDRADO","ADELONDRADO","ADELONDRADO","ADELONDRADO","ADELONDRADO","ADELONDRADO","ADELONDRADO","ADELONDRADO","ADELONDRADO","ADELONDRADO","ADELONDRADO","ADELONDRADO","ADELONDRADO","ADELONDRADO","ADELONDRADO","ADELONDRADO","ADELONDRADO","ADELONDRADO","ADELONDRADO","ADELONDRADO","ADELONDRADO","ADELONDRADO","ADELONDRADO","ADELONDRADO","ADELONDRADO","ADELONDRADO","ADELONDRADO","ADELONDRADO","ADELONDRADO","ADELONDRADO","ADELONDRADO","ADELONDRADO","ADELONDRADO","ADELONDRADO","ADELONDRADO","ADELONDRADO","ADELONDRADO","ADELONDRADO","ADELONDRADO","ADELONDRADO","ADELONDRADO","ADELONDRADO","ADELONDRADO","ADELONDRADO","ADELONDRADO","ADELONDRADO","ADELONDRADO","ADELONDRADO","ADELONDRADO","ADELONDRADO","ADELONDRADO","ADELONDRADO","ADELONDRADO","ADELONDRADO","ADELONDRADO","ADELONDRADO","ADELONDRADO","ADELONDRADO","ADELONDRADO","ADELONDRADO","ADELONDRADO","ADELONDRADO","ADELONDRADO","ADELONDRADO","ADELONDRADO","ADELONDRADO","ADELONDRADO","ADELONDRADO","ADELONDRADO","ADELONDRADO","ADELONDRADO","ADELONDRADO","ADELONDRADO","ADELONDRADO","ADELONDRADO","ADELONDRADO","ADELONDRADO","ADELONDRADO","ADELONDRADO","ADELONDRADO","ADELONDRADO","ADELONDRADO","ADELONDRADO","ADELONDRADO","ADELONDRADO","ADELONDRADO","ADELONDRADO","ADELONDRADO","ADELONDRADO","ADELONDRADO","ADELONDRADO","ADELONDRADO","ADELONDRADO","ADELONDRADO","ADELONDRADO","ADELONDRADO","ADELONDRADO","ADELONDRADO","ADELONDRADO","ADELONDRADO","ADELONDRADO","ADELONDRADO","ADELONDRADO","ADELONDRADO","ADELONDRADO","ADELONDRADO","ADELONDRADO","ADELONDRADO","ADELONDRADO","ADELONDRADO","ADELONDRADO","ADELONDRADO","ADELONDRADO","ADELONDRADO","ADELONDRADO","ADELONDRADO","ADELONDRADO","ADELONDRADO","ADELONDRADO","ADELONDRADO","ADELONDRADO","ADELONDRADO","ADELONDRADO","ADELONDRADO","ADELONDRADO","ADELONDRADO","ADELONDRADO","ADELONDRADO","ADELONDRADO","ADELONDRADO","ADELONDRADO","ADELONDRADO","ADELONDRADO","ADELONDRADO","ADELONDRADO","ADELONDRADO","ADELONDRADO","ADELONDRADO","ADELONDRADO","ADELONDRADO","ADELONDRADO","ADELONDRADO","ADELONDRADO","ADELONDRADO","ADELONDRADO","ADELONDRADO","ADELONDRADO","ADELONDRADO","ADELONDRADO","ADELONDRADO","ADELONDRADO","ADELONDRADO","ADELONDRADO","ADELONDRADO","ADELONDRADO","ADELONDRADO","ADELONDRADO","ADELONDRADO","ADELONDRADO","ADELONDRADO","ADELONDRADO","ADELONDRADO","ADELONDRADO","ADELONDRADO","ADELONDRADO","ADELONDRADO","ADELONDRADO","ADELONDRADO","ADELONDRADO","ADELONDRADO","ADELONDRADO","ADELONDRADO","ADELONDRADO","ADELONDRADO","ADELONDRADO","ADELONDRADO","ADELONDRADO","ADELONDRADO","ADELONDRADO","ADELONDRADO","ADELONDRADO","ADELONDRADO","ADELONDRADO","ADELONDRADO","ADELONDRADO","ADELONDRADO","ADELONDRADO","ADELONDRADO","ADELONDRADO","ADELONDRADO","ADELONDRADO","ADELONDRADO","ADELONDRADO","ADELONDRADO","ADELONDRADO","ADELONDRADO","ADELONDRADO","ADELONDRADO","ADELONDRADO","ADELONDRADO","ADELONDRADO","ADELONDRADO","ADELONDRADO","ADELONDRADO","ADELONDRADO","ADELONDRADO","ADELONDRADO","ADELONDRADO","ADELONDRADO","ADELONDRADO","ADELONDRADO","ADELONDRADO","ADELONDRADO","ADELONDRADO","ADELONDRADO","ADELONDRADO","ADELONDRADO","ADELONDRADO","ADELONDRADO","ADELONDRADO","ADELONDRADO","ADELONDRADO","ADELONDRADO","ADELONDRADO","ADELONDRADO","ADELONDRADO","ADELONDRADO","ADELONDRADO","ADELONDRADO","ADELONDRADO","ADELONDRADO","ADELONDRADO","ADELONDRADO","ADELONDRADO","ADELONDRADO","ADELONDRADO","ADELONDRADO","ADELONDRADO","ADELONDRADO","ADELONDRADO","ADELONDRADO","ADELONDRADO","ADELONDRADO","ADELONDRADO","ADELONDRADO","ADELONDRADO","ADELONDRADO","ADELONDRADO","ADELONDRADO","ADELONDRADO","ADELONDRADO","ADELONDRADO","ADELONDRADO","ADELONDRADO","ADELONDRADO","ADELONDRADO","ADELONDRADO","ADELONDRADO","ADELONDRADO","ADELONDRADO","ADELONDRADO","ADELONDRADO","ADELONDRADO","ADELONDRADO","ADELONDRADO","ADELONDRADO","ADELONDRADO","ADELONDRADO","ADELONDRADO","ADELONDRADO","ADELONDRADO","ADELONDRADO","ADELONDRADO","ADELONDRADO","ADELONDRADO","ADELONDRADO","ADELONDRADO","ADELONDRADO","ADELONDRADO","ADELONDRADO","ADELONDRADO","ADELONDRADO","ADELONDRADO","ADELONDRADO","ADELONDRADO","ADELONDRADO","ADELONDRADO","ADELONDRADO","ADELONDRADO","ADELONDRADO","ADELONDRADO","ADELONDRADO","ADELONDRADO","ADELONDRADO","ADELONDRADO","ADELONDRADO","ADELONDRADO","ADELONDRADO","ADELONDRADO","ADELONDRADO","ADELONDRADO","ADELONDRADO","ADELONDRADO","ADELONDRADO","ADELONDRADO","ADELONDRADO","ADELONDRADO","ADELONDRADO","ADELONDRADO","ADELONDRADO","ADELONDRADO","ADELONDRADO","ADELONDRADO","ADELONDRADO","ADELONDRADO","ADELONDRADO","ADELONDRADO","ADELONDRADO","ADELONDRADO","ADELONDRADO","ADELONDRADO","ADELONDRADO","ADELONDRADO","ADELONDRADO","ADELONDRADO","ADELONDRADO","ADELONDRADO","ADELONDRADO","ADELONDRADO","ADELONDRADO","ADELONDRADO","ADELONDRADO","ADELONDRADO","ADELONDRADO","ADELONDRADO","ADELONDRADO","ADELONDRADO","ADELONDRADO","ADELONDRADO","ADELONDRADO","ADELONDRADO","ADELONDRADO","ADELONDRADO","ADELONDRADO","ADELONDRADO","ADELONDRADO","ADELONDRADO","ADELONDRADO","ADELONDRADO","ADELONDRADO","ADELONDRADO","ADELONDRADO","ADELONDRADO","ADELONDRADO","ADELONDRADO","ADELONDRADO","ADELONDRADO","ADELONDRADO","ADELONDRADO","ADELONDRADO","ADELONDRADO","ADELONDRADO","ADELONDRADO","ADELONDRADO","ADELONDRADO","ADELONDRADO","ADELONDRADO","ADELONDRADO","ADELONDRADO","ADELONDRADO","ADELONDRADO","ADELONDRADO","ADELONDRADO","ADELONDRADO","ADELONDRADO","ADELONDRADO","ADELONDRADO","ADELONDRADO","ADELONDRADO","ADELONDRADO","ADELONDRADO","ADELONDRADO","ADELONDRADO","ADELONDRADO","ADELONDRADO","ADELONDRADO","ADELONDRADO","ADELONDRADO","ADELONDRADO","ADELONDRADO","ADELONDRADO","ADELONDRADO","ADELONDRADO","ADELONDRADO","ADELONDRADO","ADELONDRADO","ADELONDRADO","ADELONDRADO","ADELONDRADO","ADELONDRADO","ADELONDRADO","ADELONDRADO","ADELONDRADO","ADELONDRADO","ADELONDRADO","ADELONDRADO","ADELONDRADO","ADELONDRADO","ADELONDRADO","ADELONDRADO","ADELONDRADO","ADELONDRADO","ADELONDRADO","ADELONDRADO","ADELONDRADO","ADELONDRADO","ADELONDRADO","ADELONDRADO","ADELONDRADO","ADELONDRADO","ADELONDRADO","ADELONDRADO","ADELONDRADO","ADELONDRADO","ADELONDRADO","ADELONDRADO","ADELONDRADO","ADELONDRADO","ADELONDRADO","ADELONDRADO","ADELONDRADO","ADELONDRADO","ADELONDRADO","ADELONDRADO","ADELONDRADO","ADELONDRADO","ADELONDRADO","ADELONDRADO","ADELONDRADO","ADELONDRADO","ADELONDRADO","ADELONDRADO","ADELONDRADO","ADELONDRADO","ADELONDRADO","ADELONDRADO","ADELONDRADO","ADELONDRADO","ADELONDRADO","ADELONDRADO","ADELONDRADO","ADELONDRADO","ADELONDRADO","ADELONDRADO","ADELONDRADO","ADELONDRADO","ADELONDRADO","ADELONDRADO","ADELONDRADO","ADELONDRADO","ADELONDRADO","ADELONDRADO","ADELONDRADO","ADELONDRADO","ADELONDRADO","ADELONDRADO","ADELONDRADO","ADELONDRADO","ADELONDRADO","ADELONDRADO","ADELONDRADO","ADELONDRADO","ADELONDRADO","ADELONDRADO","ADELONDRADO","ADELONDRADO","ADELONDRADO","ADELONDRADO","ADELONDRADO","ADELONDRADO","ADELONDRADO","ADELONDRADO","ADELONDRADO","ADELONDRADO","ADELONDRADO","ADELONDRADO","ADELONDRADO","ADELONDRADO","ADELONDRADO","ADELONDRADO","ADELONDRADO","ADELONDRADO","ADELONDRADO","ADELONDRADO","ADELONDRADO","ADELONDRADO","ADELONDRADO","ADELONDRADO","ADELONDRADO","ADELONDRADO","ADELONDRADO","ADELONDRADO","ADELONDRADO","ADELONDRADO","ADELONDRADO","ADELONDRADO","ADELONDRADO","ADELONDRADO","ADELONDRADO","ADELONDRADO","ADELONDRADO","ADELONDRADO","ADELONDRADO","ADELONDRADO","ADELONDRADO","ADELONDRADO","ADELONDRADO","ADELONDRADO","ADELONDRADO","ADELONDRADO","ADELONDRADO","ADELONDRADO","ADELONDRADO","ADELONDRADO","ADELONDRADO","ADELONDRADO","ADELONDRADO","ADELONDRADO","ADELONDRADO","ADELONDRADO","ADELONDRADO","ADELONDRADO","ADELONDRADO","ADELONDRADO","ADELONDRADO","ADELONDRADO","ADELONDRADO","ADELONDRADO","ADELONDRADO","ADELONDRADO","ADELONDRADO","ADELONDRADO","ADELONDRADO","ADELONDRADO","ADELONDRADO","ADELONDRADO","ADELONDRADO","ADELONDRADO","ADELONDRADO","ADELONDRADO","ADELONDRADO","ADELONDRADO","ADELONDRADO","ADELONDRADO","ADELONDRADO","ADELONDRADO","ADELONDRADO","ADELONDRADO","ADELONDRADO","ADELONDRADO","ADELONDRADO","ADELONDRADO","ADELONDRADO","ADELONDRADO","ADELONDRADO","ADELONDRADO","ADELONDRADO","ADELONDRADO","ADELONDRADO","ADELONDRADO","ADELONDRADO","ADELONDRADO","ADELONDRADO","ADELONDRADO","ADELONDRADO","ADELONDRADO","ADELONDRADO","ADELONDRADO","ADELONDRADO","ADELONDRADO","ADELONDRADO","ADELONDRADO","ADELONDRADO","ADELONDRADO","ADELONDRADO","ADELONDRADO","ADELONDRADO","ADELONDRADO","ADELONDRADO","ADELONDRADO","ADELONDRADO","ADELONDRADO","ADELONDRADO","ADELONDRADO","ADELONDRADO","ADELONDRADO","ADELONDRADO","ADELONDRADO","ADELONDRADO","ADELONDRADO","ADELONDRADO","ADELONDRADO","ADELONDRADO","ADELONDRADO","ADELONDRADO","ADELONDRADO","ADELONDRADO","ADELONDRADO","ADELONDRADO","ADELONDRADO","ADELONDRADO","ADELONDRADO","ADELONDRADO","ADELONDRADO","ADELONDRADO","ADELONDRADO","ADELONDRADO","ADELONDRADO","ADELONDRADO","ADELONDRADO","ADELONDRADO","ADELONDRADO","ADELONDRADO","ADELONDRADO","ADELONDRADO","ADELONDRADO","ADELONDRADO","ADELONDRADO","ADELONDRADO","ADELONDRADO","ADELONDRADO","ADELONDRADO","ADELONDRADO","ADELONDRADO","ADELONDRADO","ADELONDRADO","ADELONDRADO","ADELONDRADO","ADELONDRADO","ADELONDRADO","ADELONDRADO","ADELONDRADO","ADELONDRADO","ADELONDRADO","ADELONDRADO","ADELONDRADO","ADELONDRADO","ADELONDRADO","ADELONDRADO","ADELONDRADO","ADELONDRADO","ADELONDRADO","ADELONDRADO","ADELONDRADO","ADELONDRADO","ADELONDRADO","ADELONDRADO","ADELONDRADO","ADELONDRADO","ADELONDRADO","ADELONDRADO","ADELONDRADO","ADELONDRADO","ADELONDRADO","ADELONDRADO","ADELONDRADO","ADELONDRADO","ADELONDRADO","ADELONDRADO","ADELONDRADO","ADELONDRADO","ADELONDRADO","ADELONDRADO","ADELONDRADO","ADELONDRADO","ADELONDRADO","ADELONDRADO","ADELONDRADO","ADELONDRADO","ADELONDRADO","ADELONDRADO","ADELONDRADO","ADELONDRADO","ADELONDRADO","ADELONDRADO","ADELONDRADO","ADELONDRADO","ADELONDRADO","ADELONDRADO","ADELONDRADO","ADELONDRADO","ADELONDRADO","ADELONDRADO","ADELONDRADO","ADELONDRADO","ADELONDRADO","ADELONDRADO","ADELONDRADO","ADELONDRADO","ADELONDRADO","ADELONDRADO","ADELONDRADO","ADELONDRADO","ADELONDRADO","ADELONDRADO","ADELONDRADO","ADELONDRADO","ADELONDRADO","ADELONDRADO","ADELONDRADO","ADELONDRADO","ADELONDRADO","ADELONDRADO","ADELONDRADO","ADELONDRADO","ADELONDRADO","ADELONDRADO","ADELONDRADO","ADELONDRADO","ADELONDRADO","ADELONDRADO","ADELONDRADO","ADELONDRADO","ADELONDRADO","ADELONDRADO","ADELONDRADO","ADELONDRADO","ADELONDRADO","ADELONDRADO","ADELONDRADO","ADELONDRADO","ADELONDRADO","ADELONDRADO","ADELONDRADO","ADELONDRADO","ADELONDRADO","ADELONDRADO","ADELONDRADO","ADELONDRADO","ADELONDRADO","ADELONDRADO","ADELONDRADO","ADELONDRADO","ADELONDRADO","ADELONDRADO","ADELONDRADO","ADELONDRADO","ADELONDRADO","ADELONDRADO","ADELONDRADO","ADELONDRADO","ADELONDRADO","ADELONDRADO","ADELONDRADO","ADELONDRADO","ADELONDRADO","ADELONDRADO","ADELONDRADO","ADELONDRADO","ADELONDRADO","ADELONDRADO","ADELONDRADO","ADELONDRADO","ADELONDRADO","ADELONDRADO","ADELONDRADO","ADELONDRADO","ADELONDRADO","ADELONDRADO","ADELONDRADO","ADELONDRADO","ADELONDRADO","ADELONDRADO","ADELONDRADO","ADELONDRADO","ADELONDRADO","ADELONDRADO","ADELONDRADO","ADELONDRADO","ADELONDRADO","ADELONDRADO","ADELONDRADO","ADELONDRADO","ADELONDRADO","ADELONDRADO","ADELONDRADO","ADELONDRADO","ADELONDRADO","ADELONDRADO","ADELONDRADO","ADELONDRADO","ADELONDRADO","ADELONDRADO","ADELONDRADO","ADELONDRADO","ADELONDRADO","ADELONDRADO","ADELONDRADO","ADELONDRADO","ADELONDRADO","ADELONDRADO","ADELONDRADO","ADELONDRADO","ADELONDRADO","ADELONDRADO","ADELONDRADO","ADELONDRADO","ADELONDRADO","ADELONDRADO","ADELONDRADO","ADELONDRADO","ADELONDRADO","ADELONDRADO","ADELONDRADO","ADELONDRADO","ADELONDRADO","ADELONDRADO","ADELONDRADO","ADELONDRADO","ADELONDRADO","ADELONDRADO","ADELONDRADO","ADELONDRADO","ADELONDRADO","ADELONDRADO","ADELONDRADO","ADELONDRADO","ADELONDRADO","ADELONDRADO","ADELONDRADO","ADELONDRADO","ADELONDRADO","ADELONDRADO","ADELONDRADO","ADELONDRADO","ADELONDRADO","ADELONDRADO","ADELONDRADO","ADELONDRADO","ADELONDRADO","ADELONDRADO","ADELONDRADO","ADELONDRADO","ADELONDRADO","ADELONDRADO","ADELONDRADO","ADELONDRADO","ADELONDRADO","ADELONDRADO","ADELONDRADO","ADELONDRADO","ADELONDRADO","ADELONDRADO","ADELONDRADO","ADELONDRADO","ADELONDRADO","ADELONDRADO","ADELONDRADO","ADELONDRADO","ADELONDRADO","ADELONDRADO","ADELONDRADO","ADELONDRADO","ADELONDRADO","ADELONDRADO","ADELONDRADO","ADELONDRADO","ADELONDRADO","ADELONDRADO","ADELONDRADO","ADELONDRADO","ADELONDRADO","ADELONDRADO","ADELONDRADO","ADELONDRADO","ADELONDRADO","ADELONDRADO","ADELONDRADO","ADELONDRADO","ADELONDRADO","ADELONDRADO","ADELONDRADO","ADELONDRADO","ADELONDRADO","ADELONDRADO","ADELONDRADO","ADELONDRADO","ADELONDRADO","ADELONDRADO","ADELONDRADO","ADELONDRADO","ADELONDRADO","ADELONDRADO","ADELONDRADO","ADELONDRADO","ADELONDRADO","ADELONDRADO","ADELONDRADO","ADELONDRADO","ADELONDRADO","ADELONDRADO","ADELONDRADO","ADELONDRADO","ADELONDRADO","ADELONDRADO","ADELONDRADO","ADELONDRADO","ADELONDRADO","ADELONDRADO","ADELONDRADO","ADELONDRADO","ADELONDRADO","ADELONDRADO","ADELONDRADO","ADELONDRADO","ADELONDRADO","ADELONDRADO","ADELONDRADO","ADELONDRADO","ADELONDRADO","ADELONDRADO","ADELONDRADO","ADELONDRADO","ADELONDRADO","ADELONDRADO","ADELONDRADO","ADELONDRADO","ADELONDRADO","ADELONDRADO","ADELONDRADO","ADELONDRADO","ADELONDRADO","ADELONDRADO","ADELONDRADO","ADELONDRADO","ADELONDRADO","ADELONDRADO","ADELONDRADO","ADELONDRADO","ADELONDRADO","ADELONDRADO","ADELONDRADO","ADELONDRADO","ADELONDRADO","ADELONDRADO","ADELONDRADO","ADELONDRADO","ADELONDRADO","ADELONDRADO","ADELONDRADO","ADELONDRADO","ADELONDRADO","ADELONDRADO","ADELONDRADO","ADELONDRADO","ADELONDRADO","ADELONDRADO","ADELONDRADO","ADELONDRADO","ADELONDRADO","ADELONDRADO","ADELONDRADO","ADELONDRADO","ADELONDRADO","ADELONDRADO","ADELONDRADO","ADELONDRADO","ADELONDRADO","ADELONDRADO","ADELONDRADO","ADELONDRADO","ADELONDRADO","ADELONDRADO","ADELONDRADO","ADELONDRADO","ADELONDRADO","ADELONDRADO","ADELONDRADO","ADELONDRADO","ADELONDRADO","ADELONDRADO","ADELONDRADO","ADELONDRADO","ADELONDRADO","ADELONDRADO","ADELONDRADO","ADELONDRADO","ADELONDRADO","ADELONDRADO","ADELONDRADO","ADELONDRADO","ADELONDRADO","ADELONDRADO","ADELONDRADO","ADELONDRADO","ADELONDRADO","ADELONDRADO","ADELONDRADO","ADELONDRADO","ADELONDRADO","ADELONDRADO","ADELONDRADO","ADELONDRADO","ADELONDRADO","ADELONDRADO","ADELONDRADO","ADELONDRADO","ADELONDRADO","ADELONDRADO","ADELONDRADO","ADELONDRADO","ADELONDRADO","ADELONDRADO","ADELONDRADO","ADELONDRADO","ADELONDRADO","ADELONDRADO","ADELONDRADO","ADELONDRADO","ADELONDRADO","ADELONDRADO","ADELONDRADO","ADELONDRADO","ADELONDRADO","ADELONDRADO","ADELONDRADO","ADELONDRADO","ADELONDRADO","ADELONDRADO","ADELONDRADO","ADELONDRADO","ADELONDRADO","ADELONDRADO","ADELONDRADO","ADELONDRADO","ADELONDRADO","ADELONDRADO","ADELONDRADO","ADELONDRADO","ADELONDRADO","ADELONDRADO","ADELONDRADO","ADELONDRADO","ADELONDRADO","ADELONDRADO","ADELONDRADO","ADELONDRADO","ADELONDRADO","ADELONDRADO","ADELONDRADO","ADELONDRADO","ADELONDRADO","ADELONDRADO","ADELONDRADO","ADELONDRADO","ADELONDRADO","ADELONDRADO","ADELONDRADO","ADELONDRADO","ADELONDRADO","ADELONDRADO","ADELONDRADO","ADELONDRADO","ADELONDRADO","ADELONDRADO","ADELONDRADO","ADELONDRADO","ADELONDRADO","ADELONDRADO","ADELONDRADO","ADELONDRADO","ADELONDRADO","ADELONDRADO","ADELONDRADO","ADELONDRADO","ADELONDRADO","ADELONDRADO","ADELONDRADO","ADELONDRADO","ADELONDRADO","ADELONDRADO","ADELONDRADO","ADELONDRADO","ADELONDRADO","ADELONDRADO","ADELONDRADO","ADELONDRADO","ADELONDRADO","ADELONDRADO","ADELONDRADO","ADELONDRADO","ADELONDRADO","ADELONDRADO","ADELONDRADO","ADELONDRADO","ADELONDRADO","ADELONDRADO","ADELONDRADO","ADELONDRADO","ADELONDRADO","ADELONDRADO","ADELONDRADO","ADELONDRADO","ADELONDRADO","ADELONDRADO","ADELONDRADO","ADELONDRADO","ADELONDRADO","ADELONDRADO","ADELONDRADO","ADELONDRADO","ADELONDRADO","ADELONDRADO","ADELONDRADO","ADELONDRADO","ADELONDRADO","ADELONDRADO","ADELONDRADO","ADELONDRADO","ADELONDRADO","ADELONDRADO","ADELONDRADO","ADELONDRADO","ADELONDRADO","ADELONDRADO","ADELONDRADO","ADELONDRADO","ADELONDRADO","ADELONDRADO","ADELONDRADO","ADELONDRADO","ADELONDRADO","ADELONDRADO","ADELONDRADO","ADELONDRADO","ADELONDRADO","ADELONDRADO","ADELONDRADO","ADELONDRADO","ADELONDRADO","ADELONDRADO","ADELONDRADO","ADELONDRADO","ADELONDRADO","ADELONDRADO","ADELONDRADO","ADELONDRADO","ADELONDRADO","ADELONDRADO","ADELONDRADO","ADELONDRADO","ADELONDRADO","ADELONDRADO","ADELONDRADO","ADELONDRADO","ADELONDRADO","ADELONDRADO","ADELONDRADO","ADELONDRADO","ADELONDRADO","ADELONDRADO","ADELONDRADO","ADELONDRADO","ADELONDRADO","ADELONDRADO","ADELONDRADO","ADELONDRADO","ADELONDRADO","ADELONDRADO","ADELONDRADO","ADELONDRADO","ADELONDRADO","ADELONDRADO","ADELONDRADO","ADELONDRADO","ADELONDRADO","ADELONDRADO","ADELONDRADO","ADELONDRADO","ADELONDRADO","ADELONDRADO","ADELONDRADO","ADELONDRADO","ADELONDRADO","ADELONDRADO","ADELONDRADO","ADELONDRADO","ADELONDRADO","ADELONDRADO","ADELONDRADO","ADELONDRADO","ADELONDRADO","ADELONDRADO","ADELONDRADO","ADELONDRADO","ADELONDRADO","ADELONDRADO","ADELONDRADO","ADELONDRADO","ADELONDRADO","ADELONDRADO","ADELONDRADO","ADELONDRADO","ADELONDRADO","ADELONDRADO","ADELONDRADO","ADELONDRADO","ADELONDRADO","ADELONDRADO","ADELONDRADO","ADELONDRADO","ADELONDRADO","ADELONDRADO","ADELONDRADO","ADELONDRADO","ADELONDRADO","ADELONDRADO","ADELONDRADO","ADELONDRADO","ADELONDRADO","ADELONDRADO","ADELONDRADO","ADELONDRADO","ADELONDRADO","ADELONDRADO","ADELONDRADO","ADELONDRADO","ADELONDRADO","ADELONDRADO","ADELONDRADO","ADELONDRADO","ADELONDRADO","ADELONDRADO","ADELONDRADO","ADELONDRADO","ADELONDRADO","ADELONDRADO","ADELONDRADO","ADELONDRADO","ADELONDRADO","ADELONDRADO","ADELONDRADO","ADELONDRADO","ADELONDRADO","ADELONDRADO","ADELONDRADO","ADELONDRADO","ADELONDRADO","ADELONDRADO","ADELONDRADO","ADELONDRADO","ADELONDRADO","ADELONDRADO","ADELONDRADO","ADELONDRADO","ADELONDRADO","ADELONDRADO","ADELONDRADO","ADELONDRADO","ADELONDRADO","ADELONDRADO","ADELONDRADO","ADELONDRADO","ADELONDRADO","ADELONDRADO","ADELONDRADO","ADELONDRADO","ADELONDRADO","ADELONDRADO","ADELONDRADO","ADELONDRADO","ADELONDRADO","ADELONDRADO","ADELONDRADO","ADELONDRADO","ADELONDRADO","ADELONDRADO","ADELONDRADO","ADELONDRADO","ADELONDRADO","ADELONDRADO","ADELONDRADO","ADELONDRADO","ADELONDRADO","ADELONDRADO","ADELONDRADO","ADELONDRADO","ADELONDRADO","ADELONDRADO","ADELONDRADO","ADELONDRADO","ADELONDRADO","ADELONDRADO","ADELONDRADO","ADELONDRADO","ADELONDRADO","ADELONDRADO","ADELONDRADO","ADELONDRADO","ADELONDRADO","ADELONDRADO","ADELONDRADO","ADELONDRADO","ADELONDRADO","ADELONDRADO","ADELONDRADO","ADELONDRADO","ADELONDRADO","ADELONDRADO","ADELONDRADO","ADELONDRADO","ADELONDRADO","ADELONDRADO","ADELONDRADO","ADELONDRADO","ADELONDRADO","ADELONDRADO","ADELONDRADO","ADELONDRADO","ADELONDRADO","ADELONDRADO","ADELONDRADO","ADELONDRADO","ADELONDRADO","ADELONDRADO","ADELONDRADO","ADELONDRADO","ADELONDRADO","ADELONDRADO","ADELONDRADO","ADELONDRADO","ADELONDRADO","ADELONDRADO","ADELONDRADO","ADELONDRADO","ADELONDRADO","ADELONDRADO","ADELONDRADO","ADELONDRADO","ADELONDRADO","ADELONDRADO","ADELONDRADO","ADELONDRADO","ADELONDRADO","ADELONDRADO","ADELONDRADO","ADELONDRADO","ADELONDRADO","ADELONDRADO","ADELONDRADO","ADELONDRADO","ADELONDRADO","ADELONDRADO","ADELONDRADO","ADELONDRADO","ADELONDRADO","ADELONDRADO","ADELONDRADO","ADELONDRADO","ADELONDRADO","ADELONDRADO","ADELONDRADO","ADELONDRADO","ADELONDRADO","ADELONDRADO","ADELONDRADO","ADELONDRADO","ADELONDRADO","ADELONDRADO","ADELONDRADO","ADELONDRADO","ADELONDRADO","ADELONDRADO","ADELONDRADO","ADELONDRADO","ADELONDRADO","ADELONDRADO","ADELONDRADO","ADELONDRADO","ADELONDRADO","ADELONDRADO","ADELONDRADO","ADELONDRADO","ADELONDRADO","ADELONDRADO","ADELONDRADO","ADELONDRADO","ADELONDRADO","ADELONDRADO","ADELONDRADO","ADELONDRADO","ADELONDRADO","ADELONDRADO","ADELONDRADO","ADELONDRADO","ADELONDRADO","ADELONDRADO","ADELONDRADO","ADELONDRADO","ADELONDRADO","ADELONDRADO","ADELONDRADO","ADELONDRADO","ADELONDRADO","ADELONDRADO","ADELONDRADO","ADELONDRADO","ADELONDRADO","ADELONDRADO","ADELONDRADO","ADELONDRADO","ADELONDRADO","ADELONDRADO","ADELONDRADO","ADELONDRADO","ADELONDRADO","ADELONDRADO","ADELONDRADO","ADELONDRADO","ADELONDRADO","ADELONDRADO","ADELONDRADO","ADELONDRADO","ADELONDRADO","ADELONDRADO","ADELONDRADO","ADELONDRADO","ADELONDRADO","ADELONDRADO","ADELONDRADO","ADELONDRADO","ADELONDRADO","ADELONDRADO","ADELONDRADO","ADELONDRADO","ADELONDRADO","ADELONDRADO","ADELONDRADO","ADELONDRADO","ADELONDRADO","ADELONDRADO","ADELONDRADO","ADELONDRADO","ADELONDRADO","ADELONDRADO","ADELONDRADO","ADELONDRADO","ADELONDRADO","ADELONDRADO","ADELONDRADO","ADELONDRADO","ADELONDRADO","ADELONDRADO","ADELONDRADO","ADELONDRADO","ADELONDRADO","ADELONDRADO","ADELONDRADO","ADELONDRADO","ADELONDRADO","ADELONDRADO","ADELONDRADO","ADELONDRADO","ADELONDRADO","ADELONDRADO","ADELONDRADO","ADELONDRADO","ADELONDRADO","ADELONDRADO","ADELONDRADO","ADELONDRADO","ADELONDRADO","ADELONDRADO","ADELONDRADO","ADELONDRADO","ADELONDRADO","ADELONDRADO","ADELONDRADO","ADELONDRADO","ADELONDRADO","ADELONDRADO","ADELONDRADO","ADELONDRADO","ADELONDRADO","ADELONDRADO","ADELONDRADO","ADELONDRADO","ADELONDRADO","ADELONDRADO","ADELONDRADO","ADELONDRADO","ADELONDRADO","ADELONDRADO","ADELONDRADO","ADELONDRADO","ADELONDRADO","ADELONDRADO","ADELONDRADO","ADELONDRADO","ADELONDRADO","ADELONDRADO","ADELONDRADO","ADELONDRADO","ADELONDRADO","ADELONDRADO","ADELONDRADO","ADELONDRADO","ADELONDRADO","ADELONDRADO","ADELONDRADO","ADELONDRADO","ADELONDRADO","ADELONDRADO","ADELONDRADO","ADELONDRADO","ADELONDRADO","ADELONDRADO","ADELONDRADO","ADELONDRADO","ADELONDRADO","ADELONDRADO","ADELONDRADO","ADELONDRADO","ADELONDRADO","ADELONDRADO","ADELONDRADO","ADELONDRADO","ADELONDRADO","ADELONDRADO","ADELONDRADO","ADELONDRADO","ADELONDRADO","ADELONDRADO","ADELONDRADO","ADELONDRADO","ADELONDRADO","ADELONDRADO","ADELONDRADO","ADELONDRADO","ADELONDRADO","ADELONDRADO","ADELONDRADO","ADELONDRADO","ADELONDRADO","ADELONDRADO","ADELONDRADO","ADELONDRADO","ADELONDRADO","ADELONDRADO","ADELONDRADO","ADELONDRADO","ADELONDRADO","ADELONDRADO","ADELONDRADO","ADELONDRADO","ADELONDRADO","ADELONDRADO","ADELONDRADO","ADELONDRADO","ADELONDRADO","ADELONDRADO","ADELONDRADO","ADELONDRADO","ADELONDRADO","ADELONDRADO","ADELONDRADO","ADELONDRADO","ADELONDRADO","ADELONDRADO","ADELONDRADO","ADELONDRADO","ADELONDRADO","ADELONDRADO","ADELONDRADO","ADELONDRADO","ADELONDRADO","ADELONDRADO","ADELONDRADO","ADELONDRADO","ADELONDRADO","ADELONDRADO","ADELONDRADO","ADELONDRADO","ADELONDRADO","ADELONDRADO","ADELONDRADO","ADELONDRADO","ADELONDRADO","ADELONDRADO","ADELONDRADO","ADELONDRADO","ADELONDRADO","ADELONDRADO","ADELONDRADO","ADELONDRADO","ADELONDRADO","ADELONDRADO","ADELONDRADO","ADELONDRADO","ADELONDRADO","ADELONDRADO","ADELONDRADO","ADELONDRADO","ADELONDRADO","ADELONDRADO","ADELONDRADO","ADELONDRADO","ADELONDRADO","ADELONDRADO","ADELONDRADO","ADELONDRADO","ADELONDRADO","ADELONDRADO","ADELONDRADO","ADELONDRADO","ADELONDRADO","ADELONDRADO","ADELONDRADO","ADELONDRADO","ADELONDRADO","ADELONDRADO","ADELONDRADO","ADELONDRADO","ADELONDRADO","ADELONDRADO","ADELONDRADO","ADELONDRADO","ADELONDRADO","ADELONDRADO","ADELONDRADO","ADELONDRADO","ADELONDRADO","ADELONDRADO","ADELONDRADO","ADELONDRADO","ADELONDRADO","ADELONDRADO","ADELONDRADO","ADELONDRADO","ADELONDRADO","ADELONDRADO","ADELONDRADO","ADELONDRADO","ADELONDRADO","ADELONDRADO","ADELONDRADO","ADELONDRADO","ADELONDRADO","ADELONDRADO","ADELONDRADO","ADELONDRADO","ADELONDRADO","ADELONDRADO","ADELONDRADO","ADELONDRADO","ADELONDRADO","ADELONDRADO","ADELONDRADO","ADELONDRADO","ADELONDRADO","ADELONDRADO","ADELONDRADO","ADELONDRADO","ADELONDRADO","ADELONDRADO","ADELONDRADO","ADELONDRADO","ADELONDRADO","ADELONDRADO","ADELONDRADO","ADELONDRADO","ADELONDRADO","ADELONDRADO","ADELONDRADO","ADELONDRADO","ADELONDRADO","ADELONDRADO","ADELONDRADO","ADELONDRADO","ADELONDRADO","ADELONDRADO","ADELONDRADO","ADELONDRADO","ADELONDRADO","ADELONDRADO","ADELONDRADO","ADELONDRADO","ADELONDRADO","ADELONDRADO","ADELONDRADO","ADELONDRADO","ADELONDRADO","ADELONDRADO","ADELONDRADO","ADELONDRADO","ADELONDRADO","ADELONDRADO","ADELONDRADO","ADELONDRADO","ADELONDRADO","ADELONDRADO","ADELONDRADO","ADELONDRADO","ADELONDRADO","ADELONDRADO","ADELONDRADO","ADELONDRADO","ADELONDRADO","ADELONDRADO","ADELONDRADO","ADELONDRADO","ADELONDRADO","ADELONDRADO","ADELONDRADO","ADELONDRADO","ADELONDRADO","ADELONDRADO","ADELONDRADO","ADELONDRADO","ADELONDRADO","ADELONDRADO","ADELONDRADO","ADELONDRADO","ADELONDRADO","ADELONDRADO","ADELONDRADO","ADELONDRADO","ADELONDRADO","ADELONDRADO","ADELONDRADO","ADELONDRADO","ADELONDRADO","ADELONDRADO","ADELONDRADO","ADELONDRADO","ADELONDRADO","ADELONDRADO","ADELONDRADO","ADELONDRADO","ADELONDRADO","ADELONDRADO","ADELONDRADO","ADELONDRADO","ADELONDRADO","ADELONDRADO","ADELONDRADO","ADELONDRADO","ADELONDRADO","ADELONDRADO","ADELONDRADO","ADELONDRADO","ADELONDRADO","ADELONDRADO","ADELONDRADO","ADELONDRADO","ADELONDRADO","ADELONDRADO","ADELONDRADO","ADELONDRADO","ADELONDRADO","ADELONDRADO","ADELONDRADO","ADELONDRADO","ADELONDRADO","ADELONDRADO","ADELONDRADO","ADELONDRADO","ADELONDRADO","ADELONDRADO","ADELONDRADO","ADELONDRADO","ADELONDRADO","ADELONDRADO","ADELONDRADO","ADELONDRADO","ADELONDRADO","ADELONDRADO","ADELONDRADO","ADELONDRADO","ADELONDRADO","ADELONDRADO","ADELONDRADO","ADELONDRADO","ADELONDRADO","ADELONDRADO","ADELONDRADO","ADELONDRADO","ADELONDRADO","ADELONDRADO","ADELONDRADO","ADELONDRADO","ADELONDRADO","ADELONDRADO","ADELONDRADO","ADELONDRADO","ADELONDRADO","ADELONDRADO","ADELONDRADO","ADELONDRADO","ADELONDRADO","ADELONDRADO","ADELONDRADO","ADELONDRADO","ADELONDRADO","ADELONDRADO","ADELONDRADO","ADELONDRADO","ADELONDRADO","ADELONDRADO","ADELONDRADO","ADELONDRADO","ADELONDRADO","ADELONDRADO","ADELONDRADO","ADELONDRADO","ADELONDRADO","ADELONDRADO","ADELONDRADO","ADELONDRADO","ADELONDRADO","ADELONDRADO","ADELONDRADO","ADELONDRADO","ADELONDRADO","ADELONDRADO","ADELONDRADO","ADELONDRADO","ADELONDRADO","ADELONDRADO","ADELONDRADO","ADELONDRADO","ADELONDRADO","ADELONDRADO","ADELONDRADO","ADELONDRADO","ADELONDRADO","ADELONDRADO","ADELONDRADO","ADELONDRADO","ADELONDRADO","ADELONDRADO","ADELONDRADO","ADELONDRADO","ADELONDRADO","ADELONDRADO","ADELONDRADO","ADELONDRADO","ADELONDRADO","ADELONDRADO","ADELONDRADO","ADELONDRADO","ADELONDRADO","ADELONDRADO","ADELONDRADO","ADELONDRADO","ADELONDRADO","ADELONDRADO","ADELONDRADO","ADELONDRADO","ADELONDRADO","ADELONDRADO","ADELONDRADO","ADELONDRADO","ADELONDRADO","ADELONDRADO","ADELONDRADO","ADELONDRADO","ADELONDRADO","ADELONDRADO","ADELONDRADO","ADELONDRADO","ADELONDRADO","ADELONDRADO","ADELONDRADO","ADELONDRADO","ADELONDRADO","ADELONDRADO","ADELONDRADO","ADELONDRADO","ADELONDRADO","ADELONDRADO","ADELONDRADO","ADELONDRADO","ADELONDRADO","ADELONDRADO","ADELONDRADO","ADELONDRADO","ADELONDRADO","ADELONDRADO","ADELONDRADO","ADELONDRADO","ADELONDRADO","ADELONDRADO","ADELONDRADO","ADELONDRADO","ADELONDRADO","ADELONDRADO","ADELONDRADO","ADELONDRADO","ADELONDRADO","ADELONDRADO","ADELONDRADO","ADELONDRADO","ADELONDRADO","ADELONDRADO","ADELONDRADO","ADELONDRADO","ADELONDRADO","ADELONDRADO","ADELONDRADO","ADELONDRADO","ADELONDRADO","ADELONDRADO","ADELONDRADO","ADELONDRADO","ADELONDRADO","ADELONDRADO","ADELONDRADO","ADELONDRADO","ADELONDRADO","ADELONDRADO","ADELONDRADO","ADELONDRADO","ADELONDRADO","ADELONDRADO","ADELONDRADO","ADELONDRADO","ADELONDRADO","ADELONDRADO","ADELONDRADO","ADELONDRADO","ADELONDRADO","ADELONDRADO","ADELONDRADO","ADELONDRADO","ADELONDRADO","ADELONDRADO","ADELONDRADO","ADELONDRADO","ADELONDRADO","ADELONDRADO","ADELONDRADO","ADELONDRADO","ADELONDRADO","ADELONDRADO","ADELONDRADO","ADELONDRADO","ADELONDRADO","ADELONDRADO","ADELONDRADO","ADELONDRADO","ADELONDRADO","ADELONDRADO","ADELONDRADO","ADELONDRADO","ADELONDRADO","ADELONDRADO","ADELONDRADO","ADELONDRADO","ADELONDRADO","ADELONDRADO","ADELONDRADO","ADELONDRADO","ADELONDRADO","ADELONDRADO","ADELONDRADO","ADELONDRADO","ADELONDRADO","ADELONDRADO","ADELONDRADO","ADELONDRADO","ADELONDRADO","ADELONDRADO","ADELONDRADO","ADELONDRADO","ADELONDRADO","ADELONDRADO","ADELONDRADO","ADELONDRADO","ADELONDRADO","ADELONDRADO","ADELONDRADO","ADELONDRADO","ADELONDRADO","ADELONDRADO","ADELONDRADO","ADELONDRADO","ADELONDRADO","ADELONDRADO","ADELONDRADO","ADELONDRADO","ADELONDRADO","ADELONDRADO","ADELONDRADO","ADELONDRADO","ADELONDRADO","ADELONDRADO","ADELONDRADO","ADELONDRADO","ADELONDRADO","ADELONDRADO","ADELONDRADO","ADELONDRADO","ADELONDRADO","ADELONDRADO","ADELONDRADO","ADELONDRADO","ADELONDRADO","ADELONDRADO","ADELONDRADO","ADELONDRADO","ADELONDRADO","ADELONDRADO","ADELONDRADO","ADELONDRADO","ADELONDRADO","ADELONDRADO","ADELONDRADO","ADELONDRADO","ADELONDRADO","ADELONDRADO","ADELONDRADO","ADELONDRADO","ADELONDRADO","ADELONDRADO","ADELONDRADO","ADELONDRADO","ADELONDRADO","ADELONDRADO","ADELONDRADO","ADELONDRADO","ADELONDRADO","ADELONDRADO","ADELONDRADO","ADELONDRADO","ADELONDRADO","ADELONDRADO","ADELONDRADO","ADELONDRADO","ADELONDRADO","ADELONDRADO","ADELONDRADO","ADELONDRADO","ADELONDRADO","ADELONDRADO","ADELONDRADO","ADELONDRADO","ADELONDRADO","ADELONDRADO","ADELONDRADO","ADELONDRADO","ADELONDRADO","ADELONDRADO","ADELONDRADO","ADELONDRADO","ADELONDRADO","ADELONDRADO","ADELONDRADO","ADELONDRADO","ADELONDRADO","ADELONDRADO","ADELONDRADO","ADELONDRADO","ADELONDRADO","ADELONDRADO","ADELONDRADO","ADELONDRADO","ADELONDRADO","ADELONDRADO","ADELONDRADO","ADELONDRADO","ADELONDRADO","ADELONDRADO","ADELONDRADO","ADELONDRADO","ADELONDRADO","ADELONDRADO","ADELONDRADO","ADELONDRADO","ADELONDRADO","ADELONDRADO","ADELONDRADO","ADELONDRADO","ADELONDRADO","ADELONDRADO","ADELONDRADO","ADELONDRADO","ADELONDRADO","ADELONDRADO","ADELONDRADO","ADELONDRADO","ADELONDRADO","ADELONDRADO","ADELONDRADO","ADELONDRADO","ADELONDRADO","ADELONDRADO","ADELONDRADO","ADELONDRADO","ADELONDRADO","ADELONDRADO","ADELONDRADO","ADELONDRADO","ADELONDRADO","ADELONDRADO","ADELONDRADO","ADELONDRADO","ADELONDRADO","ADELONDRADO","ADELONDRADO","ADELONDRADO","ADELONDRADO","ADELONDRADO","ADELONDRADO","ADELONDRADO","ADELONDRADO","ADELONDRADO","ADELONDRADO","ADELONDRADO","ADELONDRADO","ADELONDRADO","ADELONDRADO","ADELONDRADO","ADELONDRADO","ADELONDRADO","ADELONDRADO","ADELONDRADO","ADELONDRADO","ADELONDRADO","ADELONDRADO","ADELONDRADO","ADELONDRADO","ADELONDRADO","ADELONDRADO","ADELONDRADO","ADELONDRADO","ADELONDRADO","ADELONDRADO","ADELONDRADO","ADELONDRADO","ADELONDRADO","ADELONDRADO","ADELONDRADO","ADELONDRADO","ADELONDRADO","ADELONDRADO","ADELONDRADO","ADELONDRADO","ADELONDRADO","ADELONDRADO","ADELONDRADO","ADELONDRADO","ADELONDRADO","ADELONDRADO","ADELONDRADO","ADELONDRADO","ADELONDRADO","ADELONDRADO","ADELONDRADO","ADELONDRADO","ADELONDRADO","ADELONDRADO","ADELONDRADO","ADELONDRADO","ADELONDRADO","ADELONDRADO","ADELONDRADO","ADELONDRADO","ADELONDRADO","ADELONDRADO","ADELONDRADO","ADELONDRADO","ADELONDRADO","ADELONDRADO","ADELONDRADO","ADELONDRADO","ADELONDRADO","ADELONDRADO","ADELONDRADO","ADELONDRADO","ADELONDRADO","ADELONDRADO","ADELONDRADO","ADELONDRADO","ADELONDRADO","ADELONDRADO","ADELONDRADO","ADELONDRADO","ADELONDRADO","ADELONDRADO","ADELONDRADO","ADELONDRADO","ADELONDRADO","ADELONDRADO","ADELONDRADO","ADELONDRADO","ADELONDRADO","ADELONDRADO","ADELONDRADO","ADELONDRADO","ADELONDRADO","ADELONDRADO","ADELONDRADO","ADELONDRADO","ADELONDRADO","ADELONDRADO","ADELONDRADO","ADELONDRADO","ADELONDRADO","ADELONDRADO","ADELONDRADO","ADELONDRADO","ADELONDRADO","ADELONDRADO","ADELONDRADO","ADELONDRADO","ADELONDRADO","ADELONDRADO","ADELONDRADO","ADELONDRADO","ADELONDRADO","ADELONDRADO","ADELONDRADO","ADELONDRADO","ADELONDRADO","ADELONDRADO","ADELONDRADO","ADELONDRADO","ADELONDRADO","ADELONDRADO","ADELONDRADO","ADELONDRADO","ADELONDRADO","ADELONDRADO","ADELONDRADO","ADELONDRADO","ADELONDRADO","ADELONDRADO","ADELONDRADO","ADELONDRADO","ADELONDRADO","ADELONDRADO","ADELONDRADO","ADELONDRADO","ADELONDRADO","ADELONDRADO","ADELONDRADO","ADELONDRADO","ADELONDRADO","ADELONDRADO","ADELONDRADO","ADELONDRADO","ADELONDRADO","ADELONDRADO","ADELONDRADO","ADELONDRADO","ADELONDRADO","ADELONDRADO","ADELONDRADO","ADELONDRADO","ADELONDRADO","ADELONDRADO","ADELONDRADO","ADELONDRADO","ADELONDRADO","ADELONDRADO","ADELONDRADO","ADELONDRADO","ADELONDRADO","ADELONDRADO","ADELONDRADO","ADELONDRADO","ADELONDRADO","ADELONDRADO","ADELONDRADO","ADELONDRADO","ADELONDRADO","ADELONDRADO","ADELONDRADO","ADELONDRADO","ADELONDRADO","ADELONDRADO","ADELONDRADO","ADELONDRADO","ADELONDRADO","ADELONDRADO","ADELONDRADO","ADELONDRADO","ADELONDRADO","ADELONDRADO","ADELONDRADO","ADELONDRADO","ADELONDRADO","ADELONDRADO","ADELONDRADO","ADELONDRADO","ADELONDRADO","ADELONDRADO","ADELONDRADO","ADELONDRADO","ADELONDRADO","ADELONDRADO","ADELONDRADO","ADELONDRADO","ADELONDRADO","ADELONDRADO","ADELONDRADO","ADELONDRADO","ADELONDRADO","ADELONDRADO","ADELONDRADO","ADELONDRADO","ADELONDRADO","ADELONDRADO","ADELONDRADO","ADELONDRADO","ADELONDRADO","ADELONDRADO","ADELONDRADO","ADELONDRADO","ADELONDRADO","ADELONDRADO","ADELONDRADO","ADELONDRADO","ADELONDRADO","ADELONDRADO","ADELONDRADO","ADELONDRADO","ADELONDRADO","ADELONDRADO","ADELONDRADO","ADELONDRADO","ADELONDRADO","ADELONDRADO","ADELONDRADO","ADELONDRADO","ADELONDRADO","ADELONDRADO","ADELONDRADO","ADELONDRADO","ADELONDRADO","ADELONDRADO","ADELONDRADO","ADELONDRADO","ADELONDRADO","ADELONDRADO","ADELONDRADO","ADELONDRADO","ADELONDRADO","ADELONDRADO","ADELONDRADO","ADELONDRADO","ADELONDRADO","ADELONDRADO","ADELONDRADO","ADELONDRADO","ADELONDRADO","ADELONDRADO","ADELONDRADO","ADELONDRADO","ADELONDRADO","ADELONDRADO","ADELONDRADO","ADELONDRADO","ADELONDRADO","ADELONDRADO","ADELONDRADO","ADELONDRADO","ADELONDRADO","ADELONDRADO","ADELONDRADO","ADELONDRADO","ADELONDRADO","ADELONDRADO","ADELONDRADO","ADELONDRADO","ADELONDRADO","ADELONDRADO","ADELONDRADO","ADELONDRADO","ADELONDRADO","ADELONDRADO","ADELONDRADO","ADELONDRADO","ADELONDRADO","ADELONDRADO","ADELONDRADO","ADELONDRADO","ADELONDRADO","ADELONDRADO","ADELONDRADO","ADELONDRADO","ADELONDRADO","ADELONDRADO","ADELONDRADO","ADELONDRADO","ADELONDRADO","ADELONDRADO","ADELONDRADO","ADELONDRADO","ADELONDRADO","ADELONDRADO","ADELONDRADO","ADELONDRADO","ADELONDRADO","ADELONDRADO","ADELONDRADO","ADELONDRADO","ADELONDRADO","ADELONDRADO","ADELONDRADO","ADELONDRADO","ADELONDRADO","ADELONDRADO","ADELONDRADO","ADELONDRADO","ADELONDRADO","ADELONDRADO","ADELONDRADO","ADELONDRADO","ADELONDRADO","ADELONDRADO","ADELONDRADO","ADELONDRADO","ADELONDRADO","ADELONDRADO","ADELONDRADO","ADELONDRADO","ADELONDRADO","ADELONDRADO","ADELONDRADO","ADELONDRADO","ADELONDRADO","ADELONDRADO","ADELONDRADO","ADELONDRADO","ADELONDRADO","ADELONDRADO","ADELONDRADO","ADELONDRADO","ADELONDRADO","ADELONDRADO","ADELONDRADO","ADELONDRADO","ADELONDRADO","ADELONDRADO","ADELONDRADO","ADELONDRADO","ADELONDRADO","ADELONDRADO","ADELONDRADO","ADELONDRADO","ADELONDRADO","ADELONDRADO","ADELONDRADO","ADELONDRADO","ADELONDRADO","ADELONDRADO","ADELONDRADO","ADELONDRADO","ADELONDRADO","ADELONDRADO","ADELONDRADO","ADELONDRADO","ADELONDRADO","ADELONDRADO","ADELONDRADO","ADELONDRADO","ADELONDRADO","ADELONDRADO","ADELONDRADO","ADELONDRADO","ADELONDRADO","ADELONDRADO","ADELONDRADO","ADELONDRADO","ADELONDRADO","ADELONDRADO","ADELONDRADO","ADELONDRADO","ADELONDRADO","ADELONDRADO","ADELONDRADO","ADELONDRADO","ADELONDRADO","ADELONDRADO","ADELONDRADO","ADELONDRADO","ADELONDRADO","ADELONDRADO","ADELONDRADO","ADELONDRADO","ADELONDRADO","ADELONDRADO","ADELONDRADO","ADELONDRADO","ADELONDRADO","ADELONDRADO","ADELONDRADO","ADELONDRADO","ADELONDRADO","ADELONDRADO","ADELONDRADO","ADELONDRADO","ADELONDRADO","ADELONDRADO","ADELONDRADO","ADELONDRADO","ADELONDRADO","ADELONDRADO","ADELONDRADO","ADELONDRADO","ADELONDRADO","ADELONDRADO","ADELONDRADO","ADELONDRADO","ADELONDRADO","ADELONDRADO","ADELONDRADO","ADELONDRADO","ADELONDRADO","ADELONDRADO","ADELONDRADO","ADELONDRADO","ADELONDRADO","ADELONDRADO","ADELONDRADO","ADELONDRADO","ADELONDRADO","ADELONDRADO","ADELONDRADO","ADELONDRADO","ADELONDRADO","ADELONDRADO","ADELONDRADO","ADELONDRADO","ADELONDRADO","ADELONDRADO","ADELONDRADO","ADELONDRADO","ADELONDRADO","ADELONDRADO","ADELONDRADO","ADELONDRADO","ADELONDRADO","ADELONDRADO","ADELONDRADO","ADELONDRADO","ADELONDRADO","ADELONDRADO","ADELONDRADO","ADELONDRADO","ADELONDRADO","ADELONDRADO","ADELONDRADO","ADELONDRADO","ADELONDRADO","ADELONDRADO","ADELONDRADO","ADELONDRADO","ADELONDRADO","ADELONDRADO","ADELONDRADO","ADELONDRADO","ADELONDRADO","ADELONDRADO","ADELONDRADO","ADELONDRADO","ADELONDRADO","ADELONDRADO","ADELONDRADO","ADELONDRADO","ADELONDRADO","ADELONDRADO","ADELONDRADO","ADELONDRADO","ADELONDRADO","ADELONDRADO","ADELONDRADO","ADELONDRADO","ADELONDRADO","ADELONDRADO","ADELONDRADO","ADELONDRADO","ADELONDRADO","ADELONDRADO","ADELONDRADO","ADELONDRADO","ADELONDRADO","ADELONDRADO","ADELONDRADO","ADELONDRADO","ADELONDRADO","ADELONDRADO","ADELONDRADO","ADELONDRADO","ADELONDRADO","ADELONDRADO","ADELONDRADO","ADELONDRADO","ADELONDRADO","ADELONDRADO","ADELONDRADO","ADELONDRADO","ADELONDRADO","ADELONDRADO","ADELONDRADO","ADELONDRADO","ADELONDRADO","ADELONDRADO","ADELONDRADO","ADELONDRADO","ADELONDRADO","ADELONDRADO","ADELONDRADO","ADELONDRADO","ADELONDRADO","ADELONDRADO","ADELONDRADO","ADELONDRADO","ADELONDRADO","ADELONDRADO","ADELONDRADO","ADELONDRADO","ADELONDRADO","ADELONDRADO","ADELONDRADO","ADELONDRADO","ADELONDRADO","ADELONDRADO","ADELONDRADO","ADELONDRADO","ADELONDRADO","ADELONDRADO","ADELONDRADO","ADELONDRADO","ADELONDRADO","ADELONDRADO","ADELONDRADO","ADELONDRADO","ADELONDRADO","ADELONDRADO","ADELONDRADO","ADELONDRADO","ADELONDRADO","ADELONDRADO","ADELONDRADO","ADELONDRADO","ADELONDRADO","ADELONDRADO","ADELONDRADO","ADELONDRADO","ADELONDRADO","ADELONDRADO","ADELONDRADO","ADELONDRADO","ADELONDRADO","ADELONDRADO","ADELONDRADO","ADELONDRADO","ADELONDRADO","ADELONDRADO","ADELONDRADO","ADELONDRADO","ADELONDRADO","ADELONDRADO","ADELONDRADO","ADELONDRADO","ADELONDRADO","ADELONDRADO","ADELONDRADO","ADELONDRADO","ADELONDRADO","ADELONDRADO","ADELONDRADO","ADELONDRADO","ADELONDRADO","ADELONDRADO","ADELONDRADO","ADELONDRADO","ADELONDRADO","ADELONDRADO","ADELONDRADO","ADELONDRADO","ADELONDRADO","ADELONDRADO","ADELONDRADO","ADELONDRADO","ADELONDRADO","ADELONDRADO","ADELONDRADO","ADELONDRADO","ADELONDRADO","ADELONDRADO","ADELONDRADO","ADELONDRADO","ADELONDRADO","ADELONDRADO","ADELONDRADO","ADELONDRADO","ADELONDRADO","ADELONDRADO","ADELONDRADO","ADELONDRADO","ADELONDRADO","ADELONDRADO","ADELONDRADO","ADELONDRADO","ADELONDRADO","ADELONDRADO","ADELONDRADO","ADELONDRADO","ADELONDRADO","ADELONDRADO","ADELONDRADO","ADELONDRADO","ADELONDRADO","ADELONDRADO","ADELONDRADO","ADELONDRADO","ADELONDRADO","ADELONDRADO","ADELONDRADO","ADELONDRADO","ADELONDRADO","ADELONDRADO","ADELONDRADO","ADELONDRADO","ADELONDRADO","ADELONDRADO","ADELONDRADO","ADELONDRADO","ADELONDRADO","ADELONDRADO","ADELONDRADO","ADELONDRADO","ADELONDRADO","ADELONDRADO","ADELONDRADO","ADELONDRADO","ADELONDRADO","ADELONDRADO","ADELONDRADO","ADELONDRADO","ADELONDRADO","ADELONDRADO","ADELONDRADO","ADELONDRADO","ADELONDRADO","ADELONDRADO","ADELONDRADO","ADELONDRADO","ADELONDRADO","ADELONDRADO","ADELONDRADO","ADELONDRADO","ADELONDRADO","ADELONDRADO","ADELONDRADO","ADELONDRADO","ADELONDRADO","ADELONDRADO","ADELONDRADO","ADELONDRADO","ADELONDRADO","ADELONDRADO","ADELONDRADO","ADELONDRADO","ADELONDRADO","ADELONDRADO","ADELONDRADO","ADELONDRADO","ADELONDRADO","ADELONDRADO","ADELONDRADO","ADELONDRADO","ADELONDRADO","ADELONDRADO","ADELONDRADO","ADELONDRADO","ADELONDRADO","ADELONDRADO","ADELONDRADO","ADELONDRADO","ADELONDRADO","ADELONDRADO","ADELONDRADO","ADELONDRADO","ADELONDRADO","ADELONDRADO","ADELONDRADO","ADELONDRADO","ADELONDRADO","ADELONDRADO","ADELONDRADO","ADELONDRADO","ADELONDRADO","ADELONDRADO","ADELONDRADO","ADELONDRADO","ADELONDRADO","ADELONDRADO","ADELONDRADO","ADELONDRADO","ADELONDRADO","ADELONDRADO","ADELONDRADO","ADELONDRADO","ADELONDRADO","ADELONDRADO","ADELONDRADO","ADELONDRADO","ADELONDRADO","ADELONDRADO","ADELONDRADO","ADELONDRADO","ADELONDRADO","ADELONDRADO","ADELONDRADO","ADELONDRADO","ADELONDRADO","ADELONDRADO","ADELONDRADO","ADELONDRADO","ADELONDRADO","ADELONDRADO","ADELONDRADO","ADELONDRADO","ADELONDRADO","ADELONDRADO","ADELONDRADO","ADELONDRADO","ADELONDRADO","ADELONDRADO","ADELONDRADO","ADELONDRADO","ADELONDRADO","ADELONDRADO","ADELONDRADO","ADELONDRADO","ADELONDRADO","ADELONDRADO","ADELONDRADO","ADELONDRADO","ADELONDRADO","ADELONDRADO","ADELONDRADO","ADELONDRADO","ADELONDRADO","ADELONDRADO","ADELONDRADO","ADELONDRADO","ADELONDRADO","ADELONDRADO","ADELONDRADO","ADELONDRADO","ADELONDRADO","ADELONDRADO","ADELONDRADO","ADELONDRADO","ADELONDRADO","ADELONDRADO","ADELONDRADO","ADELONDRADO","ADELONDRADO","ADELONDRADO","ADELONDRADO","ADELONDRADO","ADELONDRADO","ADELONDRADO","ADELONDRADO","ADELONDRADO","ADELONDRADO","ADELONDRADO","ADELONDRADO","ADELONDRADO","ADELONDRADO","ADELONDRADO","ADELONDRADO","ADELONDRADO","ADELONDRADO","ADELONDRADO","ADELONDRADO","ADELONDRADO","ADELONDRADO","ADELONDRADO","ADELONDRADO","ADELONDRADO","ADELONDRADO","ADELONDRADO","ADELONDRADO","ADELONDRADO","ADELONDRADO","ADELONDRADO","ADELONDRADO","ADELONDRADO","ADELONDRADO","ADELONDRADO","ADELONDRADO","ADELONDRADO","ADELONDRADO","ADELONDRADO","ADELONDRADO","ADELONDRADO","ADELONDRADO","ADELONDRADO","ADELONDRADO","ADELONDRADO","ADELONDRADO","ADELONDRADO","ADELONDRADO","ADELONDRADO","ADELONDRADO","ADELONDRADO","ADELONDRADO","ADELONDRADO","ADELONDRADO","ADELONDRADO","ADELONDRADO","ADELONDRADO","ADELONDRADO","ADELONDRADO","ADELONDRADO","ADELONDRADO","ADELONDRADO","ADELONDRADO","ADELONDRADO","ADELONDRADO","ADELONDRADO","ADELONDRADO","ADELONDRADO","ADELONDRADO","ADELONDRADO","ADELONDRADO","ADELONDRADO","ADELONDRADO","ADELONDRADO","ADELONDRADO","ADELONDRADO","ADELONDRADO","ADELONDRADO","ADELONDRADO","ADELONDRADO","ADELONDRADO","ADELONDRADO","ADELONDRADO","ADELONDRADO","ADELONDRADO","ADELONDRADO","ADELONDRADO","ADELONDRADO","ADELONDRADO","ADELONDRADO","ADELONDRADO","ADELONDRADO","ADELONDRADO","ADELONDRADO","ADELONDRADO","ADELONDRADO","ADELONDRADO","ADELONDRADO","ADELONDRADO","ADELONDRADO","ADELONDRADO","ADELONDRADO","ADELONDRADO","ADELONDRADO","ADELONDRADO","ADELONDRADO","ADELONDRADO","ADELONDRADO","ADELONDRADO","ADELONDRADO","ADELONDRADO","ADELONDRADO","ADELONDRADO","ADELONDRADO","ADELONDRADO","ADELONDRADO","ADELONDRADO","ADELONDRADO","ADELONDRADO","ADELONDRADO","ADELONDRADO","ADELONDRADO","ADELONDRADO","ADELONDRADO","ADELONDRADO","ADELONDRADO","ADELONDRADO","ADELONDRADO","ADELONDRADO","ADELONDRADO","ADELONDRADO","ADELONDRADO","ADELONDRADO","ADELONDRADO","ADELONDRADO","ADELONDRADO","ADELONDRADO","ADELONDRADO","ADELONDRADO","ADELONDRADO","ADELONDRADO","ADELONDRADO","ADELONDRADO","ADELONDRADO","ADELONDRADO","ADELONDRADO","ADELONDRADO","ADELONDRADO","ADELONDRADO","ADELONDRADO","ADELONDRADO","ADELONDRADO","ADELONDRADO","ADELONDRADO","ADELONDRADO","ADELONDRADO","ADELONDRADO","ADELONDRADO","ADELONDRADO","ADELONDRADO","ADELONDRADO","ADELONDRADO","ADELONDRADO","ADELONDRADO","ADELONDRADO","ADELONDRADO","ADELONDRADO","ADELONDRADO","ADELONDRADO","ADELONDRADO","ADELONDRADO","ADELONDRADO","ADELONDRADO","ADELONDRADO","ADELONDRADO","ADELONDRADO","ADELONDRADO","ADELONDRADO","ADELONDRADO","ADELONDRADO","ADELONDRADO","ADELONDRADO","ADELONDRADO","ADELONDRADO","ADELONDRADO","ADELONDRADO","ADELONDRADO","ADELONDRADO","ADELONDRADO","ADELONDRADO","ADELONDRADO","ADELONDRADO","ADELONDRADO","ADELONDRADO","ADELONDRADO","ADELONDRADO","ADELONDRADO","ADELONDRADO","ADELONDRADO","ADELONDRADO","ADELONDRADO","ADELONDRADO","ADELONDRADO","ADELONDRADO","ADELONDRADO","ADELONDRADO","ADELONDRADO","ADELONDRADO","ADELONDRADO","ADELONDRADO","ADELONDRADO","ADELONDRADO","ADELONDRADO","ADELONDRADO","ADELONDRADO","ADELONDRADO","ADELONDRADO","ADELONDRADO","ADELONDRADO","ADELONDRADO","ADELONDRADO","ADELONDRADO","ADELONDRADO","ADELONDRADO","ADELONDRADO","ADELONDRADO","ADELONDRADO","ADELONDRADO","ADELONDRADO","ADELONDRADO","ADELONDRADO","ADELONDRADO","ADELONDRADO","ADELONDRADO","ADELONDRADO","ADELONDRADO","ADELONDRADO","ADELONDRADO","ADELONDRADO","ADELONDRADO","ADELONDRADO","ADELONDRADO","ADELONDRADO","ADELONDRADO","ADELONDRADO","ADELONDRADO","ADELONDRADO","ADELONDRADO","ADELONDRADO","ADELONDRADO","ADELONDRADO","ADELONDRADO","ADELONDRADO","ADELONDRADO","ADELONDRADO","ADELONDRADO","ADELONDRADO","ADELONDRADO","ADELONDRADO","ADELONDRADO","ADELONDRADO","ADELONDRADO","ADELONDRADO","ADELONDRADO","ADELONDRADO","ADELONDRADO","ADELONDRADO","ADELONDRADO","ADELONDRADO","ADELONDRADO","ADELONDRADO","ADELONDRADO","ADELONDRADO","ADELONDRADO","ADELONDRADO","ADELONDRADO","ADELONDRADO","ADELONDRADO","ADELONDRADO","ADELONDRADO","ADELONDRADO","ADELONDRADO","ADELONDRADO","ADELONDRADO","ADELONDRADO","ADELONDRADO","ADELONDRADO","ADELONDRADO","ADELONDRADO","ADELONDRADO","ADELONDRADO","ADELONDRADO","ADELONDRADO","ADELONDRADO","ADELONDRADO","ADELONDRADO","ADELONDRADO","ADELONDRADO","ADELONDRADO","ADELONDRADO","ADELONDRADO","ADELONDRADO","ADELONDRADO","ADELONDRADO","ADELONDRADO","ADELONDRADO","ADELONDRADO","ADELONDRADO","ADELONDRADO","ADELONDRADO","ADELONDRADO","ADELONDRADO","ADELONDRADO","ADELONDRADO","ADELONDRADO","ADELONDRADO","ADELONDRADO","ADELONDRADO","ADELONDRADO","ADELONDRADO","ADELONDRADO","ADELONDRADO","ADELONDRADO","ADELONDRADO","ADELONDRADO","ADELONDRADO","ADELONDRADO","ADELONDRADO","ADELONDRADO","ADELONDRADO","ADELONDRADO","ADELONDRADO","ADELONDRADO","ADELONDRADO","ADELONDRADO","ADELONDRADO","ADELONDRADO","ADELONDRADO","ADELONDRADO","ADELONDRADO","ADELONDRADO","ADELONDRADO","ADELONDRADO","ADELONDRADO","ADELONDRADO","ADELONDRADO","ADELONDRADO","ADELONDRADO","ADELONDRADO","ADELONDRADO","ADELONDRADO","ADELONDRADO","ADELONDRADO","ADELONDRADO","ADELONDRADO","ADELONDRADO","ADELONDRADO","ADELONDRADO","ADELONDRADO","ADELONDRADO","ADELONDRADO","ADELONDRADO","ADELONDRADO","ADELONDRADO","ADELONDRADO","ADELONDRADO","ADELONDRADO","ADELONDRADO","ADELONDRADO","ADELONDRADO","ADELONDRADO","ADELONDRADO","ADELONDRADO","ADELONDRADO","ADELONDRADO","ADELONDRADO","ADELONDRADO","ADELONDRADO","ADELONDRADO","ADELONDRADO","ADELONDRADO","ADELONDRADO","ADELONDRADO","ADELONDRADO","ADELONDRADO","ADELONDRADO","ADELONDRADO","ADELONDRADO","ADELONDRADO","ADELONDRADO","ADELONDRADO","ADELONDRADO","ADELONDRADO","ADELONDRADO","ADELONDRADO","ADELONDRADO","ADELONDRADO","ADELONDRADO","ADELONDRADO","ADELONDRADO","ADELONDRADO","ADELONDRADO","ADELONDRADO","ADELONDRADO","ADELONDRADO","ADELONDRADO","ADELONDRADO","ADELONDRADO","ADELONDRADO","ADELONDRADO","ADELONDRADO","ADELONDRADO","ADELONDRADO","ADELONDRADO","ADELONDRADO","ADELONDRADO","ADELONDRADO","ADELONDRADO","ADELONDRADO","ADELONDRADO","ADELONDRADO","ADELONDRADO","ADELONDRADO","ADELONDRADO","ADELONDRADO","ADELONDRADO","ADELONDRADO","ADELONDRADO","ADELONDRADO","ADELONDRADO","ADELONDRADO","ADELONDRADO","ADELONDRADO","ADELONDRADO","ADELONDRADO","ADELONDRADO","ADELONDRADO","ADELONDRADO","ADELONDRADO","ADELONDRADO","ADELONDRADO","ADELONDRADO","ADELONDRADO","ADELONDRADO","ADELONDRADO","ADELONDRADO","ADELONDRADO","ADELONDRADO","ADELONDRADO","ADELONDRADO","ADELONDRADO","ADELONDRADO","ADELONDRADO","ADELONDRADO","ADELONDRADO","ADELONDRADO","ADELONDRADO","ADELONDRADO","ADELONDRADO","ADELONDRADO","ADELONDRADO","ADELONDRADO","ADELONDRADO","ADELONDRADO","ADELONDRADO","ADELONDRADO","ADELONDRADO","ADELONDRADO","ADELONDRADO","ADELONDRADO","ADELONDRADO","ADELONDRADO","ADELONDRADO","ADELONDRADO","ADELONDRADO","ADELONDRADO","ADELONDRADO","ADELONDRADO","ADELONDRADO","ADELONDRADO","ADELONDRADO","ADELONDRADO","ADELONDRADO","ADELONDRADO","ADELONDRADO","ADELONDRADO","ADELONDRADO","ADELONDRADO","ADELONDRADO","ADELONDRADO","ADELONDRADO","ADELONDRADO","ADELONDRADO","ADELONDRADO","ADELONDRADO","ADELONDRADO","ADELONDRADO","ADELONDRADO","ADELONDRADO","ADELONDRADO","ADELONDRADO","ADELONDRADO","ADELONDRADO","ADELONDRADO","ADELONDRADO","ADELONDRADO","ADELONDRADO","ADELONDRADO","ADELONDRADO","ADELONDRADO","ADELONDRADO","ADELONDRADO","ADELONDRADO","ADELONDRADO","ADELONDRADO","ADELONDRADO","ADELONDRADO","ADELONDRADO","ADELONDRADO","ADELONDRADO","ADELONDRADO","ADELONDRADO","ADELONDRADO","ADELONDRADO","ADELONDRADO","ADELONDRADO","ADELONDRADO","ADELONDRADO","ADELONDRADO","ADELONDRADO","ADELONDRADO","ADELONDRADO","ADELONDRADO","ADELONDRADO","ADELONDRADO","ADELONDRADO","ADELONDRADO","ADELONDRADO","ADELONDRADO","ADELONDRADO","ADELONDRADO","ADELONDRADO","ADELONDRADO","ADELONDRADO","ADELONDRADO","ADELONDRADO","ADELONDRADO","ADELONDRADO","ADELONDRADO","ADELONDRADO","ADELONDRADO","ADELONDRADO","ADELONDRADO","ADELONDRADO","ADELONDRADO","ADELONDRADO","ADELONDRADO","ADELONDRADO","ADELONDRADO","ADELONDRADO","ADELONDRADO","ADELONDRADO","ADELONDRADO","ADELONDRADO","ADELONDRADO","ADELONDRADO","ADELONDRADO","ADELONDRADO","ADELONDRADO","ADELONDRADO","ADELONDRADO","ADELONDRADO","ADELONDRADO","ADELONDRADO","ADELONDRADO","ADELONDRADO","ADELONDRADO","ADELONDRADO","ADELONDRADO","ADELONDRADO","ADELONDRADO","ADELONDRADO","ADELONDRADO","ADELONDRADO","ADELONDRADO","ADELONDRADO","ADELONDRADO","ADELONDRADO","ADELONDRADO","ADELONDRADO","ADELONDRADO","ADELONDRADO","ADELONDRADO","ADELONDRADO","ADELONDRADO","ADELONDRADO","ADELONDRADO","ADELONDRADO","ADELONDRADO","ADELONDRADO","ADELONDRADO","ADELONDRADO","ADELONDRADO","ADELONDRADO","ADELONDRADO","ADELONDRADO","ADELONDRADO","ADELONDRADO","ADELONDRADO","ADELONDRADO","ADELONDRADO","ADELONDRADO","ADELONDRADO","ADELONDRADO","ADELONDRADO","ADELONDRADO","ADELONDRADO","ADELONDRADO","ADELONDRADO","ADELONDRADO","ADELONDRADO","ADELONDRADO","ADELONDRADO","ADELONDRADO","ADELONDRADO","ADELONDRADO","ADELONDRADO","ADELONDRADO","ADELONDRADO","ADELONDRADO","ADELONDRADO","ADELONDRADO","ADELONDRADO","ADELONDRADO","ADELONDRADO","ADELONDRADO","ADELONDRADO","ADELONDRADO","ADELONDRADO","ADELONDRADO","ADELONDRADO","ADELONDRADO","ADELONDRADO","ADELONDRADO","ADELONDRADO","ADELONDRADO","ADELONDRADO","ADELONDRADO","ADELONDRADO","ADELONDRADO","ADELONDRADO","ADELONDRADO","ADELONDRADO","ADELONDRADO","ADELONDRADO","ADELONDRADO","ADELONDRADO","ADELONDRADO","ADELONDRADO","ADELONDRADO","ADELONDRADO","ADELONDRADO","ADELONDRADO","ADELONDRADO","ADELONDRADO","ADELONDRADO","ADELONDRADO","ADELONDRADO","ADELONDRADO","ADELONDRADO","ADELONDRADO","ADELONDRADO","ADELONDRADO","ADELONDRADO","ADELONDRADO","ADELONDRADO","ADELONDRADO","ADELONDRADO","ADELONDRADO","ADELONDRADO","ADELONDRADO","ADELONDRADO","ADELONDRADO","ADELONDRADO","ADELONDRADO","ADELONDRADO","ADELONDRADO","ADELONDRADO","ADELONDRADO","ADELONDRADO","ADELONDRADO","ADELONDRADO","ADELONDRADO","ADELONDRADO","ADELONDRADO","ADELONDRADO","ADELONDRADO","ADELONDRADO","ADELONDRADO","ADELONDRADO","ADELONDRADO","ADELONDRADO","ADELONDRADO","ADELONDRADO","ADELONDRADO","ADELONDRADO","ADELONDRADO","ADELONDRADO","ADELONDRADO","ADELONDRADO","ADELONDRADO","ADELONDRADO","ADELONDRADO","ADELONDRADO","ADELONDRADO","ADELONDRADO","ADELONDRADO","ADELONDRADO","ADELONDRADO","ADELONDRADO","ADELONDRADO","ADELONDRADO","ADELONDRADO","ADELONDRADO","ADELONDRADO","ADELONDRADO","ADELONDRADO","ADELONDRADO","ADELONDRADO","ADELONDRADO","ADELONDRADO","ADELONDRADO","ADELONDRADO","ADELONDRADO","ADELONDRADO","ADELONDRADO","ADELONDRADO","ADELONDRADO","ADELONDRADO","ADELONDRADO","ADELONDRADO","ADELONDRADO","ADELONDRADO","ADELONDRADO","ADELONDRADO","ADELONDRADO","ADELONDRADO","ADELONDRADO","ADELONDRADO","ADELONDRADO","ADELONDRADO","ADELONDRADO","ADELONDRADO","ADELONDRADO","ADELONDRADO","ADELONDRADO","ADELONDRADO","ADELONDRADO","ADELONDRADO","ADELONDRADO","ADELONDRADO","ADELONDRADO","ADELONDRADO","ADELONDRADO","ADELONDRADO","ADELONDRADO","ADELONDRADO","ADELONDRADO","ADELONDRADO","ADELONDRADO","ADELONDRADO","ADELONDRADO","ADELONDRADO","ADELONDRADO","ADELONDRADO","ADELONDRADO","ADELONDRADO","ADELONDRADO","ADELONDRADO","ADELONDRADO","ADELONDRADO","ADELONDRADO","ADELONDRADO","ADELONDRADO","ADELONDRADO","ADELONDRADO","ADELONDRADO","ADELONDRADO","ADELONDRADO","ADELONDRADO","ADELONDRADO","ADELONDRADO","ADELONDRADO","ADELONDRADO","ADELONDRADO","ADELONDRADO","ADELONDRADO","ADELONDRADO","ADELONDRADO","ADELONDRADO","ADELONDRADO","ADELONDRADO","ADELONDRADO","ADELONDRADO","ADELONDRADO","ADELONDRADO","ADELONDRADO","ADELONDRADO","ADELONDRADO","ADELONDRADO","ADELONDRADO","ADELONDRADO","ADELONDRADO","ADELONDRADO","ADELONDRADO","ADELONDRADO","ADELONDRADO","ADELONDRADO","ADELONDRADO","ADELONDRADO","ADELONDRADO","ADELONDRADO","ADELONDRADO","ADELONDRADO","ADELONDRADO","ADELONDRADO","ADELONDRADO","ADELONDRADO","ADELONDRADO","ADELONDRADO","ADELONDRADO","ADELONDRADO","ADELONDRADO","ADELONDRADO","ADELONDRADO","ADELONDRADO","ADELONDRADO","ADELONDRADO","ADELONDRADO","ADELONDRADO","ADELONDRADO","ADELONDRADO","ADELONDRADO","ADELONDRADO","ADELONDRADO","ADELONDRADO","ADELONDRADO","ADELONDRADO","ADELONDRADO","ADELONDRADO","ADELONDRADO","ADELONDRADO","ADELONDRADO","ADELONDRADO","ADELONDRADO","ADELONDRADO","ADELONDRADO","ADELONDRADO","ADELONDRADO","ADELONDRADO","ADELONDRADO","ADELONDRADO","ADELONDRADO","ADELONDRADO","ADELONDRADO","ADELONDRADO","ADELONDRADO","ADELONDRADO","ADELONDRADO","ADELONDRADO","ADELONDRADO","ADELONDRADO","ADELONDRADO","ADELONDRADO","ADELONDRADO","ADELONDRADO","ADELONDRADO","ADELONDRADO","ADELONDRADO","ADELONDRADO","ADELONDRADO","ADELONDRADO","ADELONDRADO","ADELONDRADO","ADELONDRADO","ADELONDRADO","ADELONDRADO","ADELONDRADO","ADELONDRADO","ADELONDRADO","ADELONDRADO","ADELONDRADO","ADELONDRADO","ADELONDRADO","ADELONDRADO","ADELONDRADO","ADELONDRADO","ADELONDRADO","ADELONDRADO","ADELONDRADO","ADELONDRADO","ADELONDRADO","ADELONDRADO","ADELONDRADO","ADELONDRADO","ADELONDRADO","ADELONDRADO","ADELONDRADO","ADELONDRADO","ADELONDRADO","ADELONDRADO","ADELONDRADO","ADELONDRADO","ADELONDRADO","ADELONDRADO","ADELONDRADO","ADELONDRADO","ADELONDRADO","ADELONDRADO","ADELONDRADO","ADELONDRADO","ADELONDRADO","ADELONDRADO","ADELONDRADO","ADELONDRADO","ADELONDRADO","ADELONDRADO","ADELONDRADO","ADELONDRADO","ADELONDRADO","ADELONDRADO","ADELONDRADO","ADELONDRADO","ADELONDRADO","ADELONDRADO","ADELONDRADO","ADELONDRADO","ADELONDRADO","ADELONDRADO","ADELONDRADO","ADELONDRADO","ADELONDRADO","ADELONDRADO","ADELONDRADO","ADELONDRADO","ADELONDRADO","ADELONDRADO","ADELONDRADO","ADELONDRADO","ADELONDRADO","ADELONDRADO","ADELONDRADO","ADELONDRADO","ADELONDRADO","ADELONDRADO","ADELONDRADO","ADELONDRADO","ADELONDRADO","ADELONDRADO","ADELONDRADO","ADELONDRADO","ADELONDRADO","ADELONDRADO","ADELONDRADO","ADELONDRADO","ADELONDRADO","ADELONDRADO","ADELONDRADO","ADELONDRADO","ADELONDRADO","ADELONDRADO","ADELONDRADO","ADELONDRADO","ADELONDRADO","ADELONDRADO","ADELONDRADO","ADELONDRADO","ADELONDRADO","ADELONDRADO","ADELONDRADO","ADELONDRADO","ADELONDRADO","ADELONDRADO","ADELONDRADO","ADELONDRADO","ADELONDRADO","ADELONDRADO","ADELONDRADO","ADELONDRADO","ADELONDRADO","ADELONDRADO","ADELONDRADO","ADELONDRADO","ADELONDRADO","ADELONDRADO","ADELONDRADO","ADELONDRADO","ADELONDRADO","ADELONDRADO","ADELONDRADO","ADELONDRADO","ADELONDRADO","ADELONDRADO","ADELONDRADO","ADELONDRADO","ADELONDRADO","ADELONDRADO","ADELONDRADO","ADELONDRADO","ADELONDRADO","ADELONDRADO","ADELONDRADO","ADELONDRADO","ADELONDRADO","ADELONDRADO","ADELONDRADO","ADELONDRADO","ADELONDRADO","ADELONDRADO","ADELONDRADO","ADELONDRADO","ADELONDRADO","ADELONDRADO","ADELONDRADO","ADELONDRADO","ADELONDRADO","ADELONDRADO","ADELONDRADO","ADELONDRADO","ADELONDRADO","ADELONDRADO","ADELONDRADO","ADELONDRADO","ADELONDRADO","ADELONDRADO","ADELONDRADO","ADELONDRADO","ADELONDRADO","ADELONDRADO","ADELONDRADO","ADELONDRADO","ADELONDRADO","ADELONDRADO","ADELONDRADO","ADELONDRADO","ADELONDRADO","ADELONDRADO","ADELONDRADO","ADELONDRADO","ADELONDRADO","ADELONDRADO","ADELONDRADO","ADELONDRADO","ADELONDRADO","ADELONDRADO","ADELONDRADO","ADELONDRADO","ADELONDRADO","ADELONDRADO","ADELONDRADO","ADELONDRADO","ADELONDRADO","ADELONDRADO","ADELONDRADO","ADELONDRADO","ADELONDRADO","ADELONDRADO","ADELONDRADO","ADELONDRADO","ADELONDRADO","ADELONDRADO","ADELONDRADO","ADELONDRADO","ADELONDRADO","ADELONDRADO","ADELONDRADO","ADELONDRADO","ADELONDRADO","ADELONDRADO","ADELONDRADO","ADELONDRADO","ADELONDRADO","ADELONDRADO","ADELONDRADO","ADELONDRADO","ADELONDRADO","ADELONDRADO","ADELONDRADO","ADELONDRADO","ADELONDRADO","ADELONDRADO","ADELONDRADO","ADELONDRADO","ADELONDRADO","ADELONDRADO","ADELONDRADO","ADELONDRADO","ADELONDRADO","ADELONDRADO","ADELONDRADO","ADELONDRADO","ADELONDRADO","ADELONDRADO","ADELONDRADO","ADELONDRADO","ADELONDRADO","ADELONDRADO","ADELONDRADO","ADELONDRADO","ADELONDRADO","ADELONDRADO","ADELONDRADO","ADELONDRADO","ADELONDRADO","ADELONDRADO","ADELONDRADO","ADELONDRADO","ADELONDRADO","ADELONDRADO","ADELONDRADO","ADELONDRADO","ADELONDRADO","ADELONDRADO","ADELONDRADO","ADELONDRADO","ADELONDRADO","ADELONDRADO","ADELONDRADO","ADELONDRADO","ADELONDRADO","ADELONDRADO","ADELONDRADO","ADELONDRADO","ADELONDRADO","ADELONDRADO","ADELONDRADO","ADELONDRADO","ADELONDRADO","ADELONDRADO","ADELONDRADO","ADELONDRADO","ADELONDRADO","ADELONDRADO","ADELONDRADO","ADELONDRADO","ADELONDRADO","ADELONDRADO","ADELONDRADO","ADELONDRADO","ADELONDRADO","ADELONDRADO","ADELONDRADO","ADELONDRADO","ADELONDRADO","ADELONDRADO","ADELONDRADO","ADELONDRADO","ADELONDRADO","ADELONDRADO","ADELONDRADO","ADELONDRADO","ADELONDRADO","ADELONDRADO","ADELONDRADO","ADELONDRADO","ADELONDRADO","ADELONDRADO","ADELONDRADO","ADELONDRADO","ADELONDRADO","ADELONDRADO","ADELONDRADO","ADELONDRADO","ADELONDRADO","ADELONDRADO","ADELONDRADO","ADELONDRADO","ADELONDRADO","ADELONDRADO","ADELONDRADO","ADELONDRADO","ADELONDRADO","ADELONDRADO","ADELONDRADO","ADELONDRADO","ADELONDRADO","ADELONDRADO","ADELONDRADO","ADELONDRADO","ADELONDRADO","ADELONDRADO","ADELONDRADO","ADELONDRADO","ADELONDRADO","ADELONDRADO","ADELONDRADO","ADELONDRADO","ADELONDRADO","ADELONDRADO","ADELONDRADO","ADELONDRADO","ADELONDRADO","ADELONDRADO","ADELONDRADO","ADELONDRADO","ADELONDRADO","ADELONDRADO","ADELONDRADO","ADELONDRADO","ADELONDRADO","ADELONDRADO","ADELONDRADO","ADELONDRADO","ADELONDRADO","ADELONDRADO","ADELONDRADO","ADELONDRADO","ADELONDRADO","ADELONDRADO","ADELONDRADO","ADELONDRADO","ADELONDRADO","ADELONDRADO","ADELONDRADO","ADELONDRADO","ADELONDRADO","ADELONDRADO","ADELONDRADO","ADELONDRADO","ADELONDRADO","ADELONDRADO","ADELONDRADO","ADELONDRADO","ADELONDRADO","ADELONDRADO","ADELONDRADO","ADELONDRADO","ADELONDRADO","ADELONDRADO","ADELONDRADO","ADELONDRADO","ADELONDRADO","ADELONDRADO","ADELONDRADO","ADELONDRADO","ADELONDRADO","ADELONDRADO","ADELONDRADO","ADELONDRADO","ADELONDRADO","ADELONDRADO","ADELONDRADO","ADELONDRADO","ADELONDRADO","ADELONDRADO","ADELONDRADO","ADELONDRADO","ADELONDRADO","ADELONDRADO","ADELONDRADO","ADELONDRADO","ADELONDRADO","ADELONDRADO","ADELONDRADO","ADELONDRADO","ADELONDRADO","ADELONDRADO","ADELONDRADO","ADELONDRADO","ADELONDRADO","ADELONDRADO","ADELONDRADO","ADELONDRADO","ADELONDRADO","ADELONDRADO","ADELONDRADO","ADELONDRADO","ADELONDRADO","ADELONDRADO","ADELONDRADO","ADELONDRADO","ADELONDRADO","ADELONDRADO","ADELONDRADO","ADELONDRADO","ADELONDRADO","ADELONDRADO","ADELONDRADO","ADELONDRADO","ADELONDRADO","ADELONDRADO","ADELONDRADO","ADELONDRADO","ADELONDRADO","ADELONDRADO","ADELONDRADO","ADELONDRADO","ADELONDRADO","ADELONDRADO","ADELONDRADO","ADELONDRADO","ADELONDRADO","ADELONDRADO","ADELONDRADO","ADELONDRADO","ADELONDRADO","ADELONDRADO","ADELONDRADO","ADELONDRADO","ADELONDRADO","ADELONDRADO","ADELONDRADO","ADELONDRADO","ADELONDRADO","ADELONDRADO","ADELONDRADO","ADELONDRADO","ADELONDRADO","ADELONDRADO","ADELONDRADO","ADELONDRADO","ADELONDRADO","ADELONDRADO","ADELONDRADO","ADELONDRADO","ADELONDRADO","ADELONDRADO","ADELONDRADO","ADELONDRADO","ADELONDRADO","ADELONDRADO","ADELONDRADO","ADELONDRADO","ADELONDRADO","ADELONDRADO","ADELONDRADO","ADELONDRADO","ADELONDRADO","ADELONDRADO","ADELONDRADO","ADELONDRADO","ADELONDRADO","ADELONDRADO","ADELONDRADO","ADELONDRADO","ADELONDRADO","ADELONDRADO","ADELONDRADO","ADELONDRADO","ADELONDRADO","ADELONDRADO","ADELONDRADO","ADELONDRADO","ADELONDRADO","ADELONDRADO","ADELONDRADO","ADELONDRADO","ADELONDRADO","ADELONDRADO","ADELONDRADO","ADELONDRADO","ADELONDRADO","ADELONDRADO","ADELONDRADO","ADELONDRADO","ADELONDRADO","ADELONDRADO","ADELONDRADO","ADELONDRADO","ADELONDRADO","ADELONDRADO","ADELONDRADO","ADELONDRADO","ADELONDRADO","ADELONDRADO","ADELONDRADO","ADELONDRADO","ADELONDRADO","ADELONDRADO","ADELONDRADO","ADELONDRADO","ADELONDRADO","ADELONDRADO","ADELONDRADO","ADELONDRADO","ADELONDRADO","ADELONDRADO","ADELONDRADO","ADELONDRADO","ADELONDRADO","ADELONDRADO","ADELONDRADO","ADELONDRADO","ADELONDRADO","ADELONDRADO","ADELONDRADO","ADELONDRADO","ADELONDRADO","ADELONDRADO","ADELONDRADO","ADELONDRADO","ADELONDRADO","ADELONDRADO","ADELONDRADO","ADELONDRADO","ADELONDRADO","ADELONDRADO","ADELONDRADO","ADELONDRADO","ADELONDRADO","ADELONDRADO","ADELONDRADO","ADELONDRADO","ADELONDRADO","ADELONDRADO","ADELONDRADO","ADELONDRADO","ADELONDRADO","ADELONDRADO","ADELONDRADO","ADELONDRADO","ADELONDRADO","ADELONDRADO","ADELONDRADO","ADELONDRADO","ADELONDRADO","ADELONDRADO","ADELONDRADO","ADELONDRADO","ADELONDRADO","ADELONDRADO","ADELONDRADO","ADELONDRADO","ADELONDRADO","ADELONDRADO","ADELONDRADO","ADELONDRADO","ADELONDRADO","ADELONDRADO","ADELONDRADO","ADELONDRADO","ADELONDRADO","ADELONDRADO","ADELONDRADO","ADELONDRADO","ADELONDRADO","ADELONDRADO","ADELONDRADO","ADELONDRADO","ADELONDRADO","ADELONDRADO","ADELONDRADO","ADELONDRADO","ADELONDRADO","ADELONDRADO","ADELONDRADO","ADELONDRADO","ADELONDRADO","ADELONDRADO","ADELONDRADO","ADELONDRADO","ADELONDRADO","ADELONDRADO","ADELONDRADO","ADELONDRADO","ADELONDRADO","ADELONDRADO","ADELONDRADO","ADELONDRADO","ADELONDRADO","ADELONDRADO","ADELONDRADO","ADELONDRADO","ADELONDRADO","ADELONDRADO","ADELONDRADO","ADELONDRADO","ADELONDRADO","ADELONDRADO","ADELONDRADO","ADELONDRADO","ADELONDRADO","ADELONDRADO","ADELONDRADO","ADELONDRADO","ADELONDRADO","ADELONDRADO","ADELONDRADO","ADELONDRADO","ADELONDRADO","ADELONDRADO","ADELONDRADO","ADELONDRADO","ADELONDRADO","ADELONDRADO","ADELONDRADO","ADELONDRADO","ADELONDRADO","ADELONDRADO","ADELONDRADO","ADELONDRADO","ADELONDRADO","ADELONDRADO","ADELONDRADO","ADELONDRADO","ADELONDRADO","ADELONDRADO","ADELONDRADO","ADELONDRADO","ADELONDRADO","ADELONDRADO","ADELONDRADO","ADELONDRADO","ADELONDRADO","ADELONDRADO","ADELONDRADO","ADELONDRADO","ADELONDRADO","ADELONDRADO","ADELONDRADO","ADELONDRADO","ADELONDRADO","ADELONDRADO","ADELONDRADO","ADELONDRADO","ADELONDRADO","ADELONDRADO","ADELONDRADO","ADELONDRADO","ADELONDRADO","ADELONDRADO","ADELONDRADO","ADELONDRADO","ADELONDRADO","ADELONDRADO","ADELONDRADO","ADELONDRADO","ADELONDRADO","ADELONDRADO","ADELONDRADO","ADELONDRADO","ADELONDRADO","ADELONDRADO","ADELONDRADO","ADELONDRADO","ADELONDRADO","ADELONDRADO","ADELONDRADO","ADELONDRADO","ADELONDRADO","ADELONDRADO","ADELONDRADO","ADELONDRADO","ADELONDRADO","ADELONDRADO","ADELONDRADO","ADELONDRADO","ADELONDRADO","ADELONDRADO","ADELONDRADO","ADELONDRADO","ADELONDRADO","ADELONDRADO","ADELONDRADO","ADELONDRADO","ADELONDRADO","ADELONDRADO","ADELONDRADO","ADELONDRADO","ADELONDRADO","ADELONDRADO","ADELONDRADO","ADELONDRADO","ADELONDRADO","ADELONDRADO","ADELONDRADO","ADELONDRADO","ADELONDRADO","ADELONDRADO","ADELONDRADO","ADELONDRADO","ADELONDRADO","ADELONDRADO","ADELONDRADO","ADELONDRADO","ADELONDRADO","ADELONDRADO","ADELONDRADO","ADELONDRADO","ADELONDRADO","ADELONDRADO","ADELONDRADO","ADELONDRADO","ADELONDRADO","ADELONDRADO","ADELONDRADO","ADELONDRADO","ADELONDRADO","ADELONDRADO","ADELONDRADO","ADELONDRADO","ADELONDRADO","ADELONDRADO","ADELONDRADO","ADELONDRADO","ADELONDRADO","ADELONDRADO","ADELONDRADO","ADELONDRADO","ADELONDRADO","ADELONDRADO","ADELONDRADO","ADELONDRADO","ADELONDRADO","ADELONDRADO","ADELONDRADO","ADELONDRADO","ADELONDRADO","ADELONDRADO","ADELONDRADO","ADELONDRADO","ADELONDRADO","ADELONDRADO","ADELONDRADO","ADELONDRADO","ADELONDRADO","ADELONDRADO","ADELONDRADO","ADELONDRADO","ADELONDRADO","ADELONDRADO","ADELONDRADO","ADELONDRADO","ADELONDRADO","ADELONDRADO","ADELONDRADO","ADELONDRADO","ADELONDRADO","ADELONDRADO","ADELONDRADO","ADELONDRADO","ADELONDRADO","ADELONDRADO","ADELONDRADO","ADELONDRADO","ADELONDRADO","ADELONDRADO","ADELONDRADO","ADELONDRADO","ADELONDRADO","ADELONDRADO","ADELONDRADO","ADELONDRADO","ADELONDRADO","ADELONDRADO","ADELONDRADO","ADELONDRADO","ADELONDRADO","ADELONDRADO","ADELONDRADO","ADELONDRADO","ADELONDRADO","ADELONDRADO","ADELONDRADO","ADELONDRADO","ADELONDRADO","ADELONDRADO","ADELONDRADO","ADELONDRADO","ADELONDRADO","ADELONDRADO","ADELONDRADO","ADELONDRADO","ADELONDRADO","ADELONDRADO","ADELONDRADO","ADELONDRADO","ADELONDRADO","ADELONDRADO","ADELONDRADO","ADELONDRADO","ADELONDRADO","ADELONDRADO","ADELONDRADO","ADELONDRADO","ADELONDRADO","ADELONDRADO","ADELONDRADO","ADELONDRADO","ADELONDRADO","ADELONDRADO","ADELONDRADO","ADELONDRADO","ADELONDRADO","ADELONDRADO","ADELONDRADO","ADELONDRADO","ADELONDRADO","ADELONDRADO","ADELONDRADO","ADELONDRADO","ADELONDRADO","ADELONDRADO","ADELONDRADO","ADELONDRADO","ADELONDRADO","ADELONDRADO","ADELONDRADO","ADELONDRADO","ADELONDRADO","ADELONDRADO","ADELONDRADO","ADELONDRADO","ADELONDRADO","ADELONDRADO","ADELONDRADO","ADELONDRADO","ADELONDRADO","ADELONDRADO","ADELONDRADO","ADELONDRADO","ADELONDRADO","ADELONDRADO","ADELONDRADO","ADELONDRADO","ADELONDRADO","ADELONDRADO","ADELONDRADO","ADELONDRADO","ADELONDRADO","ADELONDRADO","ADELONDRADO","ADELONDRADO","ADELONDRADO","ADELONDRADO","ADELONDRADO","ADELONDRADO","ADELONDRADO","ADELONDRADO","ADELONDRADO","ADELONDRADO","ADELONDRADO","ADELONDRADO","ADELONDRADO","ADELONDRADO","ADELONDRADO","ADELONDRADO","ADELONDRADO","ADELONDRADO","ADELONDRADO","ADELONDRADO","ADELONDRADO","ADELONDRADO","ADELONDRADO","ADELONDRADO","ADELONDRADO","ADELONDRADO","ADELONDRADO","ADELONDRADO","ADELONDRADO","ADELONDRADO","ADELONDRADO","ADELONDRADO","ADELONDRADO","ADELONDRADO","ADELONDRADO","ADELONDRADO","ADELONDRADO","ADELONDRADO","ADELONDRADO","ADELONDRADO","ADELONDRADO","ADELONDRADO","ADELONDRADO","ADELONDRADO","ADELONDRADO","ADELONDRADO","ADELONDRADO","ADELONDRADO","ADELONDRADO","ADELONDRADO","ADELONDRADO","ADELONDRADO","ADELONDRADO","ADELONDRADO","ADELONDRADO","ADELONDRADO","ADELONDRADO","ADELONDRADO","ADELONDRADO","ADELONDRADO","ADELONDRADO","ADELONDRADO","ADELONDRADO","ADELONDRADO","ADELONDRADO","ADELONDRADO","ADELONDRADO","ADELONDRADO","ADELONDRADO","ADELONDRADO","ADELONDRADO","ADELONDRADO","ADELONDRADO","ADELONDRADO","ADELONDRADO","ADELONDRADO","ADELONDRADO","ADELONDRADO","ADELONDRADO","ADELONDRADO","ADELONDRADO","ADELONDRADO","ADELONDRADO","ADELONDRADO","ADELONDRADO","ADELONDRADO","ADELONDRADO","ADELONDRADO","ADELONDRADO","ADELONDRADO","ADELONDRADO","ADELONDRADO","ADELONDRADO","ADELONDRADO","ADELONDRADO","ADELONDRADO","ADELONDRADO","ADELONDRADO","ADELONDRADO","ADELONDRADO","ADELONDRADO","ADELONDRADO","ADELONDRADO","ADELONDRADO","ADELONDRADO","ADELONDRADO","ADELONDRADO","ADELONDRADO","ADELONDRADO","ADELONDRADO","ADELONDRADO","ADELONDRADO","ADELONDRADO","ADELONDRADO","ADELONDRADO","ADELONDRADO","ADELONDRADO","ADELONDRADO","ADELONDRADO","ADELONDRADO","ADELONDRADO","ADELONDRADO","ADELONDRADO","ADELONDRADO","ADELONDRADO","ADELONDRADO","ADELONDRADO","ADELONDRADO","ADELONDRADO","ADELONDRADO","ADELONDRADO","ADELONDRADO","ADELONDRADO","ADELONDRADO","ADELONDRADO","ADELONDRADO","ADELONDRADO","ADELONDRADO","ADELONDRADO","ADELONDRADO","ADELONDRADO","ADELONDRADO","ADELONDRADO","ADELONDRADO","ADELONDRADO","ADELONDRADO","ADELONDRADO","ADELONDRADO","ADELONDRADO","ADELONDRADO","ADELONDRADO","ADELONDRADO","ADELONDRADO","ADELONDRADO","ADELONDRADO","ADELONDRADO","ADELONDRADO","ADELONDRADO","ADELONDRADO","ADELONDRADO","ADELONDRADO","ADELONDRADO","ADELONDRADO","ADELONDRADO","ADELONDRADO","ADELONDRADO","ADELONDRADO","ADELONDRADO","ADELONDRADO","ADELONDRADO","ADELONDRADO","ADELONDRADO","ADELONDRADO","ADELONDRADO","ADELONDRADO","ADELONDRADO","ADELONDRADO","ADELONDRADO","ADELONDRADO","ADELONDRADO","ADELONDRADO","ADELONDRADO","ADELONDRADO","ADELONDRADO","ADELONDRADO","ADELONDRADO","ADELONDRADO","ADELONDRADO","ADELONDRADO","ADELONDRADO","ADELONDRADO","ADELONDRADO","ADELONDRADO","ADELONDRADO","ADELONDRADO","ADELONDRADO","ADELONDRADO","ADELONDRADO","ADELONDRADO","ADELONDRADO","ADELONDRADO","ADELONDRADO","ADELONDRADO","ADELONDRADO","ADELONDRADO","ADELONDRADO","ADELONDRADO","ADELONDRADO","ADELONDRADO","ADELONDRADO","ADELONDRADO","ADELONDRADO","ADELONDRADO","ADELONDRADO","ADELONDRADO","ADELONDRADO","ADELONDRADO","ADELONDRADO","ADELONDRADO","ADELONDRADO","ADELONDRADO","ADELONDRADO","ADELONDRADO","ADELONDRADO","ADELONDRADO","ADELONDRADO","ADELONDRADO","ADELONDRADO","ADELONDRADO","ADELONDRADO","ADELONDRADO","ADELONDRADO","ADELONDRADO","ADELONDRADO","ADELONDRADO","ADELONDRADO","ADELONDRADO","ADELONDRADO","ADELONDRADO","ADELONDRADO","ADELONDRADO","ADELONDRADO","ADELONDRADO","ADELONDRADO","ADELONDRADO","ADELONDRADO","ADELONDRADO","ADELONDRADO","ADELONDRADO","ADELONDRADO","ADELONDRADO","ADELONDRADO","ADELONDRADO","ADELONDRADO","ADELONDRADO","ADELONDRADO","ADELONDRADO","ADELONDRADO","ADELONDRADO","ADELONDRADO","ADELONDRADO","ADELONDRADO","ADELONDRADO","ADELONDRADO","ADELONDRADO","ADELONDRADO","ADELONDRADO","ADELONDRADO","ADELONDRADO","ADELONDRADO","ADELONDRADO","ADELONDRADO","ADELONDRADO","ADELONDRADO","ADELONDRADO","ADELONDRADO","ADELONDRADO","ADELONDRADO","ADELONDRADO","ADELONDRADO","ADELONDRADO","ADELONDRADO","ADELONDRADO","ADELONDRADO","ADELONDRADO","ADELONDRADO","ADELONDRADO","ADELONDRADO","ADELONDRADO","ADELONDRADO","ADELONDRADO","ADELONDRADO","ADELONDRADO","ADELONDRADO","ADELONDRADO","ADELONDRADO","ADELONDRADO","ADELONDRADO","ADELONDRADO","ADELONDRADO","ADELONDRADO","ADELONDRADO","ADELONDRADO","ADELONDRADO","ADELONDRADO","ADELONDRADO","ADELONDRADO","ADELONDRADO","ADELONDRADO","ADELONDRADO","ADELONDRADO","ADELONDRADO","ADELONDRADO","ADELONDRADO","ADELONDRADO","ADELONDRADO","ADELONDRADO","ADELONDRADO","ADELONDRADO","ADELONDRADO","ADELONDRADO","ADELONDRADO","ADELONDRADO","ADELONDRADO","ADELONDRADO","ADELONDRADO","ADELONDRADO","ADELONDRADO","ADELONDRADO","ADELONDRADO","ADELONDRADO","ADELONDRADO","ADELONDRADO","ADELONDRADO","ADELONDRADO","ADELONDRADO","ADELONDRADO","ADELONDRADO","ADELONDRADO","ADELONDRADO","ADELONDRADO","ADELONDRADO","ADELONDRADO","ADELONDRADO","ADELONDRADO","ADELONDRADO","ADELONDRADO","ADELONDRADO","ADELONDRADO","ADELONDRADO","ADELONDRADO","ADELONDRADO","ADELONDRADO","ADELONDRADO","ADELONDRADO","ADELONDRADO","ADELONDRADO","ADELONDRADO","ADELONDRADO","ADELONDRADO","ADELONDRADO","ADELONDRADO","ADELONDRADO","ADELONDRADO","ADELONDRADO","ADELONDRADO","ADELONDRADO","ADELONDRADO","ADELONDRADO","ADELONDRADO","ADELONDRADO","ADELONDRADO","ADELONDRADO","ADELONDRADO","ADELONDRADO","ADELONDRADO","ADELONDRADO","ADELONDRADO","ADELONDRADO","ADELONDRADO","ADELONDRADO","ADELONDRADO","ADELONDRADO","ADELONDRADO","ADELONDRADO","ADELONDRADO","ADELONDRADO","ADELONDRADO","ADELONDRADO","ADELONDRADO","ADELONDRADO","ADELONDRADO","ADELONDRADO","ADELONDRADO","ADELONDRADO","ADELONDRADO","ADELONDRADO","ADELONDRADO","ADELONDRADO","ADELONDRADO","ADELONDRADO","ADELONDRADO","ADELONDRADO","ADELONDRADO","ADELONDRADO","ADELONDRADO","ADELONDRADO","ADELONDRADO","ADELONDRADO","ADELONDRADO","ADELONDRADO","ADELONDRADO","ADELONDRADO","ADELONDRADO","ADELONDRADO","ADELONDRADO","ADELONDRADO","ADELONDRADO","ADELONDRADO","ADELONDRADO","ADELONDRADO","ADELONDRADO","ADELONDRADO","ADELONDRADO","ADELONDRADO","ADELONDRADO","ADELONDRADO","ADELONDRADO","ADELONDRADO","ADELONDRADO","ADELONDRADO","ADELONDRADO","ADELONDRADO","ADELONDRADO","ADELONDRADO","ADELONDRADO","ADELONDRADO","ADELONDRADO","ADELONDRADO","ADELONDRADO","ADELONDRADO","ADELONDRADO","ADELONDRADO","ADELONDRADO","ADELONDRADO","ADELONDRADO","ADELONDRADO","ADELONDRADO","ADELONDRADO","ADELONDRADO","ADELONDRADO","ADELONDRADO","ADELONDRADO","ADELONDRADO","ADELONDRADO","ADELONDRADO","ADELONDRADO","ADELONDRADO","ADELONDRADO","ADELONDRADO","ADELONDRADO","ADELONDRADO","ADELONDRADO","ADELONDRADO","ADELONDRADO","ADELONDRADO","ADELONDRADO","ADELONDRADO","ADELONDRADO","ADELONDRADO","ADELONDRADO","ADELONDRADO","ADELONDRADO","ADELONDRADO","ADELONDRADO","ADELONDRADO","ADELONDRADO","ADELONDRADO","ADELONDRADO","ADELONDRADO","ADELONDRADO","ADELONDRADO","ADELONDRADO","ADELONDRADO","ADELONDRADO","ADELONDRADO","ADELONDRADO","ADELONDRADO","ADELONDRADO","ADELONDRADO","ADELONDRADO","ADELONDRADO","ADELONDRADO","ADELONDRADO","ADELONDRADO","ADELONDRADO","ADELONDRADO","ADELONDRADO","ADELONDRADO","ADELONDRADO","ADELONDRADO","ADELONDRADO","ADELONDRADO","ADELONDRADO","ADELONDRADO","ADELONDRADO","ADELONDRADO","ADELONDRADO","ADELONDRADO","ADELONDRADO","ADELONDRADO","ADELONDRADO","ADELONDRADO","ADELONDRADO","ADELONDRADO","ADELONDRADO","ADELONDRADO","ADELONDRADO","ADELONDRADO","ADELONDRADO","ADELONDRADO","ADELONDRADO","ADELONDRADO","ADELONDRADO","ADELONDRADO","ADELONDRADO","ADELONDRADO","ADELONDRADO","ADELONDRADO","ADELONDRADO","ADELONDRADO","ADELONDRADO","ADELONDRADO","ADELONDRADO","ADELONDRADO","ADELONDRADO","ADELONDRADO","ADELONDRADO","ADELONDRADO","ADELONDRADO","ADELONDRADO","ADELONDRADO","ADELONDRADO","ADELONDRADO","ADELONDRADO","ADELONDRADO","ADELONDRADO","ADELONDRADO","ADELONDRADO","ADELONDRADO","ADELONDRADO","ADELONDRADO","ADELONDRADO","ADELONDRADO","ADELONDRADO","ADELONDRADO","ADELONDRADO","ADELONDRADO","ADELONDRADO","ADELONDRADO","ADELONDRADO","ADELONDRADO","ADELONDRADO","ADELONDRADO","ADELONDRADO","ADELONDRADO","ADELONDRADO","ADELONDRADO","ADELONDRADO","ADELONDRADO","ADELONDRADO","ADELONDRADO","ADELONDRADO","ADELONDRADO","ADELONDRADO","ADELONDRADO","ADELONDRADO","ADELONDRADO","ADELONDRADO","ADELONDRADO","ADELONDRADO","ADELONDRADO","ADELONDRADO","ADELONDRADO","ADELONDRADO","ADELONDRADO","ADELONDRADO","ADELONDRADO","ADELONDRADO","ADELONDRADO","ADELONDRADO","ADELONDRADO","ADELONDRADO","ADELONDRADO","ADELONDRADO","ADELONDRADO","ADELONDRADO","ADELONDRADO","ADELONDRADO","ADELONDRADO","ADELONDRADO","ADELONDRADO","ADELONDRADO","ADELONDRADO","ADELONDRADO","ADELONDRADO","ADELONDRADO","ADELONDRADO","ADELONDRADO","ADELONDRADO","ADELONDRADO","ADELONDRADO","ADELONDRADO","ADELONDRADO","ADELONDRADO","ADELONDRADO","ADELONDRADO","ADELONDRADO","ADELONDRADO","ADELONDRADO","ADELONDRADO","ADELONDRADO","ADELONDRADO","ADELONDRADO","ADELONDRADO","ADELONDRADO","ADELONDRADO","ADELONDRADO","ADELONDRADO","ADELONDRADO","ADELONDRADO","ADELONDRADO","ADELONDRADO","ADELONDRADO","ADELONDRADO","ADELONDRADO","ADELONDRADO","ADELONDRADO","ADELONDRADO","ADELONDRADO","ADELONDRADO","ADELONDRADO","ADELONDRADO","ADELONDRADO","ADELONDRADO","ADELONDRADO","ADELONDRADO","ADELONDRADO","ADELONDRADO","ADELONDRADO","ADELONDRADO","ADELONDRADO","ADELONDRADO","ADELONDRADO","ADELONDRADO","ADELONDRADO","ADELONDRADO","ADELONDRADO","ADELONDRADO","ADELONDRADO","ADELONDRADO","ADELONDRADO","ADELONDRADO","ADELONDRADO","ADELONDRADO","ADELONDRADO","ADELONDRADO","ADELONDRADO","ADELONDRADO","ADELONDRADO","ADELONDRADO","ADELONDRADO","ADELONDRADO","ADELONDRADO","ADELONDRADO","ADELONDRADO","ADELONDRADO","ADELONDRADO","ADELONDRADO","ADELONDRADO","ADELONDRADO","ADELONDRADO","ADELONDRADO","ADELONDRADO","ADELONDRADO","ADELONDRADO","ADELONDRADO","ADELONDRADO","ADELONDRADO","ADELONDRADO","ADELONDRADO","ADELONDRADO","ADELONDRADO","ADELONDRADO","ADELONDRADO","ADELONDRADO","ADELONDRADO","ADELONDRADO","ADELONDRADO","ADELONDRADO","ADELONDRADO","ADELONDRADO","ADELONDRADO","ADELONDRADO","ADELONDRADO","ADELONDRADO","ADELONDRADO","ADELONDRADO","ADELONDRADO","ADELONDRADO","ADELONDRADO","ADELONDRADO","ADELONDRADO","ADELONDRADO","ADELONDRADO","ADELONDRADO","ADELONDRADO","ADELONDRADO","ADELONDRADO","ADELONDRADO","ADELONDRADO","ADELONDRADO","ADELONDRADO","ADELONDRADO","ADELONDRADO","ADELONDRADO","ADELONDRADO","ADELONDRADO","ADELONDRADO","ADELONDRADO","ADELONDRADO","ADELONDRADO","ADELONDRADO","ADELONDRADO","ADELONDRADO","ADELONDRADO","ADELONDRADO","ADELONDRADO","ADELONDRADO","ADELONDRADO","ADELONDRADO","ADELONDRADO","ADELONDRADO","ADELONDRADO","ADELONDRADO","ADELONDRADO","ADELONDRADO","ADELONDRADO","ADELONDRADO","ADELONDRADO","ADELONDRADO","ADELONDRADO","ADELONDRADO","ADELONDRADO","ADELONDRADO","ADELONDRADO","ADELONDRADO","ADELONDRADO","ADELONDRADO","ADELONDRADO","ADELONDRADO","ADELONDRADO","ADELONDRADO","ADELONDRADO","ADELONDRADO","ADELONDRADO","ADELONDRADO","ADELONDRADO","ADELONDRADO","ADELONDRADO","ADELONDRADO","ADELONDRADO","ADELONDRADO","ADELONDRADO","ADELONDRADO","ADELONDRADO","ADELONDRADO","ADELONDRADO","ADELONDRADO","ADELONDRADO","ADELONDRADO","ADELONDRADO","ADELONDRADO","ADELONDRADO","ADELONDRADO","ADELONDRADO","ADELONDRADO","ADELONDRADO","ADELONDRADO","ADELONDRADO","ADELONDRADO","ADELONDRADO","ADELONDRADO","ADELONDRADO","ADELONDRADO","ADELONDRADO","ADELONDRADO","ADELONDRADO","ADELONDRADO","ADELONDRADO","ADELONDRADO","ADELONDRADO","ADELONDRADO","ADELONDRADO","ADELONDRADO","ADELONDRADO","ADELONDRADO","ADELONDRADO","ADELONDRADO","ADELONDRADO","ADELONDRADO","ADELONDRADO","ADELONDRADO","ADELONDRADO","ADELONDRADO","ADELONDRADO","ADELONDRADO","ADELONDRADO","ADELONDRADO","ADELONDRADO","ADELONDRADO","ADELONDRADO","ADELONDRADO","ADELONDRADO","ADELONDRADO","ADELONDRADO","ADELONDRADO","ADELONDRADO","ADELONDRADO","ADELONDRADO","ADELONDRADO","ADELONDRADO","ADELONDRADO","ADELONDRADO","ADELONDRADO","ADELONDRADO","ADELONDRADO","ADELONDRADO","ADELONDRADO","ADELONDRADO","ADELONDRADO","ADELONDRADO","ADELONDRADO","ADELONDRADO","ADELONDRADO","ADELONDRADO","ADELONDRADO","ADELONDRADO","ADELONDRADO","ADELONDRADO","ADELONDRADO","ADELONDRADO","ADELONDRADO","ADELONDRADO","ADELONDRADO","ADELONDRADO","ADELONDRADO","ADELONDRADO","ADELONDRADO","ADELONDRADO","ADELONDRADO","ADELONDRADO","ADELONDRADO","ADELONDRADO","ADELONDRADO","ADELONDRADO","ADELONDRADO","ADELONDRADO","ADELONDRADO","ADELONDRADO","ADELONDRADO","ADELONDRADO","ADELONDRADO","ADELONDRADO","ADELONDRADO","ADELONDRADO","ADELONDRADO","ADELONDRADO","ADELONDRADO","ADELONDRADO","ADELONDRADO","ADELONDRADO","ADELONDRADO","ADELONDRADO","ADELONDRADO","ADELONDRADO","ADELONDRADO","ADELONDRADO","ADELONDRADO","ADELONDRADO","ADELONDRADO","ADELONDRADO","ADELONDRADO","ADELONDRADO","ADELONDRADO","ADELONDRADO","ADELONDRADO","ADELONDRADO","ADELONDRADO","ADELONDRADO","ADELONDRADO","ADELONDRADO","ADELONDRADO","ADELONDRADO","ADELONDRADO","ADELONDRADO","ADELONDRADO","ADELONDRADO","ADELONDRADO","ADELONDRADO","ADELONDRADO","ADELONDRADO","ADELONDRADO","ADELONDRADO","ADELONDRADO","ADELONDRADO","ADELONDRADO","ADELONDRADO","ADELONDRADO","ADELONDRADO","ADELONDRADO","ADELONDRADO","ADELONDRADO","ADELONDRADO","ADELONDRADO","ADELONDRADO","ADELONDRADO","ADELONDRADO","ADELONDRADO","ADELONDRADO","ADELONDRADO","ADELONDRADO","ADELONDRADO","ADELONDRADO","ADELONDRADO","ADELONDRADO","ADELONDRADO","ADELONDRADO","ADELONDRADO","ADELONDRADO","ADELONDRADO","ADELONDRADO","ADELONDRADO","ADELONDRADO","ADELONDRADO","ADELONDRADO","ADELONDRADO","ADELONDRADO","ADELONDRADO","ADELONDRADO","ADELONDRADO","ADELONDRADO","ADELONDRADO","ADELONDRADO","ADELONDRADO","ADELONDRADO","ADELONDRADO","ADELONDRADO","ADELONDRADO","ADELONDRADO","ADELONDRADO","ADELONDRADO","ADELONDRADO","ADELONDRADO","ADELONDRADO","ADELONDRADO","ADELONDRADO","ADELONDRADO","ADELONDRADO","ADELONDRADO","ADELONDRADO","ADELONDRADO","ADELONDRADO","ADELONDRADO","ADELONDRADO","ADELONDRADO","ADELONDRADO","ADELONDRADO","ADELONDRADO","ADELONDRADO","ADELONDRADO","ADELONDRADO","ADELONDRADO","ADELONDRADO","ADELONDRADO","ADELONDRADO","ADELONDRADO","ADELONDRADO","ADELONDRADO","ADELONDRADO","ADELONDRADO","ADELONDRADO","ADELONDRADO","ADELONDRADO","ADELONDRADO","ADELONDRADO","ADELONDRADO","ADELONDRADO","ADELONDRADO","ADELONDRADO","ADELONDRADO","ADELONDRADO","ADELONDRADO","ADELONDRADO","ADELONDRADO","ADELONDRADO","ADELONDRADO","ADELONDRADO","ADELONDRADO","ADELONDRADO","ADELONDRADO","ADELONDRADO","ADELONDRADO","ADELONDRADO","ADELONDRADO","ADELONDRADO","ADELONDRADO","ADELONDRADO","ADELONDRADO","ADELONDRADO","ADELONDRADO","ADELONDRADO","ADELONDRADO","ADELONDRADO","ADELONDRADO","ADELONDRADO","ADELONDRADO","ADELONDRADO","ADELONDRADO","ADELONDRADO","ADELONDRADO","ADELONDRADO","ADELONDRADO","ADELONDRADO","ADELONDRADO","ADELONDRADO","ADELONDRADO","ADELONDRADO","ADELONDRADO","ADELONDRADO","ADELONDRADO","ADELONDRADO","ADELONDRADO","ADELONDRADO","ADELONDRADO","ADELONDRADO","ADELONDRADO","ADELONDRADO","ADELONDRADO","ADELONDRADO","ADELONDRADO","ADELONDRADO","ADELONDRADO","ADELONDRADO","ADELONDRADO","ADELONDRADO","ADELONDRADO","ADELONDRADO","ADELONDRADO","ADELONDRADO","ADELONDRADO","ADELONDRADO","ADELONDRADO","ADELONDRADO","ADELONDRADO","ADELONDRADO","ADELONDRADO","ADELONDRADO","ADELONDRADO","ADELONDRADO","ADELONDRADO","ADELONDRADO","ADELONDRADO","ADELONDRADO","ADELONDRADO","ADELONDRADO","ADELONDRADO","ADELONDRADO","ADELONDRADO","ADELONDRADO","ADELONDRADO","ADELONDRADO","ADELONDRADO","ADELONDRADO","ADELONDRADO","ADELONDRADO","ADELONDRADO","ADELONDRADO","ADELONDRADO","ADELONDRADO","ADELONDRADO","ADELONDRADO","ADELONDRADO","ADELONDRADO","ADELONDRADO","ADELONDRADO","ADELONDRADO","ADELONDRADO","ADELONDRADO","ADELONDRADO","ADELONDRADO","ADELONDRADO","ADELONDRADO","ADELONDRADO","ADELONDRADO","ADELONDRADO","ADELONDRADO","ADELONDRADO","ADELONDRADO","ADELONDRADO","ADELONDRADO","ADELONDRADO","ADELONDRADO","ADELONDRADO","ADELONDRADO","ADELONDRADO","ADELONDRADO","ADELONDRADO","ADELONDRADO","ADELONDRADO","ADELONDRADO","ADELONDRADO","ADELONDRADO","ADELONDRADO","ADELONDRADO","ADELONDRADO","ADELONDRADO","ADELONDRADO","ADELONDRADO","ADELONDRADO","ADELONDRADO","ADELONDRADO","ADELONDRADO","ADELONDRADO","ADELONDRADO","ADELONDRADO","ADELONDRADO","ADELONDRADO","ADELONDRADO","ADELONDRADO","ADELONDRADO","ADELONDRADO","ADELONDRADO","ADELONDRADO","ADELONDRADO","ADELONDRADO","ADELONDRADO","ADELONDRADO","ADELONDRADO","ADELONDRADO","ADELONDRADO","ADELONDRADO","ADELONDRADO","ADELONDRADO","ADELONDRADO","ADELONDRADO","ADELONDRADO","ADELONDRADO","ADELONDRADO","ADELONDRADO","ADELONDRADO","ADELONDRADO","ADELONDRADO","ADELONDRADO","ADELONDRADO","ADELONDRADO","ADELONDRADO","ADELONDRADO","ADELONDRADO","ADELONDRADO","ADELONDRADO","ADELONDRADO","ADELONDRADO","ADELONDRADO","ADELONDRADO","ADELONDRADO","ADELONDRADO","ADELONDRADO","ADELONDRADO","ADELONDRADO","ADELONDRADO","ADELONDRADO","ADELONDRADO","ADELONDRADO","ADELONDRADO","ADELONDRADO","ADELONDRADO","ADELONDRADO","ADELONDRADO","ADELONDRADO","ADELONDRADO","ADELONDRADO","ADELONDRADO","ADELONDRADO","ADELONDRADO","ADELONDRADO","ADELONDRADO","ADELONDRADO","ADELONDRADO","ADELONDRADO","ADELONDRADO","ADELONDRADO","ADELONDRADO","ADELONDRADO","ADELONDRADO","ADELONDRADO","ADELONDRADO","ADELONDRADO","ADELONDRADO","ADELONDRADO","ADELONDRADO","ADELONDRADO","ADELONDRADO","ADELONDRADO","ADELONDRADO","ADELONDRADO","ADELONDRADO","ADELONDRADO","ADELONDRADO","ADELONDRADO","ADELONDRADO","ADELONDRADO","ADELONDRADO","ADELONDRADO","ADELONDRADO","ADELONDRADO","ADELONDRADO","ADELONDRADO","ADELONDRADO","ADELONDRADO","ADELONDRADO","ADELONDRADO","ADELONDRADO","ADELONDRADO","ADELONDRADO","ADELONDRADO","ADELONDRADO","ADELONDRADO","ADELONDRADO","ADELONDRADO","ADELONDRADO","ADELONDRADO","ADELONDRADO","ADELONDRADO","ADELONDRADO","ADELONDRADO","ADELONDRADO","ADELONDRADO","ADELONDRADO","ADELONDRADO","ADELONDRADO","ADELONDRADO","ADELONDRADO","ADELONDRADO","ADELONDRADO","ADELONDRADO","ADELONDRADO","ADELONDRADO","ADELONDRADO","ADELONDRADO","ADELONDRADO","ADELONDRADO","ADELONDRADO","ADELONDRADO","ADELONDRADO","ADELONDRADO","ADELONDRADO","ADELONDRADO","ADELONDRADO","ADELONDRADO","ADELONDRADO","ADELONDRADO","ADELONDRADO","ADELONDRADO","ADELONDRADO","ADELONDRADO","ADELONDRADO","ADELONDRADO","ADELONDRADO","ADELONDRADO","ADELONDRADO","ADELONDRADO","ADELONDRADO","ADELONDRADO","ADELONDRADO","ADELONDRADO","ADELONDRADO","ADELONDRADO","ADELONDRADO","ADELONDRADO","ADELONDRADO","ADELONDRADO","ADELONDRADO","ADELONDRADO","ADELONDRADO","ADELONDRADO","ADELONDRADO","ADELONDRADO","ADELONDRADO","ADELONDRADO","ADELONDRADO","ADELONDRADO","ADELONDRADO","ADELONDRADO","ADELONDRADO","ADELONDRADO","ADELONDRADO","ADELONDRADO","ADELONDRADO","ADELONDRADO","ADELONDRADO","ADELONDRADO","ADELONDRADO","ADELONDRADO","ADELONDRADO","ADELONDRADO","ADELONDRADO","ADELONDRADO","ADELONDRADO","ADELONDRADO","ADELONDRADO","ADELONDRADO","ADELONDRADO","ADELONDRADO","ADELONDRADO","ADELONDRADO","ADELONDRADO","ADELONDRADO","ADELONDRADO","ADELONDRADO","ADELONDRADO","ADELONDRADO","ADELONDRADO","ADELONDRADO","ADELONDRADO","ADELONDRADO","ADELONDRADO","ADELONDRADO","ADELONDRADO","ADELONDRADO","ADELONDRADO","ADELONDRADO","ADELONDRADO","ADELONDRADO","ADELONDRADO","ADELONDRADO","ADELONDRADO","ADELONDRADO","ADELONDRADO","ADELONDRADO","ADELONDRADO","ADELONDRADO","ADELONDRADO","ADELONDRADO","ADELONDRADO","ADELONDRADO","ADELONDRADO","ADELONDRADO","ADELONDRADO","ADELONDRADO","ADELONDRADO","ADELONDRADO","ADELONDRADO","ADELONDRADO","ADELONDRADO","ADELONDRADO","ADELONDRADO","ADELONDRADO","ADELONDRADO","ADELONDRADO","ADELONDRADO","ADELONDRADO","ADELONDRADO","ADELONDRADO","ADELONDRADO","ADELONDRADO","ADELONDRADO","ADELONDRADO","ADELONDRADO","ADELONDRADO","ADELONDRADO","ADELONDRADO","ADELONDRADO","ADELONDRADO","ADELONDRADO","ADELONDRADO","ADELONDRADO","ADELONDRADO","ADELONDRADO","ADELONDRADO","ADELONDRADO","ADELONDRADO","ADELONDRADO","ADELONDRADO","ADELONDRADO","ADELONDRADO","ADELONDRADO","ADELONDRADO","ADELONDRADO","ADELONDRADO","ADELONDRADO","ADELONDRADO","ADELONDRADO","ADELONDRADO","ADELONDRADO","ADELONDRADO","ADELONDRADO","ADELONDRADO","ADELONDRADO","ADELONDRADO","ADELONDRADO","ADELONDRADO","ADELONDRADO","ADELONDRADO","ADELONDRADO","ADELONDRADO","ADELONDRADO","ADELONDRADO","ADELONDRADO","ADELONDRADO","ADELONDRADO","ADELONDRADO","ADELONDRADO","ADELONDRADO","ADELONDRADO","ADELONDRADO","ADELONDRADO","ADELONDRADO","ADELONDRADO","ADELONDRADO","ADELONDRADO","ADELONDRADO","ADELONDRADO","ADELONDRADO","ADELONDRADO","ADELONDRADO","ADELONDRADO","ADELONDRADO","ADELONDRADO","ADELONDRADO","ADELONDRADO","ADELONDRADO","ADELONDRADO","ADELONDRADO","ADELONDRADO","ADELONDRADO","ADELONDRADO","ADELONDRADO","ADELONDRADO","ADELONDRADO","ADELONDRADO","ADELONDRADO","ADELONDRADO","ADELONDRADO","ADELONDRADO","ADELONDRADO","ADELONDRADO","ADELONDRADO","ADELONDRADO","ADELONDRADO","ADELONDRADO","ADELONDRADO","ADELONDRADO","ADELONDRADO","ADELONDRADO","ADELONDRADO","ADELONDRADO","ADELONDRADO","ADELONDRADO","ADELONDRADO","ADELONDRADO","ADELONDRADO","ADELONDRADO","ADELONDRADO","ADELONDRADO","ADELONDRADO","ADELONDRADO","ADELONDRADO","ADELONDRADO","ADELONDRADO","ADELONDRADO","ADELONDRADO","ADELONDRADO","ADELONDRADO","ADELONDRADO","ADELONDRADO","ADELONDRADO","ADELONDRADO","ADELONDRADO","ADELONDRADO","ADELONDRADO","ADELONDRADO","ADELONDRADO","ADELONDRADO","ADELONDRADO","ADELONDRADO","ADELONDRADO","ADELONDRADO","ADELONDRADO","ADELONDRADO","ADELONDRADO","ADELONDRADO","ADELONDRADO","ADELONDRADO","ADELONDRADO","ADELONDRADO","ADELONDRADO","ADELONDRADO","ADELONDRADO","ADELONDRADO","ADELONDRADO","ADELONDRADO","ADELONDRADO","ADELONDRADO","ADELONDRADO","ADELONDRADO","ADELONDRADO","ADELONDRADO","ADELONDRADO","ADELONDRADO","ADELONDRADO","ADELONDRADO","ADELONDRADO","ADELONDRADO","ADELONDRADO","ADELONDRADO","ADELONDRADO","ADELONDRADO","ADELONDRADO","ADELONDRADO","ADELONDRADO","ADELONDRADO","ADELONDRADO","ADELONDRADO","ADELONDRADO","ADELONDRADO","ADELONDRADO","ADELONDRADO","ADELONDRADO","ADELONDRADO","ADELONDRADO","ADELONDRADO","ADELONDRADO","ADELONDRADO","ADELONDRADO","ADELONDRADO","ADELONDRADO","ADELONDRADO","ADELONDRADO","ADELONDRADO","ADELONDRADO","ADELONDRADO","ADELONDRADO","ADELONDRADO","ADELONDRADO","ADELONDRADO","ADELONDRADO","ADELONDRADO","ADELONDRADO","ADELONDRADO","ADELONDRADO","ADELONDRADO","ADELONDRADO","ADELONDRADO","ADELONDRADO","ADELONDRADO","ADELONDRADO","ADELONDRADO","ADELONDRADO","ADELONDRADO","ADELONDRADO","ADELONDRADO","ADELONDRADO","ADELONDRADO","ADELONDRADO","ADELONDRADO","ADELONDRADO","ADELONDRADO","ADELONDRADO","ADELONDRADO","ADELONDRADO","ADELONDRADO","ADELONDRADO","ADELONDRADO","ADELONDRADO","ADELONDRADO","ADELONDRADO","ADELONDRADO","ADELONDRADO","ADELONDRADO","ADELONDRADO","ADELONDRADO","ADELONDRADO","ADELONDRADO","ADELONDRADO","ADELONDRADO","ADELONDRADO","ADELONDRADO","ADELONDRADO","ADELONDRADO","ADELONDRADO","ADELONDRADO","ADELONDRADO","ADELONDRADO","ADELONDRADO","ADELONDRADO","ADELONDRADO","ADELONDRADO","ADELONDRADO","ADELONDRADO","ADELONDRADO","ADELONDRADO","ADELONDRADO","ADELONDRADO","ADELONDRADO","ADELONDRADO","ADELONDRADO","ADELONDRADO","ADELONDRADO","ADELONDRADO","ADELONDRADO","ADELONDRADO","ADELONDRADO","ADELONDRADO","ADELONDRADO","ADELONDRADO","ADELONDRADO","ADELONDRADO","ADELONDRADO","ADELONDRADO","ADELONDRADO","ADELONDRADO","ADELONDRADO","ADELONDRADO","ADELONDRADO","ADELONDRADO","ADELONDRADO","ADELONDRADO","ADELONDRADO","ADELONDRADO","ADELONDRADO","ADELONDRADO","ADELONDRADO","ADELONDRADO","ADELONDRADO","ADELONDRADO","ADELONDRADO","ADELONDRADO","ADELONDRADO","ADELONDRADO","ADELONDRADO","ADELONDRADO","ADELONDRADO","ADELONDRADO","ADELONDRADO","ADELONDRADO","ADELONDRADO","ADELONDRADO","ADELONDRADO","ADELONDRADO","ADELONDRADO","ADELONDRADO","ADELONDRADO","ADELONDRADO","ADELONDRADO","ADELONDRADO","ADELONDRADO","ADELONDRADO","ADELONDRADO","ADELONDRADO","ADELONDRADO","ADELONDRADO","ADELONDRADO","ADELONDRADO","ADELONDRADO","ADELONDRADO","ADELONDRADO","ADELONDRADO","ADELONDRADO","ADELONDRADO","ADELONDRADO","ADELONDRADO","ADELONDRADO","ADELONDRADO","ADELONDRADO","ADELONDRADO","ADELONDRADO","ADELONDRADO","ADELONDRADO","ADELONDRADO","ADELONDRADO","ADELONDRADO","ADELONDRADO","ADELONDRADO","ADELONDRADO","ADELONDRADO","ADELONDRADO","ADELONDRADO","ADELONDRADO","ADELONDRADO","ADELONDRADO","ADELONDRADO","ADELONDRADO","ADELONDRADO","ADELONDRADO","ADELONDRADO","ADELONDRADO","ADELONDRADO","ADELONDRADO","ADELONDRADO","ADELONDRADO","ADELONDRADO","ADELONDRADO","ADELONDRADO","ADELONDRADO","ADELONDRADO","ADELONDRADO","ADELONDRADO","ADELONDRADO","ADELONDRADO","ADELONDRADO","ADELONDRADO","ADELONDRADO","ADELONDRADO","ADELONDRADO","ADELONDRADO","ADELONDRADO","ADELONDRADO","ADELONDRADO","ADELONDRADO","ADELONDRADO","ADELONDRADO","ADELONDRADO","ADELONDRADO","ADELONDRADO","ADELONDRADO","ADELONDRADO","ADELONDRADO","ADELONDRADO","ADELONDRADO","ADELONDRADO","ADELONDRADO","ADELONDRADO","ADELONDRADO","ADELONDRADO","ADELONDRADO","ADELONDRADO","ADELONDRADO","ADELONDRADO","ADELONDRADO","ADELONDRADO","ADELONDRADO","ADELONDRADO","ADELONDRADO","ADELONDRADO","ADELONDRADO","ADELONDRADO","ADELONDRADO","ADELONDRADO","ADELONDRADO","ADELONDRADO","ADELONDRADO","ADELONDRADO","ADELONDRADO","ADELONDRADO","ADELONDRADO","ADELONDRADO","ADELONDRADO","ADELONDRADO","ADELONDRADO","ADELONDRADO","ADELONDRADO","ADELONDRADO","ADELONDRADO","ADELONDRADO","ADELONDRADO","ADELONDRADO","ADELONDRADO","ADELONDRADO","ADELONDRADO","ADELONDRADO","ADELONDRADO","ADELONDRADO","ADELONDRADO","ADELONDRADO","ADELONDRADO","ADELONDRADO","ADELONDRADO","ADELONDRADO","ADELONDRADO","ADELONDRADO","ADELONDRADO","ADELONDRADO","ADELONDRADO","ADELONDRADO","ADELONDRADO","ADELONDRADO","ADELONDRADO","ADELONDRADO","ADELONDRADO","ADELONDRADO","ADELONDRADO","ADELONDRADO","ADELONDRADO","ADELONDRADO","ADELONDRADO","ADELONDRADO","ADELONDRADO","ADELONDRADO","ADELONDRADO","ADELONDRADO","ADELONDRADO","ADELONDRADO","ADELONDRADO","ADELONDRADO","ADELONDRADO","ADELONDRADO","ADELONDRADO","ADELONDRADO","ADELONDRADO","ADELONDRADO","ADELONDRADO","ADELONDRADO","ADELONDRADO","ADELONDRADO","ADELONDRADO","ADELONDRADO","ADELONDRADO","ADELONDRADO","ADELONDRADO","ADELONDRADO","ADELONDRADO","ADELONDRADO","ADELONDRADO","ADELONDRADO","ADELONDRADO","ADELONDRADO","ADELONDRADO","ADELONDRADO","ADELONDRADO","ADELONDRADO","ADELONDRADO","ADELONDRADO","ADELONDRADO","ADELONDRADO","ADELONDRADO","ADELONDRADO","ADELONDRADO","ADELONDRADO","ADELONDRADO","ADELONDRADO","ADELONDRADO","ADELONDRADO","ADELONDRADO","ADELONDRADO","ADELONDRADO","ADELONDRADO","ADELONDRADO","ADELONDRADO","ADELONDRADO","ADELONDRADO","ADELONDRADO","ADELONDRADO","ADELONDRADO","ADELONDRADO","ADELONDRADO","ADELONDRADO","ADELONDRADO","ADELONDRADO","ADELONDRADO","ADELONDRADO","ADELONDRADO","ADELONDRADO","ADELONDRADO","ADELONDRADO","ADELONDRADO","ADELONDRADO","ADELONDRADO","ADELONDRADO","ADELONDRADO","ADELONDRADO","ADELONDRADO","ADELONDRADO","ADELONDRADO","ADELONDRADO","ADELONDRADO","ADELONDRADO","ADELONDRADO","ADELONDRADO","ADELONDRADO","ADELONDRADO","ADELONDRADO","ADELONDRADO","ADELONDRADO","ADELONDRADO","ADELONDRADO","ADELONDRADO","ADELONDRADO","ADELONDRADO","ADELONDRADO","ADELONDRADO","ADELONDRADO","ADELONDRADO","ADELONDRADO","ADELONDRADO","ADELONDRADO","ADELONDRADO","ADELONDRADO","ADELONDRADO","ADELONDRADO","ADELONDRADO","ADELONDRADO","ADELONDRADO","ADELONDRADO","ADELONDRADO","ADELONDRADO","ADELONDRADO","ADELONDRADO","ADELONDRADO","ADELONDRADO","ADELONDRADO","ADELONDRADO","ADELONDRADO","ADELONDRADO","ADELONDRADO","ADELONDRADO","ADELONDRADO","ADELONDRADO","ADELONDRADO","ADELONDRADO","ADELONDRADO","ADELONDRADO","ADELONDRADO","ADELONDRADO","ADELONDRADO","ADELONDRADO","ADELONDRADO","ADELONDRADO","ADELONDRADO","ADELONDRADO","ADELONDRADO","ADELONDRADO","ADELONDRADO","ADELONDRADO","ADELONDRADO","ADELONDRADO","ADELONDRADO","ADELONDRADO","ADELONDRADO","ADELONDRADO","ADELONDRADO","ADELONDRADO","ADELONDRADO","ADELONDRADO","ADELONDRADO","ADELONDRADO","ADELONDRADO","ADELONDRADO","ADELONDRADO","ADELONDRADO","ADELONDRADO","ADELONDRADO","ADELONDRADO","ADELONDRADO","ADELONDRADO","ADELONDRADO","ADELONDRADO","ADELONDRADO","ADELONDRADO","ADELONDRADO","ADELONDRADO","ADELONDRADO","ADELONDRADO","ADELONDRADO","ADELONDRADO","ADELONDRADO","ADELONDRADO","ADELONDRADO","ADELONDRADO","ADELONDRADO","ADELONDRADO","ADELONDRADO","ADELONDRADO","ADELONDRADO","ADELONDRADO","ADELONDRADO","ADELONDRADO","ADELONDRADO","ADELONDRADO","ADELONDRADO","ADELONDRADO","ADELONDRADO","ADELONDRADO","ADELONDRADO","ADELONDRADO","ADELONDRADO","ADELONDRADO","ADELONDRADO","ADELONDRADO","ADELONDRADO","ADELONDRADO","ADELONDRADO","ADELONDRADO","ADELONDRADO","ADELONDRADO","ADELONDRADO","ADELONDRADO","ADELONDRADO","ADELONDRADO","ADELONDRADO","ADELONDRADO","ADELONDRADO","ADELONDRADO","ADELONDRADO","ADELONDRADO","ADELONDRADO","ADELONDRADO","ADELONDRADO","ADELONDRADO","ADELONDRADO","ADELONDRADO","ADELONDRADO","ADELONDRADO","ADELONDRADO","ADELONDRADO","ADELONDRADO","ADELONDRADO","ADELONDRADO","ADELONDRADO","ADELONDRADO","ADELONDRADO","ADELONDRADO","ADELONDRADO","ADELONDRADO","ADELONDRADO","ADELONDRADO","ADELONDRADO","ADELONDRADO","ADELONDRADO","ADELONDRADO","ADELONDRADO","ADELONDRADO","ADELONDRADO","ADELONDRADO","ADELONDRADO","ADELONDRADO","ADELONDRADO","ADELONDRADO","ADELONDRADO","ADELONDRADO","ADELONDRADO","ADELONDRADO","ADELONDRADO","ADELONDRADO","ADELONDRADO","ADELONDRADO","ADELONDRADO","ADELONDRADO","ADELONDRADO","ADELONDRADO","ADELONDRADO","ADELONDRADO","ADELONDRADO","ADELONDRADO","ADELONDRADO","ADELONDRADO","ADELONDRADO","ADELONDRADO","ADELONDRADO","ADELONDRADO","ADELONDRADO","ADELONDRADO","ADELONDRADO","ADELONDRADO","ADELONDRADO","ADELONDRADO","ADELONDRADO","ADELONDRADO","ADELONDRADO","ADELONDRADO","ADELONDRADO","ADELONDRADO","ADELONDRADO","ADELONDRADO","ADELONDRADO","ADELONDRADO","ADELONDRADO","ADELONDRADO","ADELONDRADO","ADELONDRADO","ADELONDRADO","ADELONDRADO","ADELONDRADO","ADELONDRADO","ADELONDRADO","ADELONDRADO","ADELONDRADO","ADELONDRADO","ADELONDRADO","ADELONDRADO","ADELONDRADO","ADELONDRADO","ADELONDRADO","ADELONDRADO","ADELONDRADO","ADELONDRADO","ADELONDRADO","ADELONDRADO","ADELONDRADO","ADELONDRADO","ADELONDRADO","ADELONDRADO","ADELONDRADO","ADELONDRADO","ADELONDRADO","ADELONDRADO","ADELONDRADO","ADELONDRADO","ADELONDRADO","ADELONDRADO","ADELONDRADO","ADELONDRADO","ADELONDRADO","ADELONDRADO","ADELONDRADO","ADELONDRADO","ADELONDRADO","ADELONDRADO","ADELONDRADO","ADELONDRADO","ADELONDRADO","ADELONDRADO","ADELONDRADO","ADELONDRADO","ADELONDRADO","ADELONDRADO","ADELONDRADO","ADELONDRADO","ADELONDRADO","ADELONDRADO","ADELONDRADO","ADELONDRADO","ADELONDRADO","ADELONDRADO","ADELONDRADO","ADELONDRADO","ADELONDRADO","ADELONDRADO","ADELONDRADO","ADELONDRADO","ADELONDRADO","ADELONDRADO","ADELONDRADO","ADELONDRADO","ADELONDRADO","ADELONDRADO","ADELONDRADO","ADELONDRADO","ADELONDRADO","ADELONDRADO","ADELONDRADO","ADELONDRADO","ADELONDRADO","ADELONDRADO","ADELONDRADO","ADELONDRADO","ADELONDRADO","ADELONDRADO","ADELONDRADO","ADELONDRADO","ADELONDRADO","ADELONDRADO","ADELONDRADO","ADELONDRADO","ADELONDRADO","ADELONDRADO","ADELONDRADO","ADELONDRADO","ADELONDRADO","ADELONDRADO","ADELONDRADO","ADELONDRADO","ADELONDRADO","ADELONDRADO","ADELONDRADO","ADELONDRADO","ADELONDRADO","ADELONDRADO","ADELONDRADO","ADELONDRADO","ADELONDRADO","ADELONDRADO","ADELONDRADO","ADELONDRADO","ADELONDRADO","ADELONDRADO","ADELONDRADO","ADELONDRADO","ADELONDRADO","ADELONDRADO","ADELONDRADO","ADELONDRADO","ADELONDRADO","ADELONDRADO","ADELONDRADO","ADELONDRADO","ADELONDRADO","ADELONDRADO","ADELONDRADO","ADELONDRADO","ADELONDRADO","ADELONDRADO","ADELONDRADO","ADELONDRADO","ADELONDRADO","ADELONDRADO","ADELONDRADO","ADELONDRADO","ADELONDRADO","ADELONDRADO","ADELONDRADO","ADELONDRADO","ADELONDRADO","ADELONDRADO","ADELONDRADO","ADELONDRADO","ADELONDRADO","ADELONDRADO","ADELONDRADO","ADELONDRADO","ADELONDRADO","ADELONDRADO","ADELONDRADO","ADELONDRADO","ADELONDRADO","ADELONDRADO","ADELONDRADO","ADELONDRADO","ADELONDRADO","ADELONDRADO","ADELONDRADO","ADELONDRADO","ADELONDRADO","ADELONDRADO","ADELONDRADO","ADELONDRADO","ADELONDRADO","ADELONDRADO","ADELONDRADO","ADELONDRADO","ADELONDRADO","ADELONDRADO","ADELONDRADO","ADELONDRADO","ADELONDRADO","ADELONDRADO","ADELONDRADO","ADELONDRADO","ADELONDRADO","ADELONDRADO","ADELONDRADO","ADELONDRADO","ADELONDRADO","ADELONDRADO","ADELONDRADO","ADELONDRADO","ADELONDRADO","ADELONDRADO","ADELONDRADO","ADELONDRADO","ADELONDRADO","ADELONDRADO","ADELONDRADO","ADELONDRADO","ADELONDRADO","ADELONDRADO","ADELONDRADO","ADELONDRADO","ADELONDRADO","ADELONDRADO","ADELONDRADO","ADELONDRADO","ADELONDRADO","ADELONDRADO","ADELONDRADO","ADELONDRADO","ADELONDRADO","ADELONDRADO","ADELONDRADO","ADELONDRADO","ADELONDRADO","ADELONDRADO","ADELONDRADO","ADELONDRADO","ADELONDRADO","ADELONDRADO","ADELONDRADO","ADELONDRADO","ADELONDRADO","ADELONDRADO","ADELONDRADO","ADELONDRADO","ADELONDRADO","ADELONDRADO","ADELONDRADO","ADELONDRADO","ADELONDRADO","ADELONDRADO","ADELONDRADO","ADELONDRADO","ADELONDRADO","ADELONDRADO","ADELONDRADO","ADELONDRADO","ADELONDRADO","ADELONDRADO","ADELONDRADO","ADELONDRADO","ADELONDRADO","ADELONDRADO","ADELONDRADO","ADELONDRADO","ADELONDRADO","ADELONDRADO","ADELONDRADO","ADELONDRADO","ADELONDRADO","ADELONDRADO","ADELONDRADO","ADELONDRADO","ADELONDRADO","ADELONDRADO","ADELONDRADO","ADELONDRADO","ADELONDRADO","ADELONDRADO","ADELONDRADO","ADELONDRADO","ADELONDRADO","ADELONDRADO","ADELONDRADO","ADELONDRADO","ADELONDRADO","ADELONDRADO","ADELONDRADO","ADELONDRADO","ADELONDRADO","ADELONDRADO","ADELONDRADO","ADELONDRADO","ADELONDRADO","ADELONDRADO","ADELONDRADO","ADELONDRADO","ADELONDRADO","ADELONDRADO","ADELONDRADO","ADELONDRADO","ADELONDRADO","ADELONDRADO","ADELONDRADO","ADELONDRADO","ADELONDRADO","ADELONDRADO","ADELONDRADO","ADELONDRADO","ADELONDRADO","ADELONDRADO","ADELONDRADO","ADELONDRADO","ADELONDRADO","ADELONDRADO","ADELONDRADO","ADELONDRADO","ADELONDRADO","ADELONDRADO","ADELONDRADO","ADELONDRADO","ADELONDRADO","ADELONDRADO","ADELONDRADO","ADELONDRADO","ADELONDRADO","ADELONDRADO","ADELONDRADO","ADELONDRADO","ADELONDRADO","ADELONDRADO","ADELONDRADO","ADELONDRADO","ADELONDRADO","ADELONDRADO","ADELONDRADO","ADELONDRADO","ADELONDRADO","ADELONDRADO","ADELONDRADO","ADELONDRADO","ADELONDRADO","ADELONDRADO","ADELONDRADO","ADELONDRADO","ADELONDRADO","ADELONDRADO","ADELONDRADO","ADELONDRADO","ADELONDRADO","ADELONDRADO","ADELONDRADO","ADELONDRADO","ADELONDRADO","ADELONDRADO","ADELONDRADO","ADELONDRADO","ADELONDRADO","ADELONDRADO","ADELONDRADO","ADELONDRADO","ADELONDRADO","ADELONDRADO","ADELONDRADO","ADELONDRADO","ADELONDRADO","ADELONDRADO","ADELONDRADO","ADELONDRADO","ADELONDRADO","ADELONDRADO","ADELONDRADO","ADELONDRADO","ADELONDRADO","ADELONDRADO","ADELONDRADO","ADELONDRADO","ADELONDRADO","ADELONDRADO","ADELONDRADO","ADELONDRADO","ADELONDRADO","ADELONDRADO","ADELONDRADO","ADELONDRADO","ADELONDRADO","ADELONDRADO","ADELONDRADO","ADELONDRADO","ADELONDRADO","ADELONDRADO","ADELONDRADO","ADELONDRADO","ADELONDRADO","ADELONDRADO","ADELONDRADO","ADELONDRADO","ADELONDRADO","ADELONDRADO","ADELONDRADO","ADELONDRADO","ADELONDRADO","ADELONDRADO","ADELONDRADO","ADELONDRADO","ADELONDRADO","ADELONDRADO","ADELONDRADO","ADELONDRADO","ADELONDRADO","ADELONDRADO","ADELONDRADO","ADELONDRADO","ADELONDRADO","ADELONDRADO","ADELONDRADO","ADELONDRADO","ADELONDRADO","ADELONDRADO","ADELONDRADO","ADELONDRADO","ADELONDRADO","ADELONDRADO","ADELONDRADO","ADELONDRADO","ADELONDRADO","ADELONDRADO","ADELONDRADO","ADELONDRADO","ADELONDRADO","ADELONDRADO","ADELONDRADO","ADELONDRADO","ADELONDRADO","ADELONDRADO","ADELONDRADO","ADELONDRADO","ADELONDRADO","ADELONDRADO","ADELONDRADO","ADELONDRADO","ADELONDRADO","ADELONDRADO","ADELONDRADO","ADELONDRADO","ADELONDRADO","ADELONDRADO","ADELONDRADO","ADELONDRADO","ADELONDRADO","ADELONDRADO","ADELONDRADO","ADELONDRADO","ADELONDRADO","ADELONDRADO","ADELONDRADO","ADELONDRADO","ADELONDRADO","ADELONDRADO","ADELONDRADO","ADELONDRADO","ADELONDRADO","ADELONDRADO","ADELONDRADO","ADELONDRADO","ADELONDRADO","ADELONDRADO","ADELONDRADO","ADELONDRADO","ADELONDRADO","ADELONDRADO","ADELONDRADO","ADELONDRADO","ADELONDRADO","ADELONDRADO","ADELONDRADO","ADELONDRADO","ADELONDRADO","ADELONDRADO","ADELONDRADO","ADELONDRADO","ADELONDRADO","ADELONDRADO","ADELONDRADO","ADELONDRADO","ADELONDRADO","ADELONDRADO","ADELONDRADO","ADELONDRADO","ADELONDRADO","ADELONDRADO","ADELONDRADO","ADELONDRADO","ADELONDRADO","ADELONDRADO","ADELONDRADO","ADELONDRADO","ADELONDRADO","ADELONDRADO","ADELONDRADO","ADELONDRADO","ADELONDRADO","ADELONDRADO","ADELONDRADO","ADELONDRADO","ADELONDRADO","ADELONDRADO","ADELONDRADO","ADELONDRADO","ADELONDRADO","ADELONDRADO","ADELONDRADO","ADELONDRADO","ADELONDRADO","ADELONDRADO","ADELONDRADO","ADELONDRADO","ADELONDRADO","ADELONDRADO","ADELONDRADO","ADELONDRADO","ADELONDRADO","ADELONDRADO","ADELONDRADO","ADELONDRADO","ADELONDRADO","ADELONDRADO","ADELONDRADO","ADELONDRADO","ADELONDRADO","ADELONDRADO","ADELONDRADO","ADELONDRADO","ADELONDRADO","ADELONDRADO","ADELONDRADO","ADELONDRADO","ADELONDRADO","ADELONDRADO","ADELONDRADO","ADELONDRADO","ADELONDRADO","ADELONDRADO","ADELONDRADO","ADELONDRADO","ADELONDRADO","ADELONDRADO","ADELONDRADO","ADELONDRADO","ADELONDRADO","ADELONDRADO","ADELONDRADO","ADELONDRADO","ADELONDRADO","ADELONDRADO","ADELONDRADO","ADELONDRADO","ADELONDRADO","ADELONDRADO","ADELONDRADO","ADELONDRADO","ADELONDRADO","ADELONDRADO","ADELONDRADO","ADELONDRADO","ADELONDRADO","ADELONDRADO","ADELONDRADO","ADELONDRADO","ADELONDRADO","ADELONDRADO","ADELONDRADO","ADELONDRADO","ADELONDRADO","ADELONDRADO","ADELONDRADO","ADELONDRADO","ADELONDRADO","ADELONDRADO","ADELONDRADO","ADELONDRADO","ADELONDRADO","ADELONDRADO","ADELONDRADO","ADELONDRADO","ADELONDRADO","ADELONDRADO","ADELONDRADO","ADELONDRADO","ADELONDRADO","ADELONDRADO","ADELONDRADO","ADELONDRADO","ADELONDRADO","ADELONDRADO","ADELONDRADO","ADELONDRADO","ADELONDRADO","ADELONDRADO","ADELONDRADO","ADELONDRADO","ADELONDRADO","ADELONDRADO","ADELONDRADO","ADELONDRADO","ADELONDRADO","ADELONDRADO","ADELONDRADO","ADELONDRADO","ADELONDRADO","ADELONDRADO","ADELONDRADO","ADELONDRADO","ADELONDRADO","ADELONDRADO","ADELONDRADO","ADELONDRADO","ADELONDRADO","ADELONDRADO","ADELONDRADO","ADELONDRADO","ADELONDRADO","ADELONDRADO","ADELONDRADO","ADELONDRADO","ADELONDRADO","ADELONDRADO","ADELONDRADO","ADELONDRADO","ADELONDRADO","ADELONDRADO","ADELONDRADO","ADELONDRADO","ADELONDRADO","ADELONDRADO","ADELONDRADO","ADELONDRADO","ADELONDRADO","ADELONDRADO","ADELONDRADO","ADELONDRADO","ADELONDRADO","ADELONDRADO","ADELONDRADO","ADELONDRADO","ADELONDRADO","ADELONDRADO","ADELONDRADO","ADELONDRADO","ADELONDRADO","ADELONDRADO","ADELONDRADO","ADELONDRADO","ADELONDRADO","ADELONDRADO","ADELONDRADO","ADELONDRADO","ADELONDRADO","ADELONDRADO","ADELONDRADO","ADELONDRADO","ADELONDRADO","ADELONDRADO","ADELONDRADO","ADELONDRADO","ADELONDRADO","ADELONDRADO","ADELONDRADO","ADELONDRADO","ADELONDRADO","ADELONDRADO","ADELONDRADO","ADELONDRADO","ADELONDRADO","ADELONDRADO","ADELONDRADO","ADELONDRADO","ADELONDRADO","ADELONDRADO","ADELONDRADO","ADELONDRADO","ADELONDRADO","ADELONDRADO","ADELONDRADO","ADELONDRADO","ADELONDRADO","ADELONDRADO","ADELONDRADO","ADELONDRADO","ADELONDRADO","ADELONDRADO","ADELONDRADO","ADELONDRADO","ADELONDRADO","ADELONDRADO","ADELONDRADO","ADELONDRADO","ADELONDRADO","ADELONDRADO","ADELONDRADO","ADELONDRADO","ADELONDRADO","ADELONDRADO","ADELONDRADO","ADELONDRADO","ADELONDRADO","ADELONDRADO","ADELONDRADO","ADELONDRADO","ADELONDRADO","ADELONDRADO","ADELONDRADO","ADELONDRADO","ADELONDRADO","ADELONDRADO","ADELONDRADO","ADELONDRADO","ADELONDRADO","ADELONDRADO","ADELONDRADO","ADELONDRADO","ADELONDRADO","ADELONDRADO","ADELONDRADO","ADELONDRADO","ADELONDRADO","ADELONDRADO","ADELONDRADO","ADELONDRADO","ADELONDRADO","ADELONDRADO","ADELONDRADO","ADELONDRADO","ADELONDRADO","ADELONDRADO","ADELONDRADO","ADELONDRADO","ADELONDRADO","ADELONDRADO","ADELONDRADO","ADELONDRADO","ADELONDRADO","ADELONDRADO","ADELONDRADO","ADELONDRADO","ADELONDRADO","ADELONDRADO","ADELONDRADO","ADELONDRADO","ADELONDRADO","ADELONDRADO","ADELONDRADO","ADELONDRADO","ADELONDRADO","ADELONDRADO","ADELONDRADO","ADELONDRADO","ADELONDRADO","ADELONDRADO","ADELONDRADO","ADELONDRADO","ADELONDRADO","ADELONDRADO","ADELONDRADO","ADELONDRADO","ADELONDRADO","ADELONDRADO","ADELONDRADO","ADELONDRADO","ADELONDRADO","ADELONDRADO","ADELONDRADO","ADELONDRADO","ADELONDRADO","ADELONDRADO","ADELONDRADO","ADELONDRADO","ADELONDRADO","ADELONDRADO","ADELONDRADO","ADELONDRADO","ADELONDRADO","ADELONDRADO","ADELONDRADO","ADELONDRADO","ADELONDRADO","ADELONDRADO","ADELONDRADO","ADELONDRADO","ADELONDRADO","ADELONDRADO","ADELONDRADO","ADELONDRADO","ADELONDRADO","ADELONDRADO","ADELONDRADO","ADELONDRADO","ADELONDRADO","ADELONDRADO","ADELONDRADO","ADELONDRADO","ADELONDRADO","ADELONDRADO","ADELONDRADO","ADELONDRADO","ADELONDRADO","ADELONDRADO","ADELONDRADO","ADELONDRADO","ADELONDRADO","ADELONDRADO","ADELONDRADO","ADELONDRADO","ADELONDRADO","ADELONDRADO","ADELONDRADO","ADELONDRADO","ADELONDRADO","ADELONDRADO","ADELONDRADO","ADELONDRADO","ADELONDRADO","ADELONDRADO","ADELONDRADO","ADELONDRADO","ADELONDRADO","ADELONDRADO","ADELONDRADO","ADELONDRADO","ADELONDRADO","ADELONDRADO","ADELONDRADO","ADELONDRADO","ADELONDRADO","ADELONDRADO","ADELONDRADO","ADELONDRADO","ADELONDRADO","ADELONDRADO","ADELONDRADO","ADELONDRADO","ADELONDRADO","ADELONDRADO","ADELONDRADO","ADELONDRADO","ADELONDRADO","ADELONDRADO","ADELONDRADO","ADELONDRADO","ADELONDRADO","ADELONDRADO","ADELONDRADO","ADELONDRADO","ADELONDRADO","ADELONDRADO","ADELONDRADO","ADELONDRADO","ADELONDRADO","ADELONDRADO","ADELONDRADO","ADELONDRADO","ADELONDRADO","ADELONDRADO","ADELONDRADO","ADELONDRADO","ADELONDRADO","ADELONDRADO","ADELONDRADO","ADELONDRADO","ADELONDRADO","ADELONDRADO","ADELONDRADO","ADELONDRADO","ADELONDRADO","ADELONDRADO","ADELONDRADO","ADELONDRADO","ADELONDRADO","ADELONDRADO","ADELONDRADO","ADELONDRADO","ADELONDRADO","ADELONDRADO","ADELONDRADO","ADELONDRADO","ADELONDRADO","ADELONDRADO","ADELONDRADO","ADELONDRADO","ADELONDRADO","ADELONDRADO","ADELONDRADO","ADELONDRADO","ADELONDRADO","ADELONDRADO","ADELONDRADO","ADELONDRADO","ADELONDRADO","ADELONDRADO","ADELONDRADO","ADELONDRADO","ADELONDRADO","ADELONDRADO","ADELONDRADO","ADELONDRADO","ADELONDRADO","ADELONDRADO","ADELONDRADO","ADELONDRADO","ADELONDRADO","ADELONDRADO","ADELONDRADO","ADELONDRADO","ADELONDRADO","ADELONDRADO","ADELONDRADO","ADELONDRADO","ADELONDRADO","ADELONDRADO","ADELONDRADO","ADELONDRADO","ADELONDRADO","ADELONDRADO","ADELONDRADO","ADELONDRADO","ADELONDRADO","ADELONDRADO","ADELONDRADO","ADELONDRADO","ADELONDRADO","ADELONDRADO","ADELONDRADO","ADELONDRADO","ADELONDRADO","ADELONDRADO","ADELONDRADO","ADELONDRADO","ADELONDRADO","ADELONDRADO","ADELONDRADO","ADELONDRADO","ADELONDRADO","ADELONDRADO","ADELONDRADO","ADELONDRADO","ADELONDRADO","ADELONDRADO","ADELONDRADO","ADELONDRADO","ADELONDRADO","ADELONDRADO","ADELONDRADO","ADELONDRADO","ADELONDRADO","ADELONDRADO","ADELONDRADO","ADELONDRADO","ADELONDRADO","ADELONDRADO","ADELONDRADO","ADELONDRADO","ADELONDRADO","ADELONDRADO","ADELONDRADO","ADELONDRADO","ADELONDRADO","ADELONDRADO","ADELONDRADO","ADELONDRADO","ADELONDRADO","ADELONDRADO","ADELONDRADO","ADELONDRADO","ADELONDRADO","ADELONDRADO","ADELONDRADO","ADELONDRADO","ADELONDRADO","ADELONDRADO","ADELONDRADO","ADELONDRADO","ADELONDRADO","ADELONDRADO","ADELONDRADO","ADELONDRADO","ADELONDRADO","ADELONDRADO","ADELONDRADO","ADELONDRADO","ADELONDRADO","ADELONDRADO","ADELONDRADO","ADELONDRADO","ADELONDRADO","ADELONDRADO","ADELONDRADO","ADELONDRADO","ADELONDRADO","ADELONDRADO","ADELONDRADO","ADELONDRADO","ADELONDRADO","ADELONDRADO","ADELONDRADO","ADELONDRADO","ADELONDRADO","ADELONDRADO","ADELONDRADO","ADELONDRADO","ADELONDRADO","ADELONDRADO","ADELONDRADO","ADELONDRADO","ADELONDRADO","ADELONDRADO","ADELONDRADO","ADELONDRADO","ADELONDRADO","ADELONDRADO","ADELONDRADO","ADELONDRADO","ADELONDRADO","ADELONDRADO","ADELONDRADO","ADELONDRADO","ADELONDRADO","ADELONDRADO","ADELONDRADO","ADELONDRADO","ADELONDRADO","ADELONDRADO","ADELONDRADO","ADELONDRADO","ADELONDRADO","ADELONDRADO","ADELONDRADO","ADELONDRADO","ADELONDRADO","ADELONDRADO","ADELONDRADO","ADELONDRADO","ADELONDRADO","ADELONDRADO","ADELONDRADO","ADELONDRADO","ADELONDRADO","ADELONDRADO","ADELONDRADO","ADELONDRADO","ADELONDRADO","ADELONDRADO","ADELONDRADO","ADELONDRADO","ADELONDRADO","ADELONDRADO","ADELONDRADO","ADELONDRADO","ADELONDRADO","ADELONDRADO","ADELONDRADO","ADELONDRADO","ADELONDRADO","ADELONDRADO","ADELONDRADO","ADELONDRADO","ADELONDRADO","ADELONDRADO","ADELONDRADO","ADELONDRADO","ADELONDRADO","ADELONDRADO","ADELONDRADO","ADELONDRADO","ADELONDRADO","ADELONDRADO","ADELONDRADO","ADELONDRADO","ADELONDRADO","ADELONDRADO","ADELONDRADO","ADELONDRADO","ADELONDRADO","ADELONDRADO","ADELONDRADO","ADELONDRADO","ADELONDRADO","ADELONDRADO","ADELONDRADO","ADELONDRADO","ADELONDRADO","ADELONDRADO","ADELONDRADO","ADELONDRADO","ADELONDRADO","ADELONDRADO","ADELONDRADO","ADELONDRADO","ADELONDRADO","ADELONDRADO","ADELONDRADO","ADELONDRADO","ADELONDRADO","ADELONDRADO","ADELONDRADO","ADELONDRADO","ADELONDRADO","ADELONDRADO","ADELONDRADO","ADELONDRADO","ADELONDRADO","ADELONDRADO","ADELONDRADO","ADELONDRADO","ADELONDRADO","ADELONDRADO","ADELONDRADO","ADELONDRADO","ADELONDRADO","ADELONDRADO","ADELONDRADO","ADELONDRADO","ADELONDRADO","ADELONDRADO","ADELONDRADO","ADELONDRADO","ADELONDRADO","ADELONDRADO","ADELONDRADO","ADELONDRADO","ADELONDRADO","ADELONDRADO","ADELONDRADO","ADELONDRADO","ADELONDRADO","ADELONDRADO","ADELONDRADO","ADELONDRADO","ADELONDRADO","ADELONDRADO","ADELONDRADO","ADELONDRADO","ADELONDRADO","ADELONDRADO","ADELONDRADO","ADELONDRADO","ADELONDRADO","ADELONDRADO","ADELONDRADO","ADELONDRADO","ADELONDRADO","ADELONDRADO","ADELONDRADO","ADELONDRADO","ADELONDRADO","ADELONDRADO","ADELONDRADO","ADELONDRADO","ADELONDRADO","ADELONDRADO","ADELONDRADO","ADELONDRADO","ADELONDRADO","ADELONDRADO","ADELONDRADO","ADELONDRADO","ADELONDRADO","ADELONDRADO","ADELONDRADO","ADELONDRADO","ADELONDRADO","ADELONDRADO","ADELONDRADO","ADELONDRADO","ADELONDRADO","ADELONDRADO","ADELONDRADO","ADELONDRADO","ADELONDRADO","ADELONDRADO","ADELONDRADO","ADELONDRADO","ADELONDRADO","ADELONDRADO","ADELONDRADO","ADELONDRADO","ADELONDRADO","ADELONDRADO","ADELONDRADO","ADELONDRADO","ADELONDRADO","ADELONDRADO","ADELONDRADO","ADELONDRADO","ADELONDRADO","ADELONDRADO","ADELONDRADO","ADELONDRADO","ADELONDRADO","ADELONDRADO","ADELONDRADO","ADELONDRADO","ADELONDRADO","ADELONDRADO","ADELONDRADO","ADELONDRADO","ADELONDRADO","ADELONDRADO","ADELONDRADO","ADELONDRADO","ADELONDRADO","ADELONDRADO","ADELONDRADO","ADELONDRADO","ADELONDRADO","ADELONDRADO","ADELONDRADO","ADELONDRADO","ADELONDRADO","ADELONDRADO","ADELONDRADO","ADELONDRADO","ADELONDRADO","ADELONDRADO","ADELONDRADO","ADELONDRADO","ADELONDRADO","ADELONDRADO","ADELONDRADO","ADELONDRADO","ADELONDRADO","ADELONDRADO","ADELONDRADO","ADELONDRADO","ADELONDRADO","ADELONDRADO","ADELONDRADO","ADELONDRADO","ADELONDRADO","ADELONDRADO","ADELONDRADO","ADELONDRADO","ADELONDRADO","ADELONDRADO","ADELONDRADO","ADELONDRADO","ADELONDRADO","ADELONDRADO","ADELONDRADO","ADELONDRADO","ADELONDRADO","ADELONDRADO","ADELONDRADO","ADELONDRADO","ADELONDRADO","ADELONDRADO","ADELONDRADO","ADELONDRADO","ADELONDRADO","ADELONDRADO","ADELONDRADO","ADELONDRADO","ADELONDRADO","ADELONDRADO","ADELONDRADO","ADELONDRADO","ADELONDRADO","ADELONDRADO","ADELONDRADO","ADELONDRADO","ADELONDRADO","ADELONDRADO","ADELONDRADO","ADELONDRADO","ADELONDRADO","ADELONDRADO","ADELONDRADO","ADELONDRADO","ADELONDRADO","ADELONDRADO","ADELONDRADO","ADELONDRADO","ADELONDRADO","ADELONDRADO","ADELONDRADO","ADELONDRADO","ADELONDRADO","ADELONDRADO","ADELONDRADO","ADELONDRADO","ADELONDRADO","ADELONDRADO","ADELONDRADO","ADELONDRADO","ADELONDRADO","ADELONDRADO","ADELONDRADO","ADELONDRADO","ADELONDRADO","ADELONDRADO","ADELONDRADO","ADELONDRADO","ADELONDRADO","ADELONDRADO","ADELONDRADO","ADELONDRADO","ADELONDRADO","ADELONDRADO","ADELONDRADO","ADELONDRADO","ADELONDRADO","ADELONDRADO","ADELONDRADO","ADELONDRADO","ADELONDRADO","ADELONDRADO","ADELONDRADO","ADELONDRADO","ADELONDRADO","ADELONDRADO","ADELONDRADO","ADELONDRADO","ADELONDRADO","ADELONDRADO","ADELONDRADO","ADELONDRADO","ADELONDRADO","ADELONDRADO","ADELONDRADO","ADELONDRADO","ADELONDRADO","ADELONDRADO","ADELONDRADO","ADELONDRADO","ADELONDRADO","ADELONDRADO","ADELONDRADO","ADELONDRADO","ADELONDRADO","ADELONDRADO","ADELONDRADO","ADELONDRADO","ADELONDRADO","ADELONDRADO","ADELONDRADO","ADELONDRADO","ADELONDRADO","ADELONDRADO","ADELONDRADO","ADELONDRADO","ADELONDRADO","ADELONDRADO","ADELONDRADO","ADELONDRADO","ADELONDRADO","ADELONDRADO","ADELONDRADO","ADELONDRADO","ADELONDRADO","ADELONDRADO","ADELONDRADO","ADELONDRADO","ADELONDRADO","ADELONDRADO","ADELONDRADO","ADELONDRADO","ADELONDRADO","ADELONDRADO","ADELONDRADO","ADELONDRADO","ADELONDRADO","ADELONDRADO","ADELONDRADO","ADELONDRADO","ADELONDRADO","ADELONDRADO","ADELONDRADO","ADELONDRADO","ADELONDRADO","ADELONDRADO","ADELONDRADO","ADELONDRADO","ADELONDRADO","ADELONDRADO","ADELONDRADO","ADELONDRADO","ADELONDRADO","ADELONDRADO","ADELONDRADO","ADELONDRADO","ADELONDRADO","ADELONDRADO","ADELONDRADO","ADELONDRADO","ADELONDRADO","ADELONDRADO","ADELONDRADO","ADELONDRADO","ADELONDRADO","ADELONDRADO","ADELONDRADO","ADELONDRADO","ADELONDRADO","ADELONDRADO","ADELONDRADO","ADELONDRADO","ADELONDRADO","ADELONDRADO","ADELONDRADO","ADELONDRADO","ADELONDRADO","ADELONDRADO","ADELONDRADO","ADELONDRADO","ADELONDRADO","ADELONDRADO","ADELONDRADO","ADELONDRADO","ADELONDRADO","ADELONDRADO","ADELONDRADO","ADELONDRADO","ADELONDRADO","ADELONDRADO","ADELONDRADO","ADELONDRADO","ADELONDRADO","ADELONDRADO","ADELONDRADO","ADELONDRADO","ADELONDRADO","ADELONDRADO","ADELONDRADO","ADELONDRADO","ADELONDRADO","ADELONDRADO","ADELONDRADO","ADELONDRADO","ADELONDRADO","ADELONDRADO","ADELONDRADO","ADELONDRADO","ADELONDRADO","ADELONDRADO","ADELONDRADO","ADELONDRADO","ADELONDRADO","ADELONDRADO","ADELONDRADO","ADELONDRADO","ADELONDRADO","ADELONDRADO","ADELONDRADO","ADELONDRADO","ADELONDRADO","ADELONDRADO","ADELONDRADO","ADELONDRADO","ADELONDRADO","ADELONDRADO","ADELONDRADO","ADELONDRADO","ADELONDRADO","ADELONDRADO","ADELONDRADO","ADELONDRADO","ADELONDRADO","ADELONDRADO","ADELONDRADO","ADELONDRADO","ADELONDRADO","ADELONDRADO","ADELONDRADO","ADELONDRADO","ADELONDRADO","ADELONDRADO","ADELONDRADO","ADELONDRADO","ADELONDRADO","ADELONDRADO","ADELONDRADO","ADELONDRADO","ADELONDRADO","ADELONDRADO","ADELONDRADO","ADELONDRADO","ADELONDRADO","ADELONDRADO","ADELONDRADO","ADELONDRADO","ADELONDRADO","ADELONDRADO","ADELONDRADO","ADELONDRADO","ADELONDRADO","ADELONDRADO","ADELONDRADO","ADELONDRADO","ADELONDRADO","ADELONDRADO","ADELONDRADO","ADELONDRADO","ADELONDRADO","ADELONDRADO","ADELONDRADO","ADELONDRADO","ADELONDRADO","ADELONDRADO","ADELONDRADO","ADELONDRADO","ADELONDRADO","ADELONDRADO","ADELONDRADO","ADELONDRADO","ADELONDRADO","ADELONDRADO","ADELONDRADO","ADELONDRADO","ADELONDRADO","ADELONDRADO","ADELONDRADO","ADELONDRADO","ADELONDRADO","ADELONDRADO","ADELONDRADO","ADELONDRADO","ADELONDRADO","ADELONDRADO","ADELONDRADO","ADELONDRADO","ADELONDRADO","ADELONDRADO","ADELONDRADO","ADELONDRADO","ADELONDRADO","ADELONDRADO","ADELONDRADO","ADELONDRADO","ADELONDRADO","ADELONDRADO","ADELONDRADO","ADELONDRADO","ADELONDRADO","ADELONDRADO","ADELONDRADO","ADELONDRADO","ADELONDRADO","ADELONDRADO","ADELONDRADO","ADELONDRADO","ADELONDRADO","ADELONDRADO","ADELONDRADO","ADELONDRADO","ADELONDRADO","ADELONDRADO","ADELONDRADO","ADELONDRADO","ADELONDRADO","ADELONDRADO","ADELONDRADO","ADELONDRADO","ADELONDRADO","ADELONDRADO","ADELONDRADO","ADELONDRADO","ADELONDRADO","ADELONDRADO","ADELONDRADO","ADELONDRADO","ADELONDRADO","ADELONDRADO","ADELONDRADO","ADELONDRADO","ADELONDRADO","ADELONDRADO","ADELONDRADO","ADELONDRADO","ADELONDRADO","ADELONDRADO","ADELONDRADO","ADELONDRADO","ADELONDRADO","ADELONDRADO","ADELONDRADO","ADELONDRADO","ADELONDRADO","ADELONDRADO","ADELONDRADO","ADELONDRADO","ADELONDRADO","ADELONDRADO","ADELONDRADO","ADELONDRADO","ADELONDRADO","ADELONDRADO","ADELONDRADO","ADELONDRADO","ADELONDRADO","ADELONDRADO","ADELONDRADO","ADELONDRADO","ADELONDRADO","ADELONDRADO","ADELONDRADO","ADELONDRADO","ADELONDRADO","ADELONDRADO","ADELONDRADO","ADELONDRADO","ADELONDRADO","ADELONDRADO","ADELONDRADO","ADELONDRADO","ADELONDRADO","ADELONDRADO","ADELONDRADO","ADELONDRADO","ADELONDRADO","ADELONDRADO","ADELONDRADO","ADELONDRADO","ADELONDRADO","ADELONDRADO","ADELONDRADO","ADELONDRADO","ADELONDRADO","ADELONDRADO","ADELONDRADO","ADELONDRADO","ADELONDRADO","ADELONDRADO","ADELONDRADO","ADELONDRADO","ADELONDRADO","ADELONDRADO","ADELONDRADO","ADELONDRADO","ADELONDRADO","ADELONDRADO","ADELONDRADO","ADELONDRADO","ADELONDRADO","ADELONDRADO","ADELONDRADO","ADELONDRADO","ADELONDRADO","ADELONDRADO","ADELONDRADO","ADELONDRADO","ADELONDRADO","ADELONDRADO","ADELONDRADO","ADELONDRADO","ADELONDRADO","ADELONDRADO","ADELONDRADO","ADELONDRADO","ADELONDRADO","ADELONDRADO","ADELONDRADO","ADELONDRADO","ADELONDRADO","ADELONDRADO","ADELONDRADO","ADELONDRADO","ADELONDRADO","ADELONDRADO","ADELONDRADO","ADELONDRADO","ADELONDRADO","ADELONDRADO","ADELONDRADO","ADELONDRADO","ADELONDRADO","ADELONDRADO","ADELONDRADO","ADELONDRADO","ADELONDRADO","ADELONDRADO","ADELONDRADO","ADELONDRADO","ADELONDRADO","ADELONDRADO","ADELONDRADO","ADELONDRADO","ADELONDRADO","ADELONDRADO","ADELONDRADO","ADELONDRADO","ADELONDRADO","ADELONDRADO","ADELONDRADO","ADELONDRADO","ADELONDRADO","ADELONDRADO","ADELONDRADO","ADELONDRADO","ADELONDRADO","ADELONDRADO","ADELONDRADO","ADELONDRADO","ADELONDRADO","ADELONDRADO","ADELONDRADO","ADELONDRADO","ADELONDRADO","ADELONDRADO","ADELONDRADO","ADELONDRADO","ADELONDRADO","ADELONDRADO","ADELONDRADO","ADELONDRADO","ADELONDRADO","ADELONDRADO","ADELONDRADO","ADELONDRADO","ADELONDRADO","ADELONDRADO","ADELONDRADO","ADELONDRADO","ADELONDRADO","ADELONDRADO","ADELONDRADO","ADELONDRADO","ADELONDRADO","ADELONDRADO","ADELONDRADO","ADELONDRADO","ADELONDRADO","ADELONDRADO","ADELONDRADO","ADELONDRADO","ADELONDRADO","ADELONDRADO","ADELONDRADO","ADELONDRADO","ADELONDRADO","ADELONDRADO","ADELONDRADO","ADELONDRADO","ADELONDRADO","ADELONDRADO","ADELONDRADO","ADELONDRADO","ADELONDRADO","ADELONDRADO","ADELONDRADO","ADELONDRADO","ADELONDRADO","ADELONDRADO","ADELONDRADO","ADELONDRADO","ADELONDRADO","ADELONDRADO","ADELONDRADO","ADELONDRADO","ADELONDRADO","ADELONDRADO","ADELONDRADO","ADELONDRADO","ADELONDRADO","ADELONDRADO","ADELONDRADO","ADELONDRADO","ADELONDRADO","ADELONDRADO","ADELONDRADO","ADELONDRADO","ADELONDRADO","ADELONDRADO","ADELONDRADO","ADELONDRADO","ADELONDRADO","ADELONDRADO","ADELONDRADO","ADELONDRADO","ADELONDRADO","ADELONDRADO","ADELONDRADO","ADELONDRADO","ADELONDRADO","ADELONDRADO","ADELONDRADO","ADELONDRADO","ADELONDRADO","ADELONDRADO","ADELONDRADO","ADELONDRADO","ADELONDRADO","ADELONDRADO","ADELONDRADO","ADELONDRADO","ADELONDRADO","ADELONDRADO","ADELONDRADO","ADELONDRADO","ADELONDRADO","ADELONDRADO","ADELONDRADO","ADELONDRADO","ADELONDRADO","ADELONDRADO","ADELONDRADO","ADELONDRADO","ADELONDRADO","ADELONDRADO","ADELONDRADO","ADELONDRADO","ADELONDRADO","ADELONDRADO","ADELONDRADO","ADELONDRADO","ADELONDRADO","ADELONDRADO","ADELONDRADO","ADELONDRADO","ADELONDRADO","ADELONDRADO","ADELONDRADO","ADELONDRADO","ADELONDRADO","ADELONDRADO","ADELONDRADO","ADELONDRADO","ADELONDRADO","ADELONDRADO","ADELONDRADO","ADELONDRADO","ADELONDRADO","ADELONDRADO","ADELONDRADO","ADELONDRADO","ADELONDRADO","ADELONDRADO","ADELONDRADO","ADELONDRADO","ADELONDRADO","ADELONDRADO","ADELONDRADO","ADELONDRADO","ADELONDRADO","ADELONDRADO","ADELONDRADO","ADELONDRADO","ADELONDRADO","ADELONDRADO","ADELONDRADO","ADELONDRADO","ADELONDRADO","ADELONDRADO","ADELONDRADO","ADELONDRADO","ADELONDRADO","ADELONDRADO","ADELONDRADO","ADELONDRADO","ADELONDRADO","ADELONDRADO","ADELONDRADO","ADELONDRADO","ADELONDRADO","ADELONDRADO","ADELONDRADO","ADELONDRADO","ADELONDRADO","ADELONDRADO","ADELONDRADO","ADELONDRADO","ADELONDRADO","ADELONDRADO","ADELONDRADO","ADELONDRADO","ADELONDRADO","ADELONDRADO","ADELONDRADO","ADELONDRADO","ADELONDRADO","ADELONDRADO","ADELONDRADO","ADELONDRADO","ADELONDRADO","ADELONDRADO","ADELONDRADO","ADELONDRADO","ADELONDRADO","ADELONDRADO","ADELONDRADO","ADELONDRADO","ADELONDRADO","ADELONDRADO","ADELONDRADO","ADELONDRADO","ADELONDRADO","ADELONDRADO","ADELONDRADO","ADELONDRADO","ADELONDRADO","ADELONDRADO","ADELONDRADO","ADELONDRADO","ADELONDRADO","ADELONDRADO","ADELONDRADO","ADELONDRADO","ADELONDRADO","ADELONDRADO","ADELONDRADO","ADELONDRADO","ADELONDRADO","ADELONDRADO","ADELONDRADO","ADELONDRADO","ADELONDRADO","ADELONDRADO","ADELONDRADO","ADELONDRADO","ADELONDRADO","ADELONDRADO","ADELONDRADO","ADELONDRADO","ADELONDRADO","ADELONDRADO","ADELONDRADO","ADELONDRADO","ADELONDRADO","ADELONDRADO","ADELONDRADO","ADELONDRADO","ADELONDRADO","ADELONDRADO","ADELONDRADO","ADELONDRADO","ADELONDRADO","ADELONDRADO","ADELONDRADO","ADELONDRADO","ADELONDRADO","ADELONDRADO","ADELONDRADO","ADELONDRADO","ADELONDRADO","ADELONDRADO","ADELONDRADO","ADELONDRADO","ADELONDRADO","ADELONDRADO","ADELONDRADO","ADELONDRADO","ADELONDRADO","ADELONDRADO","ADELONDRADO","ADELONDRADO","ADELONDRADO","ADELONDRADO","ADELONDRADO","ADELONDRADO","ADELONDRADO","ADELONDRADO","ADELONDRADO","ADELONDRADO","ADELONDRADO","ADELONDRADO","ADELONDRADO","ADELONDRADO","ADELONDRADO","ADELONDRADO","ADELONDRADO","ADELONDRADO","ADELONDRADO","ADELONDRADO","ADELONDRADO","ADELONDRADO","ADELONDRADO","ADELONDRADO","ADELONDRADO","ADELONDRADO","ADELONDRADO","ADELONDRADO","ADELONDRADO","ADELONDRADO","ADELONDRADO","ADELONDRADO","ADELONDRADO","ADELONDRADO","ADELONDRADO","ADELONDRADO","ADELONDRADO","ADELONDRADO","ADELONDRADO","ADELONDRADO","ADELONDRADO","ADELONDRADO","ADELONDRADO","ADELONDRADO","ADELONDRADO","ADELONDRADO","ADELONDRADO","ADELONDRADO","ADELONDRADO","ADELONDRADO","ADELONDRADO","ADELONDRADO","ADELONDRADO","ADELONDRADO","ADELONDRADO","ADELONDRADO","ADELONDRADO","ADELONDRADO","ADELONDRADO","ADELONDRADO","ADELONDRADO","ADELONDRADO","ADELONDRADO","ADELONDRADO","ADELONDRADO","ADELONDRADO","ADELONDRADO","ADELONDRADO","ADELONDRADO","ADELONDRADO","ADELONDRADO","ADELONDRADO","ADELONDRADO","ADELONDRADO","ADELONDRADO","ADELONDRADO","ADELONDRADO","ADELONDRADO","ADELONDRADO","ADELONDRADO","ADELONDRADO","ADELONDRADO","ADELONDRADO","ADELONDRADO","ADELONDRADO","ADELONDRADO","ADELONDRADO","ADELONDRADO","ADELONDRADO","ADELONDRADO","ADELONDRADO","ADELONDRADO","ADELONDRADO","ADELONDRADO","ADELONDRADO"]
[null,null,null,null,null,null,null,null,null,null,null,null,null,null,null,null,null,null,null,null,null,null,null,null,null,null,null,null,null,null,null,null,null,null,null,null,null,null,null,null,null,null,null,null,null,null,null,null,null,null,null,null,null,null,null,null,null,null,null,null,null,null,null,null,0]
[null,null,null,null,null,null,null,null,null,null,null,null,null,null,null,null,null,null,null,null,null,null,null,null,null,null,null,null,null,null,null,null,null,null,null,null,null,null,null,null,null,null,null,null,null,null,null,null,null,null,null,null,null,null,null,null,null,null,null,null,null,null,null,null,0]
[null,null,null,null,null,null,null,null,null,null,null,null,null,null,null,null,null,null,null,null,null,null,null,null,null,null,null,null,null,null,null,null,null,null,null,null,null,null,null,null,null,null,null,null,null,null,null,null,null,null,null,null,null,null,null,null,null,null,null,null,null,null,null,null,0]
[null,null,null,null,null,null,null,null,null,null,null,null,null,null,null,null,null,null,null,null,null,null,null,null,null,null,null,null,null,null,null,null,null,null,null,null,null,null,null,null,null,null,null,null,null,null,null,null,null,null,null,null,null,null,null,null,null,null,null,null,null,null,null,null,0]
[null,null,null,null,null,null,null,null,null,null,null,null,null,null,null,null,null,null,null,null,null,null,null,null,null,null,null,null,null,null,null,null,null,null,null,null,null,null,null,null,null,null,null,null,null,null,null,null,null,null,null,null,null,null,null,null,null,null,null,null,null,null,null,null,0]
[null,null,null,null,null,null,null,null,null,null,null,null,null,null,null,null,null,null,null,null,null,null,null,null,null,null,null,null,null,null,null,null,null,null,null,null,null,null,null,null,null,null,null,null,null,null,null,null,null,null,null,null,null,null,null,null,null,null,null,null,null,null,null,null,0]
[null,null,null,null,null,null,null,null,null,null,null,null,null,null,null,null,null,null,null,null,null,null,null,null,null,null,null,null,null,null,null,null,null,null,null,null,null,null,null,null,null,null,null,null,null,null,null,null,null,null,null,null,null,null,null,null,null,null,null,null,null,null,null,null,0]
[null,null,null,null,null,null,null,null,null,null,null,null,null,null,null,null,null,null,null,null,null,null,null,null,null,null,null,null,null,null,null,null,null,null,null,null,null,null,null,null,null,null,null,null,null,null,null,null,null,null,null,null,null,null,null,null,null,null,null,null,null,null,null,null,0]
[null,null,null,null,null,null,null,null,null,null,null,null,null,null,null,null,null,null,null,null,null,null,null,null,null,null,null,null,null,null,null,null,null,null,null,null,null,null,null,null,null,null,null,null,null,null,null,null,null,null,null,null,null,null,null,null,null,null,null,null,null,null,null,null,0]
[null,null,null,null,null,null,null,null,null,null,null,null,null,null,null,null,null,null,null,null,null,null,null,null,null,null,null,null,null,null,null,null,null,null,null,null,null,null,null,null,null,null,null,null,null,null,null,null,null,null,null,null,null,null,null,null,null,null,null,null,null,null,null,null,0]
[null,null,null,null,null,null,null,null,null,null,null,null,null,null,null,null,null,null,null,null,null,null,null,null,null,null,null,null,null,null,null,null,null,null,null,null,null,null,null,null,null,null,null,null,null,null,null,null,null,null,null,null,null,null,null,null,null,null,null,null,null,null,null,null,0]
[null,null,null,null,null,null,null,null,null,null,null,null,null,null,null,null,null,null,null,null,null,null,null,null,null,null,null,null,null,null,null,null,null,null,null,null,null,null,null,null,null,null,null,null,null,null,null,null,null,null,null,null,null,null,null,null,null,null,null,null,null,null,null,null,0]
[null,null,null,null,null,null,null,null,null,null,null,null,null,null,null,null,null,null,null,null,null,null,null,null,null,null,null,null,null,null,null,null,null,null,null,null,null,null,null,null,null,null,null,null,null,null,null,null,null,null,null,null,null,null,null,null,null,null,null,null,null,null,null,null,0]
[null,null,null,null,null,null,null,null,null,null,null,null,null,null,null,null,null,null,null,null,null,null,null,null,null,null,null,null,null,null,null,null,null,null,null,null,null,null,null,null,null,null,null,null,null,null,null,null,null,null,null,null,null,null,null,null,null,null,null,null,null,null,null,null,0]
[null,null,null,null,null,null,null,null,null,null,null,null,null,null,null,null,null,null,null,null,null,null,null,null,null,null,null,null,null,null,null,null,null,null,null,null,null,null,null,null,null,null,null,null,null,null,null,null,null,null,null,null,null,null,null,null,null,null,null,null,null,null,null,null,0]
[null,null,null,null,null,null,null,null,null,null,null,null,null,null,null,null,null,null,null,null,null,null,null,null,null,null,null,null,null,null,null,null,null,null,null,null,null,null,null,null,null,null,null,null,null,null,null,null,null,null,null,null,null,null,null,null,null,null,null,null,null,null,null,null,0]
[null,null,null,null,null,null,null,null,null,null,null,null,null,null,null,null,null,null,null,null,null,null,null,null,null,null,null,null,null,null,null,null,null,null,null,null,null,null,null,null,null,null,null,null,null,null,null,null,null,null,null,null,null,null,null,null,null,null,null,null,null,null,null,null,0]
[null,null,null,null,null,null,null,null,null,null,null,null,null,null,null,null,null,null,null,null,null,null,null,null,null,null,null,null,null,null,null,null,null,null,null,null,null,null,null,null,null,null,null,null,null,null,null,null,null,null,null,null,null,null,null,null,null,null,null,null,null,null,null,null,0]
[null,null,null,null,null,null,null,null,null,null,null,null,null,null,null,null,null,null,null,null,null,null,null,null,null,null,null,null,null,null,null,null,null,null,null,null,null,null,null,null,null,null,null,null,null,null,null,null,null,null,null,null,null,null,null,null,null,null,null,null,null,null,null,null,0]
[null,null,null,null,null,null,null,null,null,null,null,null,null,null,null,null,null,null,null,null,null,null,null,null,null,null,null,null,null,null,null,null,null,null,null,null,null,null,null,null,null,null,null,null,null,null,null,null,null,null,null,null,null,null,null,null,null,null,null,null,null,null,null,null,0]
[null,null,null,null,null,null,null,null,null,null,null,null,null,null,null,null,null,null,null,null,null,null,null,null,null,null,null,null,null,null,null,null,null,null,null,null,null,null,null,null,null,null,null,null,null,null,null,null,null,null,null,null,null,null,null,null,null,null,null,null,null,null,null,null,0]
[null,null,null,null,null,null,null,null,null,null,null,null,null,null,null,null,null,null,null,null,null,null,null,null,null,null,null,null,null,null,null,null,null,null,null,null,null,null,null,null,null,null,null,null,null,null,null,null,null,null,null,null,null,null,null,null,null,null,null,null,null,null,null,null,0]
[null,null,null,null,null,null,null,null,null,null,null,null,null,null,null,null,null,null,null,null,null,null,null,null,null,null,null,null,null,null,null,null,null,null,null,null,null,null,null,null,null,null,null,null,null,null,null,null,null,null,null,null,null,null,null,null,null,null,null,null,null,null,null,null,0]
[null,null,null,null,null,null,null,null,null,null,null,null,null,null,null,null,null,null,null,null,null,null,null,null,null,null,null,null,null,null,null,null,null,null,null,null,null,null,null,null,null,null,null,null,null,null,null,null,null,null,null,null,null,null,null,null,null,null,null,null,null,null,null,null,0]
[null,null,null,null,null,null,null,null,null,null,null,null,null,null,null,null,null,null,null,null,null,null,null,null,null,null,null,null,null,null,null,null,null,null,null,null,null,null,null,null,null,null,null,null,null,null,null,null,null,null,null,null,null,null,null,null,null,null,null,null,null,null,null,null,0]
[null,null,null,null,null,null,null,null,null,null,null,null,null,null,null,null,null,null,null,null,null,null,null,null,null,null,null,null,null,null,null,null,null,null,null,null,null,null,null,null,null,null,null,null,null,null,null,null,null,null,null,null,null,null,null,null,null,null,null,null,null,null,null,null,0]
[null,null,null,null,null,null,null,null,null,null,null,null,null,null,null,null,null,null,null,null,null,null,null,null,null,null,null,null,null,null,null,null,null,null,null,null,null,null,null,null,null,null,null,null,null,null,null,null,null,null,null,null,null,null,null,null,null,null,null,null,null,null,null,null,0]
[null,null,null,null,null,null,null,null,null,null,null,null,null,null,null,null,null,null,null,null,null,null,null,null,null,null,null,null,null,null,null,null,null,null,null,null,null,null,null,null,null,null,null,null,null,null,null,null,null,null,null,null,null,null,null,null,null,null,null,null,null,null,null,null,0]
[null,null,null,null,null,null,null,null,null,null,null,null,null,null,null,null,null,null,null,null,null,null,null,null,null,null,null,null,null,null,null,null,null,null,null,null,null,null,null,null,null,null,null,null,null,null,null,null,null,null,null,null,null,null,null,null,null,null,null,null,null,null,null,null,0]
[null,null,null,null,null,null,null,null,null,null,null,null,null,null,null,null,null,null,null,null,null,null,null,null,null,null,null,null,null,null,null,null,null,null,null,null,null,null,null,null,null,null,null,null,null,null,null,null,null,null,null,null,null,null,null,null,null,null,null,null,null,null,null,null,0]
[null,null,null,null,null,null,null,null,null,null,null,null,null,null,null,null,null,null,null,null,null,null,null,null,null,null,null,null,null,null,null,null,null,null,null,null,null,null,null,null,null,null,null,null,null,null,null,null,null,null,null,null,null,null,null,null,null,null,null,null,null,null,null,null,0]
[null,null,null,null,null,null,null,null,null,null,null,null,null,null,null,null,null,null,null,null,null,null,null,null,null,null,null,null,null,null,null,null,null,null,null,null,null,null,null,null,null,null,null,null,null,null,null,null,null,null,null,null,null,null,null,null,null,null,null,null,null,null,null,null,0]
[null,null,null,null,null,null,null,null,null,null,null,null,null,null,null,null,null,null,null,null,null,null,null,null,null,null,null,null,null,null,null,null,null,null,null,null,null,null,null,null,null,null,null,null,null,null,null,null,null,null,null,null,null,null,null,null,null,null,null,null,null,null,null,null,0]
[null,null,null,null,null,null,null,null,null,null,null,null,null,null,null,null,null,null,null,null,null,null,null,null,null,null,null,null,null,null,null,null,null,null,null,null,null,null,null,null,null,null,null,null,null,null,null,null,null,null,null,null,null,null,null,null,null,null,null,null,null,null,null,null,0]
[null,null,null,null,null,null,null,null,null,null,null,null,null,null,null,null,null,null,null,null,null,null,null,null,null,null,null,null,null,null,null,null,null,null,null,null,null,null,null,null,null,null,null,null,null,null,null,null,null,null,null,null,null,null,null,null,null,null,null,null,null,null,null,null,0]
[null,null,null,null,null,null,null,null,null,null,null,null,null,null,null,null,null,null,null,null,null,null,null,null,null,null,null,null,null,null,null,null,null,null,null,null,null,null,null,null,null,null,null,null,null,null,null,null,null,null,null,null,null,null,null,null,null,null,null,null,null,null,null,null,0]
[null,null,null,null,null,null,null,null,null,null,null,null,null,null,null,null,null,null,null,null,null,null,null,null,null,null,null,null,null,null,null,null,null,null,null,null,null,null,null,null,null,null,null,null,null,null,null,null,null,null,null,null,null,null,null,null,null,null,null,null,null,null,null,null,0]
[null,null,null,null,null,null,null,null,null,null,null,null,null,null,null,null,null,null,null,null,null,null,null,null,null,null,null,null,null,null,null,null,null,null,null,null,null,null,null,null,null,null,null,null,null,null,null,null,null,null,null,null,null,null,null,null,null,null,null,null,null,null,null,null,0]
[null,null,null,null,null,null,null,null,null,null,null,null,null,null,null,null,null,null,null,null,null,null,null,null,null,null,null,null,null,null,null,null,null,null,null,null,null,null,null,null,null,null,null,null,null,null,null,null,null,null,null,null,null,null,null,null,null,null,null,null,null,null,null,null,0]
[null,null,null,null,null,null,null,null,null,null,null,null,null,null,null,null,null,null,null,null,null,null,null,null,null,null,null,null,null,null,null,null,null,null,null,null,null,null,null,null,null,null,null,null,null,null,null,null,null,null,null,null,null,null,null,null,null,null,null,null,null,null,null,null,0]
[null,null,null,null,null,null,null,null,null,null,null,null,null,null,null,null,null,null,null,null,null,null,null,null,null,null,null,null,null,null,null,null,null,null,null,null,null,null,null,null,null,null,null,null,null,null,null,null,null,null,null,null,null,null,null,null,null,null,null,null,null,null,null,null,0]
[null,null,null,null,null,null,null,null,null,null,null,null,null,null,null,null,null,null,null,null,null,null,null,null,null,null,null,null,null,null,null,null,null,null,null,null,null,null,null,null,null,null,null,null,null,null,null,null,null,null,null,null,null,null,null,null,null,null,null,null,null,null,null,null,0]
[null,null,null,null,null,null,null,null,null,null,null,null,null,null,null,null,null,null,null,null,null,null,null,null,null,null,null,null,null,null,null,null,null,null,null,null,null,null,null,null,null,null,null,null,null,null,null,null,null,null,null,null,null,null,null,null,null,null,null,null,null,null,null,null,0]
[null,null,null,null,null,null,null,null,null,null,null,null,null,null,null,null,null,null,null,null,null,null,null,null,null,null,null,null,null,null,null,null,null,null,null,null,null,null,null,null,null,null,null,null,null,null,null,null,null,null,null,null,null,null,null,null,null,null,null,null,null,null,null,null,0]
[null,null,null,null,null,null,null,null,null,null,null,null,null,null,null,null,null,null,null,null,null,null,null,null,null,null,null,null,null,null,null,null,null,null,null,null,null,null,null,null,null,null,null,null,null,null,null,null,null,null,null,null,null,null,null,null,null,null,null,null,null,null,null,null,0]
[null,null,null,null,null,null,null,null,null,null,null,null,null,null,null,null,null,null,null,null,null,null,null,null,null,null,null,null,null,null,null,null,null,null,null,null,null,null,null,null,null,null,null,null,null,null,null,null,null,null,null,null,null,null,null,null,null,null,null,null,null,null,null,null,0]
[null,null,null,null,null,null,null,null,null,null,null,null,null,null,null,null,null,null,null,null,null,null,null,null,null,null,null,null,null,null,null,null,null,null,null,null,null,null,null,null,null,null,null,null,null,null,null,null,null,null,null,null,null,null,null,null,null,null,null,null,null,null,null,null,0]
[null,null,null,null,null,null,null,null,null,null,null,null,null,null,null,null,null,null,null,null,null,null,null,null,null,null,null,null,null,null,null,null,null,null,null,null,null,null,null,null,null,null,null,null,null,null,null,null,null,null,null,null,null,null,null,null,null,null,null,null,null,null,null,null,0]
[null,null,null,null,null,null,null,null,null,null,null,null,null,null,null,null,null,null,null,null,null,null,null,null,null,null,null,null,null,null,null,null,null,null,null,null,null,null,null,null,null,null,null,null,null,null,null,null,null,null,null,null,null,null,null,null,null,null,null,null,null,null,null,null,0]
[null,null,null,null,null,null,null,null,null,null,null,null,null,null,null,null,null,null,null,null,null,null,null,null,null,null,null,null,null,null,null,null,null,null,null,null,null,null,null,null,null,null,null,null,null,null,null,null,null,null,null,null,null,null,null,null,null,null,null,null,null,null,null,null,{"$f":"COUNTA(C72:BL72)/2","v":0}]
[null,null,null,null,null,null,null,null,null,null,null,null,null,null,null,null,null,null,null,null,null,null,null,null,null,null,null,null,null,null,null,null,null,null,null,null,null,null,null,null,null,null,null,null,null,null,null,null,null,null,null,null,null,null,null,null,null,null,null,null,null,null,null,null,0]
[null,null,null,null,null,null,null,null,null,null,null,null,null,null,null,null,null,null,null,null,null,null,null,null,null,null,null,null,null,null,null,null,null,null,null,null,null,null,null,null,null,null,null,null,null,null,null,null,null,null,null,null,null,null,null,null,null,null,null,null,null,null,null,null,0]
[null,null,null,null,null,null,null,null,null,null,null,null,null,null,null,null,null,null,null,null,null,null,null,null,null,null,null,null,null,null,null,null,null,null,null,null,null,null,null,null,null,null,null,null,null,null,null,null,null,null,null,null,null,null,null,null,null,null,null,null,null,null,null,null,0]
[null,null,null,null,null,null,null,null,null,null,null,null,null,null,null,null,null,null,null,null,null,null,null,null,null,null,null,null,null,null,null,null,null,null,null,null,null,null,null,null,null,null,null,null,null,null,null,null,null,null,null,null,null,null,null,null,null,null,null,null,null,null,null,null,0]
[null,null,null,null,null,null,null,null,null,null,null,null,null,null,null,null,null,null,null,null,null,null,null,null,null,null,null,null,null,null,null,null,null,null,null,null,null,null,null,null,null,null,null,null,null,null,null,null,null,null,null,null,null,null,null,null,null,null,null,null,null,null,null,null,0]
[null,null,null,null,null,null,null,null,null,null,null,null,null,null,null,null,null,null,null,null,null,null,null,null,null,null,null,null,null,null,null,null,null,null,null,null,null,null,null,null,null,null,null,null,null,null,null,null,null,null,null,null,null,null,null,null,null,null,null,null,null,null,null,null,0]
[null,null,null,null,null,null,null,null,null,null,null,null,null,null,null,null,null,null,null,null,null,null,null,null,null,null,null,null,null,null,null,null,null,null,null,null,null,null,null,null,null,null,null,null,null,null,null,null,null,null,null,null,null,null,null,null,null,null,null,null,null,null,null,null,0]
[null,null,null,null,null,null,null,null,null,null,null,null,null,null,null,null,null,null,null,null,null,null,null,null,null,null,null,null,null,null,null,null,null,null,null,null,null,null,null,null,null,null,null,null,null,null,null,null,null,null,null,null,null,null,null,null,null,null,null,null,null,null,null,null,0]
[null,null,null,null,null,null,null,null,null,null,null,null,null,null,null,null,null,null,null,null,null,null,null,null,null,null,null,null,null,null,null,null,null,null,null,null,null,null,null,null,null,null,null,null,null,null,null,null,null,null,null,null,null,null,null,null,null,null,null,null,null,null,null,null,0]
[null,null,null,null,null,null,null,null,null,null,null,null,null,null,null,null,null,null,null,null,null,null,null,null,null,null,null,null,null,null,null,null,null,null,null,null,null,null,null,null,null,null,null,null,null,null,null,null,null,null,null,null,null,null,null,null,null,null,null,null,null,null,null,null,0]
[null,null,null,null,null,null,null,null,null,null,null,null,null,null,null,null,null,null,null,null,null,null,null,null,null,null,null,null,null,null,null,null,null,null,null,null,null,null,null,null,null,null,null,null,null,null,null,null,null,null,null,null,null,null,null,null,null,null,null,null,null,null,null,null,0]
[null,null,null,null,null,null,null,null,null,null,null,null,null,null,null,null,null,null,null,null,null,null,null,null,null,null,null,null,null,null,null,null,null,null,null,null,null,null,null,null,null,null,null,null,null,null,null,null,null,null,null,null,null,null,null,null,null,null,null,null,null,null,null,null,0]
[null,null,null,null,null,null,null,null,null,null,null,null,null,null,null,null,null,null,null,null,null,null,null,null,null,null,null,null,null,null,null,null,null,null,null,null,null,null,null,null,null,null,null,null,null,null,null,null,null,null,null,null,null,null,null,null,null,null,null,null,null,null,null,null,0]
[null,null,null,null,null,null,null,null,null,null,null,null,null,null,null,null,null,null,null,null,null,null,null,null,null,null,null,null,null,null,null,null,null,null,null,null,null,null,null,null,null,null,null,null,null,null,null,null,null,null,null,null,null,null,null,null,null,null,null,null,null,null,null,null,0]
[null,null,null,null,null,null,null,null,null,null,null,null,null,null,null,null,null,null,null,null,null,null,null,null,null,null,null,null,null,null,null,null,null,null,null,null,null,null,null,null,null,null,null,null,null,null,null,null,null,null,null,null,null,null,null,null,null,null,null,null,null,null,null,null,0]
[null,null,null,null,null,null,null,null,null,null,null,null,null,null,null,null,null,null,null,null,null,null,null,null,null,null,null,null,null,null,null,null,null,null,null,null,null,null,null,null,null,null,null,null,null,null,null,null,null,null,null,null,null,null,null,null,null,null,null,null,null,null,null,null,0]
[null,null,null,null,null,null,null,null,null,null,null,null,null,null,null,null,null,null,null,null,null,null,null,null,null,null,null,null,null,null,null,null,null,null,null,null,null,null,null,null,null,null,null,null,null,null,null,null,null,null,null,null,null,null,null,null,null,null,null,null,null,null,null,null,0]
[null,null,null,null,null,null,null,null,null,null,null,null,null,null,null,null,null,null,null,null,null,null,null,null,null,null,null,null,null,null,null,null,null,null,null,null,null,null,null,null,null,null,null,null,null,null,null,null,null,null,null,null,null,null,null,null,null,null,null,null,null,null,null,null,0]
[null,null,null,null,null,null,null,null,null,null,null,null,null,null,null,null,null,null,null,null,null,null,null,null,null,null,null,null,null,null,null,null,null,null,null,null,null,null,null,null,null,null,null,null,null,null,null,null,null,null,null,null,null,null,null,null,null,null,null,null,null,null,null,null,0]
[null,null,null,null,null,null,null,null,null,null,null,null,null,null,null,null,null,null,null,null,null,null,null,null,null,null,null,null,null,null,null,null,null,null,null,null,null,null,null,null,null,null,null,null,null,null,null,null,null,null,null,null,null,null,null,null,null,null,null,null,null,null,null,null,0]
[null,null,null,null,null,null,null,null,null,null,null,null,null,null,null,null,null,null,null,null,null,null,null,null,null,null,null,null,null,null,null,null,null,null,null,null,null,null,null,null,null,null,null,null,null,null,null,null,null,null,null,null,null,null,null,null,null,null,null,null,null,null,null,null,0]
[null,null,null,null,null,null,null,null,null,null,null,null,null,null,null,null,null,null,null,null,null,null,null,null,null,null,null,null,null,null,null,null,null,null,null,null,null,null,null,null,null,null,null,null,null,null,null,null,null,null,null,null,null,null,null,null,null,null,null,null,null,null,null,null,0]
[null,null,null,null,null,null,null,null,null,null,null,null,null,null,null,null,null,null,null,null,null,null,null,null,null,null,null,null,null,null,null,null,null,null,null,null,null,null,null,null,null,null,null,null,null,null,null,null,null,null,null,null,null,null,null,null,null,null,null,null,null,null,null,null,0]
[null,null,null,null,null,null,null,null,null,null,null,null,null,null,null,null,null,null,null,null,null,null,null,null,null,null,null,null,null,null,null,null,null,null,null,null,null,null,null,null,null,null,null,null,null,null,null,null,null,null,null,null,null,null,null,null,null,null,null,null,null,null,null,null,0]
[null,null,null,null,null,null,null,null,null,null,null,null,null,null,null,null,null,null,null,null,null,null,null,null,null,null,null,null,null,null,null,null,null,null,null,null,null,null,null,null,null,null,null,null,null,null,null,null,null,null,null,null,null,null,null,null,null,null,null,null,null,null,null,null,0]
[null,null,null,null,null,null,null,null,null,null,null,null,null,null,null,null,null,null,null,null,null,null,null,null,null,null,null,null,null,null,null,null,null,null,null,null,null,null,null,null,null,null,null,null,null,null,null,null,null,null,null,null,null,null,null,null,null,null,null,null,null,null,null,null,0]
[null,null,null,null,null,null,null,null,null,null,null,null,null,null,null,null,null,null,null,null,null,null,null,null,null,null,null,null,null,null,null,null,null,null,null,null,null,null,null,null,null,null,null,null,null,null,null,null,null,null,null,null,null,null,null,null,null,null,null,null,null,null,null,null,0]
[null,null,null,null,null,null,null,null,null,null,null,null,null,null,null,null,null,null,null,null,null,null,null,null,null,null,null,null,null,null,null,null,null,null,null,null,null,null,null,null,null,null,null,null,null,null,null,null,null,null,null,null,null,null,null,null,null,null,null,null,null,null,null,null,0]

{"sheet":"Septembre","index":10,"n_rows":100,"n_cols":65,"rows_kept":100,"cut":false,"hidden":false,"merged":[[17,0,17,1],[18,0,18,1],[19,0,19,1],[20,0,20,1],[13,0,13,1],[1,8,1,11],[12,0,12,1],[10,0,10,1],[11,0,11,1],[9,0,9,1],[14,0,14,1],[15,0,15,1],[16,0,16,1],[8,0,8,1],[4,2,4,3],[4,4,4,5],[4,6,4,7],[4,8,4,9],[4,10,4,11],[3,2,3,3],[3,4,3,5],[3,6,3,7],[3,8,3,9],[3,10,3,11],[4,62,4,63],[6,0,6,1],[7,0,7,1],[4,44,4,45],[4,46,4,47],[4,48,4,49],[4,50,4,51],[4,52,4,53],[4,54,4,55],[4,32,4,33],[4,56,4,57],[4,58,4,59],[4,60,4,61],[4,42,4,43],[4,20,4,21],[4,22,4,23],[4,24,4,25],[4,26,4,27],[4,28,4,29],[4,34,4,35],[4,36,4,37],[4,38,4,39],[4,40,4,41],[4,12,4,13],[3,58,3,59],[3,14,3,15],[1,47,1,50],[1,54,1,58],[1,59,1,62],[3,48,3,49],[3,24,3,25],[3,42,3,43],[3,44,3,45],[3,46,3,47],[3,28,3,29],[3,62,3,63],[3,60,3,61],[1,42,1,46],[3,26,3,27],[4,14,4,15],[4,16,4,17],[4,18,4,19],[3,50,3,51],[3,52,3,53],[3,54,3,55],[3,56,3,57],[3,38,3,39],[3,40,3,41],[4,30,4,31],[3,12,3,13],[1,3,1,7],[1,16,1,20],[1,29,1,33],[1,21,1,24],[1,34,1,37],[3,30,3,31],[3,32,3,33],[3,34,3,35],[3,36,3,37],[3,16,3,17],[3,18,3,19],[3,20,3,21],[3,22,3,23],[26,0,26,1],[27,0,27,1],[28,0,28,1],[29,0,29,1],[30,0,30,1],[21,0,21,1],[22,0,22,1],[23,0,23,1],[24,0,24,1],[25,0,25,1],[36,0,36,1],[37,0,37,1],[38,0,38,1],[39,0,39,1],[40,0,40,1],[31,0,31,1],[32,0,32,1],[33,0,33,1],[34,0,34,1],[35,0,35,1],[46,0,46,1],[47,0,47,1],[48,0,48,1],[49,0,49,1],[50,0,50,1],[41,0,41,1],[42,0,42,1],[43,0,43,1],[44,0,44,1],[45,0,45,1],[56,0,56,1],[57,0,57,1],[58,0,58,1],[59,0,59,1],[60,0,60,1],[51,0,51,1],[52,0,52,1],[53,0,53,1],[54,0,54,1],[55,0,55,1],[66,0,66,1],[67,0,67,1],[68,0,68,1],[69,0,69,1],[70,0,70,1],[61,0,61,1],[62,0,62,1],[63,0,63,1],[64,0,64,1],[65,0,65,1],[76,0,76,1],[77,0,77,1],[78,0,78,1],[79,0,79,1],[80,0,80,1],[71,0,71,1],[72,0,72,1],[73,0,73,1],[74,0,74,1],[75,0,75,1],[86,0,86,1],[87,0,87,1],[88,0,88,1],[89,0,89,1],[90,0,90,1],[81,0,81,1],[82,0,82,1],[83,0,83,1],[84,0,84,1],[85,0,85,1],[96,0,96,1],[97,0,97,1],[98,0,98,1],[99,0,99,1],[91,0,91,1],[92,0,92,1],[93,0,93,1],[94,0,94,1],[95,0,95,1]]}
[8,{"$f":"C5","v":"2014-09-01"}]
[null,null,null,{"$f":"IF(An!$Q$4=\"\",\"\",An!$Q$4)","v":""},null,null,null,null,{"$f":"C5","v":"2014-09-01"},null,null,null,null,"ACCEUIL",null,null,{"$f":"IF(An!$Q$4=\"\",\"\",An!$Q$4)","v":""},null,null,null,null,"2012-09-01",null,null,null,null,"ACCEUIL",null,null,{"$f":"IF(An!$Q$4=\"\",\"\",An!$Q$4)","v":""},null,null,null,null,"2012-09-01",null,null,null,null,"ACCEUIL",null,null,{"$f":"IF(An!$Q$4=\"\",\"\",An!$Q$4)","v":""},null,null,null,null,"2012-09-01",null,null,null,null,"ACCEUIL",null,{"$f":"IF(An!$Q$4=\"\",\"\",An!$Q$4)","v":""},null,null,null,null,"2012-09-01",null,null,null,"ACCEUIL"]
[]
[null,null,{"$f":"IF(C5=\"\",\"\",IF(LOOKUP(C5,Fériés)=C5,\"\",CHOOSE(WEEKDAY(C5,1),\"Dimanche\",\"Lundi\",\"Mardi\",\"Mercredi\",\"Jeudi\",\"Vendredi\",\"Samedi\")))","v":"Lundi"},null,"Mardi",null,"Mercredi",null,"Jeudi",null,"Vendredi",null,"Samedi",null,"Dimanche",null,"Lundi",null,{"$f":"IF(S5=\"\",\"\",IF(LOOKUP(S5,Fériés)=S5,\"\",CHOOSE(WEEKDAY(S5,1),\"Dimanche\",\"Lundi\",\"Mardi\",\"Mercredi\",\"Jeudi\",\"Vendredi\",\"Samedi\")))","v":"Mardi"},null,"Mercredi",null,"Jeudi",null,"Vendredi",null,"Samedi",null,"Dimanche",null,"Lundi",null,{"$f":"IF(AG5=\"\",\"\",IF(LOOKUP(AG5,Fériés)=AG5,\"\",CHOOSE(WEEKDAY(AG5,1),\"Dimanche\",\"Lundi\",\"Mardi\",\"Mercredi\",\"Jeudi\",\"Vendredi\",\"Samedi\")))","v":"Mardi"},null,{"$f":"IF(AI5=\"\",\"\",IF(LOOKUP(AI5,Fériés)=AI5,\"\",CHOOSE(WEEKDAY(AI5,1),\"Dimanche\",\"Lundi\",\"Mardi\",\"Mercredi\",\"Jeudi\",\"Vendredi\",\"Samedi\")))","v":"Mercredi"},null,"Jeudi",null,"Vendredi",null,"Samedi",null,"Dimanche",null,"Lundi",null,"Mardi",null,{"$f":"IF(AW5=\"\",\"\",IF(LOOKUP(AW5,Fériés)=AW5,\"\",CHOOSE(WEEKDAY(AW5,1),\"Dimanche\",\"Lundi\",\"Mardi\",\"Mercredi\",\"Jeudi\",\"Vendredi\",\"Samedi\")))","v":"Mercredi"},null,{"$f":"IF(AY5=\"\",\"\",IF(LOOKUP(AY5,Fériés)=AY5,\"\",CHOOSE(WEEKDAY(AY5,1),\"Dimanche\",\"Lundi\",\"Mardi\",\"Mercredi\",\"Jeudi\",\"Vendredi\",\"Samedi\")))","v":"Jeudi"},null,"Vendredi",null,"Samedi",null,"Dimanche",null,"Lundi",null,"Mardi",null,""]
[null,null,{"$f":"DATE(Année,9,1)","v":"2014-09-01"},null,{"$f":"IF(C5=\"\",\"\",IF(MONTH(C5+1)<>MONTH(C5),\"\",C5+1))","v":"2014-09-02"},null,{"$f":"IF(E5=\"\",\"\",IF(MONTH(E5+1)<>MONTH(E5),\"\",E5+1))","v":"2014-09-03"},null,{"$f":"IF(G5=\"\",\"\",IF(MONTH(G5+1)<>MONTH(G5),\"\",G5+1))","v":"2014-09-04"},null,{"$f":"IF(I5=\"\",\"\",IF(MONTH(I5+1)<>MONTH(I5),\"\",I5+1))","v":"2014-09-05"},null,{"$f":"IF(K5=\"\",\"\",IF(MONTH(K5+1)<>MONTH(K5),\"\",K5+1))","v":"2014-09-06"},null,{"$f":"IF(M5=\"\",\"\",IF(MONTH(M5+1)<>MONTH(M5),\"\",M5+1))","v":"2014-09-07"},null,{"$f":"IF(O5=\"\",\"\",IF(MONTH(O5+1)<>MONTH(O5),\"\",O5+1))","v":"2014-09-08"},null,{"$f":"IF(Q5=\"\",\"\",IF(MONTH(Q5+1)<>MONTH(Q5),\"\",Q5+1))","v":"2014-09-09"},null,{"$f":"IF(S5=\"\",\"\",IF(MONTH(S5+1)<>MONTH(S5),\"\",S5+1))","v":"2014-09-10"},null,{"$f":"IF(U5=\"\",\"\",IF(MONTH(U5+1)<>MONTH(U5),\"\",U5+1))","v":"2014-09-11"},null,{"$f":"IF(W5=\"\",\"\",IF(MONTH(W5+1)<>MONTH(W5),\"\",W5+1))","v":"2014-09-12"},null,{"$f":"IF(Y5=\"\",\"\",IF(MONTH(Y5+1)<>MONTH(Y5),\"\",Y5+1))","v":"2014-09-13"},null,{"$f":"IF(AA5=\"\",\"\",IF(MONTH(AA5+1)<>MONTH(AA5),\"\",AA5+1))","v":"2014-09-14"},null,{"$f":"IF(AC5=\"\",\"\",IF(MONTH(AC5+1)<>MONTH(AC5),\"\",AC5+1))","v":"2014-09-15"},null,{"$f":"IF(AE5=\"\",\"\",IF(MONTH(AE5+1)<>MONTH(AE5),\"\",AE5+1))","v":"2014-09-16"},null,{"$f":"IF(AG5=\"\",\"\",IF(MONTH(AG5+1)<>MONTH(AG5),\"\",AG5+1))","v":"2014-09-17"},null,{"$f":"IF(AI5=\"\",\"\",IF(MONTH(AI5+1)<>MONTH(AI5),\"\",AI5+1))","v":"2014-09-18"},null,{"$f":"IF(AK5=\"\",\"\",IF(MONTH(AK5+1)<>MONTH(AK5),\"\",AK5+1))","v":"2014-09-19"},null,{"$f":"IF(AM5=\"\",\"\",IF(MONTH(AM5+1)<>MONTH(AM5),\"\",AM5+1))","v":"2014-09-20"},null,{"$f":"IF(AO5=\"\",\"\",IF(MONTH(AO5+1)<>MONTH(AO5),\"\",AO5+1))","v":"2014-09-21"},null,{"$f":"IF(AQ5=\"\",\"\",IF(MONTH(AQ5+1)<>MONTH(AQ5),\"\",AQ5+1))","v":"2014-09-22"},null,{"$f":"IF(AS5=\"\",\"\",IF(MONTH(AS5+1)<>MONTH(AS5),\"\",AS5+1))","v":"2014-09-23"},null,{"$f":"IF(AU5=\"\",\"\",IF(MONTH(AU5+1)<>MONTH(AU5),\"\",AU5+1))","v":"2014-09-24"},null,{"$f":"IF(AW5=\"\",\"\",IF(MONTH(AW5+1)<>MONTH(AW5),\"\",AW5+1))","v":"2014-09-25"},null,{"$f":"IF(AY5=\"\",\"\",IF(MONTH(AY5+1)<>MONTH(AY5),\"\",AY5+1))","v":"2014-09-26"},null,{"$f":"IF(BA5=\"\",\"\",IF(MONTH(BA5+1)<>MONTH(BA5),\"\",BA5+1))","v":"2014-09-27"},null,{"$f":"IF(BC5=\"\",\"\",IF(MONTH(BC5+1)<>MONTH(BC5),\"\",BC5+1))","v":"2014-09-28"},null,{"$f":"IF(BE5=\"\",\"\",IF(MONTH(BE5+1)<>MONTH(BE5),\"\",BE5+1))","v":"2014-09-29"},null,{"$f":"IF(BG5=\"\",\"\",IF(MONTH(BG5+1)<>MONTH(BG5),\"\",BG5+1))","v":"2014-09-30"},null,{"$f":"IF(BI5=\"\",\"\",IF(MONTH(BI5+1)<>MONTH(BI5),\"\",BI5+1))","v":""}]
[null,null,"Matin","Après midi","Matin","Après midi","Matin","Après midi","Matin","Après midi","Matin","Après midi","Matin","Après midi","Matin","Après midi","Matin","Après midi","Matin","Après midi","Matin","Après midi","Matin","Après midi","Matin","Après midi","Matin","Après midi","Matin","Après midi","Matin","Après midi","Matin","Après midi","Matin","Après midi","Matin","Après midi","Matin","Après midi","Matin","Après midi","Matin","Après midi","Matin","Après midi","Matin","Après midi","Matin","Après midi","Matin","Après midi","Matin","Après midi","Matin","Après midi","Matin","Après midi",{"$f":"IF(BG5=\"\",\"\",\"Matin\")","v":"Matin"},{"$f":"IF(BG5=\"\",\"\",\"Apres midi\")","v":"Apres midi"},{"$f":"IF(BI5=\"\",\"\",\"Matin\")","v":"Matin"},{"$f":"IF(BI5=\"\",\"\",\"Apres midi\")","v":"Apres midi"},{"$f":"IF(BK5=\"\",\"\",\"Matin\")","v":""},{"$f":"IF(BK5=\"\",\"\",\"Apres midi\")","v":""}]
[null,null,null,null,null,null,null,null,null,null,null,null,null,null,null,null,null,null,null,null,null,null,null,null,null,null,null,null,null,null,null,null,null,null,null,null,null,null,null,null,null,null,null,null,null,null,null,null,null,null,null,null,null,null,null,null,null,null,null,null,null,null,null,null,{"$f":"COUNTA(C7:BL7)/2","v":0}]
[null,null,null,null,null,null,null,null,null,null,null,null,null,null,null,null,null,null,null,null,null,null,null,null,null,null,null,null,null,null,null,null,null,null,null,null,null,null,null,null,null,null,null,null,null,null,null,null,null,null,null,null,null,null,null,null,null,null,null,null,null,null,null,null,{"$f":"COUNTA(C8:BL8)/2","v":0}]
[null,null,null,null,null,null,null,null,null,null,null,null,null,null,null,null,null,null,null,null,null,null,null,null,null,null,null,null,null,null,null,null,null,null,null,null,null,null,null,null,null,null,null,null,null,null,null,null,null,null,null,null,null,null,null,null,null,null,null,null,null,null,null,null,0]
[null,null,null,null,null,null,null,null,null,null,null,null,null,null,null,null,null,null,null,null,null,null,null,null,null,null,null,null,null,null,null,null,null,null,null,null,null,null,null,null,null,null,null,null,null,null,null,null,null,null,null,null,null,null,null,null,null,null,null,null,null,null,null,null,0]
[null,null,null,null,null,null,null,null,null,null,null,null,null,null,null,null,null,null,null,null,null,null,null,null,null,null,null,null,null,null,null,null,null,null,null,null,null,null,null,null,null,null,null,null,null,null,null,null,null,null,null,null,null,null,null,null,null,null,null,null,null,null,null,null,0]
[null,null,null,null,null,null,null,null,null,null,null,null,null,null,null,null,null,null,null,null,null,null,null,null,null,null,null,null,null,null,null,null,null,null,null,null,null,null,null,null,null,null,null,null,null,null,null,null,null,null,null,null,null,null,null,null,null,null,null,null,null,null,null,null,0]
[null,null,null,null,null,null,null,null,null,null,null,null,null,null,null,null,null,null,null,null,null,null,null,null,null,null,null,null,null,null,null,null,null,null,null,null,null,null,null,null,null,null,null,null,null,null,null,null,null,null,null,null,null,null,null,null,null,null,null,null,null,null,null,null,0]
[null,null,null,null,null,null,null,null,null,null,null,null,null,null,null,null,null,null,null,null,null,null,null,null,null,null,null,null,null,null,null,null,null,null,null,null,null,null,null,null,null,null,null,null,null,null,null,null,null,null,null,null,null,null,null,null,null,null,null,null,null,null,null,null,0]
[null,null,null,null,null,null,null,null,null,null,null,null,null,null,null,null,null,null,null,null,null,null,null,null,null,null,null,null,null,null,null,null,null,null,null,null,null,null,null,null,null,null,null,null,null,null,null,null,null,null,null,null,null,null,null,null,null,null,null,null,null,null,null,null,0]
[null,null,null,null,null,null,null,null,null,null,null,null,null,null,null,null,null,null,null,null,null,null,null,null,null,null,null,null,null,null,null,null,null,null,null,null,null,null,null,null,null,null,null,null,null,null,null,null,null,null,null,null,null,null,null,null,null,null,null,null,null,null,null,null,0]
[null,null,null,null,null,null,null,null,null,null,null,null,null,null,null,null,null,null,null,null,null,null,null,null,null,null,null,null,null,null,null,null,null,null,null,null,null,null,null,null,null,null,null,null,null,null,null,null,null,null,null,null,null,null,null,null,null,null,null,null,null,null,null,null,0]
[null,null,null,null,null,null,null,null,null,null,null,null,null,null,null,null,null,null,null,null,null,null,null,null,null,null,null,null,null,null,null,null,null,null,null,null,null,null,null,null,null,null,null,null,null,null,null,null,null,null,null,null,null,null,null,null,null,null,null,null,null,null,null,null,0]
[null,null,null,null,null,null,null,null,null,null,null,null,null,null,null,null,null,null,null,null,null,null,null,null,null,null,null,null,null,null,null,null,null,null,null,null,null,null,null,null,null,null,null,null,null,null,null,null,null,null,null,null,null,null,null,null,null,null,null,null,null,null,null,null,0]
[null,null,null,null,null,null,null,null,null,null,null,null,null,null,null,null,null,null,null,null,null,null,null,null,null,null,null,null,null,null,null,null,null,null,null,null,null,null,null,null,null,null,null,null,null,null,null,null,null,null,null,null,null,null,null,null,null,null,null,null,null,null,null,null,0]
[null,null,null,null,null,null,null,null,null,null,null,null,null,null,null,null,null,null,null,null,null,null,null,null,null,null,null,null,null,null,null,null,null,null,null,null,null,null,null,null,null,null,null,null,null,null,null,null,null,null,null,null,null,null,null,null,null,null,null,null,null,null,null,null,0]
[null,null,null,null,null,null,null,null,null,null,null,null,null,null,null,null,null,null,null,null,null,null,null,null,null,null,null,null,null,null,null,null,null,null,null,null,null,null,null,null,null,null,null,null,null,null,null,null,null,null,null,null,null,null,null,null,null,null,null,null,null,null,null,null,0]
[null,null,null,null,null,null,null,null,null,null,null,null,null,null,null,null,null,null,null,null,null,null,null,null,null,null,null,null,null,null,null,null,null,null,null,null,null,null,null,null,null,null,null,null,null,null,null,null,null,null,null,null,null,null,null,null,null,null,null,null,null,null,null,null,0]
[null,null,null,null,null,null,null,null,null,null,null,null,null,null,null,null,null,null,null,null,null,null,null,null,null,null,null,null,null,null,null,null,null,null,null,null,null,null,null,null,null,null,null,null,null,null,null,null,null,null,null,null,null,null,null,null,null,null,null,null,null,null,null,null,0]
[null,null,null,null,null,null,null,null,null,null,null,null,null,null,null,null,null,null,null,null,null,null,null,null,null,null,null,null,null,null,null,null,null,null,null,null,null,null,null,null,null,null,null,null,null,null,null,null,null,null,null,null,null,null,null,null,null,null,null,null,null,null,null,null,0]
[null,null,null,null,null,null,null,null,null,null,null,null,null,null,null,null,null,null,null,null,null,null,null,null,null,null,null,null,null,null,null,null,null,null,null,null,null,null,null,null,null,null,null,null,null,null,null,null,null,null,null,null,null,null,null,null,null,null,null,null,null,null,null,null,0]
[null,null,null,null,null,null,null,null,null,null,null,null,null,null,null,null,null,null,null,null,null,null,null,null,null,null,null,null,null,null,null,null,null,null,null,null,null,null,null,null,null,null,null,null,null,null,null,null,null,null,null,null,null,null,null,null,null,null,null,null,null,null,null,null,0]
[null,null,null,null,null,null,null,null,null,null,null,null,null,null,null,null,null,null,null,null,null,null,null,null,null,null,null,null,null,null,null,null,null,null,null,null,null,null,null,null,null,null,null,null,null,null,null,null,null,null,null,null,null,null,null,null,null,null,null,null,null,null,null,null,0]
[null,null,null,null,null,null,null,null,null,null,null,null,null,null,null,null,null,null,null,null,null,null,null,null,null,null,null,null,null,null,null,null,null,null,null,null,null,null,null,null,null,null,null,null,null,null,null,null,null,null,null,null,null,null,null,null,null,null,null,null,null,null,null,null,0]
[null,null,null,null,null,null,null,null,null,null,null,null,null,null,null,null,null,null,null,null,null,null,null,null,null,null,null,null,null,null,null,null,null,null,null,null,null,null,null,null,null,null,null,null,null,null,null,null,null,null,null,null,null,null,null,null,null,null,null,null,null,null,null,null,0]
[null,null,null,null,null,null,null,null,null,null,null,null,null,null,null,null,null,null,null,null,null,null,null,null,null,null,null,null,null,null,null,null,null,null,null,null,null,null,null,null,null,null,null,null,null,null,null,null,null,null,null,null,null,null,null,null,null,null,null,null,null,null,null,null,0]
[null,null,null,null,null,null,null,null,null,null,null,null,null,null,null,null,null,null,null,null,null,null,null,null,null,null,null,null,null,null,null,null,null,null,null,null,null,null,null,null,null,null,null,null,null,null,null,null,null,null,null,null,null,null,null,null,null,null,null,null,null,null,null,null,0]
[null,null,null,null,null,null,null,null,null,null,null,null,null,null,null,null,null,null,null,null,null,null,null,null,null,null,null,null,null,null,null,null,null,null,null,null,null,null,null,null,null,null,null,null,null,null,null,null,null,null,null,null,null,null,null,null,null,null,null,null,null,null,null,null,0]
[null,null,null,null,null,null,null,null,null,null,null,null,null,null,null,null,null,null,null,null,null,null,null,null,null,null,null,null,null,null,null,null,null,null,null,null,null,null,null,null,null,null,null,null,null,null,null,null,null,null,null,null,null,null,null,null,null,null,null,null,null,null,null,null,0]
[null,null,null,null,null,null,null,null,null,null,null,null,null,null,null,null,null,null,null,null,null,null,null,null,null,null,null,null,null,null,null,null,null,null,null,null,null,null,null,null,null,null,null,null,null,null,null,null,null,null,null,null,null,null,null,null,null,null,null,null,null,null,null,null,0]
[null,null,null,null,null,null,null,null,null,null,null,null,null,null,null,null,null,null,null,null,null,null,null,null,null,null,null,null,null,null,null,null,null,null,null,null,null,null,null,null,null,null,null,null,null,null,null,null,null,null,null,null,null,null,null,null,null,null,null,null,null,null,null,null,0]
[null,null,null,null,null,null,null,null,null,null,null,null,null,null,null,null,null,null,null,null,null,null,null,null,null,null,null,null,null,null,null,null,null,null,null,null,null,null,null,null,null,null,null,null,null,null,null,null,null,null,null,null,null,null,null,null,null,null,null,null,null,null,null,null,0]
[null,null,null,null,null,null,null,null,null,null,null,null,null,null,null,null,null,null,null,null,null,null,null,null,null,null,null,null,null,null,null,null,null,null,null,null,null,null,null,null,null,null,null,null,null,null,null,null,null,null,null,null,null,null,null,null,null,null,null,null,null,null,null,null,0]
[null,null,null,null,null,null,null,null,null,null,null,null,null,null,null,null,null,null,null,null,null,null,null,null,null,null,null,null,null,null,null,null,null,null,null,null,null,null,null,null,null,null,null,null,null,null,null,null,null,null,null,null,null,null,null,null,null,null,null,null,null,null,null,null,0]
[null,null,null,null,null,null,null,null,null,null,null,null,null,null,null,null,null,null,null,null,null,null,null,null,null,null,null,null,null,null,null,null,null,null,null,null,null,null,null,null,null,null,null,null,null,null,null,null,null,null,null,null,null,null,null,null,null,null,null,null,null,null,null,null,0]
[null,null,null,null,null,null,null,null,null,null,null,null,null,null,null,null,null,null,null,null,null,null,null,null,null,null,null,null,null,null,null,null,null,null,null,null,null,null,null,null,null,null,null,null,null,null,null,null,null,null,null,null,null,null,null,null,null,null,null,null,null,null,null,null,0]
[null,null,null,null,null,null,null,null,null,null,null,null,null,null,null,null,null,null,null,null,null,null,null,null,null,null,null,null,null,null,null,null,null,null,null,null,null,null,null,null,null,null,null,null,null,null,null,null,null,null,null,null,null,null,null,null,null,null,null,null,null,null,null,null,0]
[null,null,null,null,null,null,null,null,null,null,null,null,null,null,null,null,null,null,null,null,null,null,null,null,null,null,null,null,null,null,null,null,null,null,null,null,null,null,null,null,null,null,null,null,null,null,null,null,null,null,null,null,null,null,null,null,null,null,null,null,null,null,null,null,0]
[null,null,null,null,null,null,null,null,null,null,null,null,null,null,null,null,null,null,null,null,null,null,null,null,null,null,null,null,null,null,null,null,null,null,null,null,null,null,null,null,null,null,null,null,null,null,null,null,null,null,null,null,null,null,null,null,null,null,null,null,null,null,null,null,0]
[null,null,null,null,null,null,null,null,null,null,null,null,null,null,null,null,null,null,null,null,null,null,null,null,null,null,null,null,null,null,null,null,null,null,null,null,null,null,null,null,null,null,null,null,null,null,null,null,null,null,null,null,null,null,null,null,null,null,null,null,null,null,null,null,0]
[null,null,null,null,null,null,null,null,null,null,null,null,null,null,null,null,null,null,null,null,null,null,null,null,null,null,null,null,null,null,null,null,null,null,null,null,null,null,null,null,null,null,null,null,null,null,null,null,null,null,null,null,null,null,null,null,null,null,null,null,null,null,null,null,0]
[null,null,null,null,null,null,null,null,null,null,null,null,null,null,null,null,null,null,null,null,null,null,null,null,null,null,null,null,null,null,null,null,null,null,null,null,null,null,null,null,null,null,null,null,null,null,null,null,null,null,null,null,null,null,null,null,null,null,null,null,null,null,null,null,0]
[null,null,null,null,null,null,null,null,null,null,null,null,null,null,null,null,null,null,null,null,null,null,null,null,null,null,null,null,null,null,null,null,null,null,null,null,null,null,null,null,null,null,null,null,null,null,null,null,null,null,null,null,null,null,null,null,null,null,null,null,null,null,null,null,0]
[null,null,null,null,null,null,null,null,null,null,null,null,null,null,null,null,null,null,null,null,null,null,null,null,null,null,null,null,null,null,null,null,null,null,null,null,null,null,null,null,null,null,null,null,null,null,null,null,null,null,null,null,null,null,null,null,null,null,null,null,null,null,null,null,0]
[null,null,null,null,null,null,null,null,null,null,null,null,null,null,null,null,null,null,null,null,null,null,null,null,null,null,null,null,null,null,null,null,null,null,null,null,null,null,null,null,null,null,null,null,null,null,null,null,null,null,null,null,null,null,null,null,null,null,null,null,null,null,null,null,0]
[null,null,null,null,null,null,null,null,null,null,null,null,null,null,null,null,null,null,null,null,null,null,null,null,null,null,null,null,null,null,null,null,null,null,null,null,null,null,null,null,null,null,null,null,null,null,null,null,null,null,null,null,null,null,null,null,null,null,null,null,null,null,null,null,0]
[null,null,null,null,null,null,null,null,null,null,null,null,null,null,null,null,null,null,null,null,null,null,null,null,null,null,null,null,null,null,null,null,null,null,null,null,null,null,null,null,null,null,null,null,null,null,null,null,null,null,null,null,null,null,null,null,null,null,null,null,null,null,null,null,0]
[null,null,null,null,null,null,null,null,null,null,null,null,null,null,null,null,null,null,null,null,null,null,null,null,null,null,null,null,null,null,null,null,null,null,null,null,null,null,null,null,null,null,null,null,null,null,null,null,null,null,null,null,null,null,null,null,null,null,null,null,null,null,null,null,0]
[null,null,null,null,null,null,null,null,null,null,null,null,null,null,null,null,null,null,null,null,null,null,null,null,null,null,null,null,null,null,null,null,null,null,null,null,null,null,null,null,null,null,null,null,null,null,null,null,null,null,null,null,null,null,null,null,null,null,null,null,null,null,null,null,0]
[null,null,null,null,null,null,null,null,null,null,null,null,null,null,null,null,null,null,null,null,null,null,null,null,null,null,null,null,null,null,null,null,null,null,null,null,null,null,null,null,null,null,null,null,null,null,null,null,null,null,null,null,null,null,null,null,null,null,null,null,null,null,null,null,0]
[null,null,null,null,null,null,null,null,null,null,null,null,null,null,null,null,null,null,null,null,null,null,null,null,null,null,null,null,null,null,null,null,null,null,null,null,null,null,null,null,null,null,null,null,null,null,null,null,null,null,null,null,null,null,null,null,null,null,null,null,null,null,null,null,0]
[null,null,null,null,null,null,null,null,null,null,null,null,null,null,null,null,null,null,null,null,null,null,null,null,null,null,null,null,null,null,null,null,null,null,null,null,null,null,null,null,null,null,null,null,null,null,null,null,null,null,null,null,null,null,null,null,null,null,null,null,null,null,null,null,0]
[null,null,null,null,null,null,null,null,null,null,null,null,null,null,null,null,null,null,null,null,null,null,null,null,null,null,null,null,null,null,null,null,null,null,null,null,null,null,null,null,null,null,null,null,null,null,null,null,null,null,null,null,null,null,null,null,null,null,null,null,null,null,null,null,0]
[null,null,null,null,null,null,null,null,null,null,null,null,null,null,null,null,null,null,null,null,null,null,null,null,null,null,null,null,null,null,null,null,null,null,null,null,null,null,null,null,null,null,null,null,null,null,null,null,null,null,null,null,null,null,null,null,null,null,null,null,null,null,null,null,0]
[null,null,null,null,null,null,null,null,null,null,null,null,null,null,null,null,null,null,null,null,null,null,null,null,null,null,null,null,null,null,null,null,null,null,null,null,null,null,null,null,null,null,null,null,null,null,null,null,null,null,null,null,null,null,null,null,null,null,null,null,null,null,null,null,0]
[null,null,null,null,null,null,null,null,null,null,null,null,null,null,null,null,null,null,null,null,null,null,null,null,null,null,null,null,null,null,null,null,null,null,null,null,null,null,null,null,null,null,null,null,null,null,null,null,null,null,null,null,null,null,null,null,null,null,null,null,null,null,null,null,0]
[null,null,null,null,null,null,null,null,null,null,null,null,null,null,null,null,null,null,null,null,null,null,null,null,null,null,null,null,null,null,null,null,null,null,null,null,null,null,null,null,null,null,null,null,null,null,null,null,null,null,null,null,null,null,null,null,null,null,null,null,null,null,null,null,0]
[null,null,null,null,null,null,null,null,null,null,null,null,null,null,null,null,null,null,null,null,null,null,null,null,null,null,null,null,null,null,null,null,null,null,null,null,null,null,null,null,null,null,null,null,null,null,null,null,null,null,null,null,null,null,null,null,null,null,null,null,null,null,null,null,0]
[null,null,null,null,null,null,null,null,null,null,null,null,null,null,null,null,null,null,null,null,null,null,null,null,null,null,null,null,null,null,null,null,null,null,null,null,null,null,null,null,null,null,null,null,null,null,null,null,null,null,null,null,null,null,null,null,null,null,null,null,null,null,null,null,0]
[null,null,null,null,null,null,null,null,null,null,null,null,null,null,null,null,null,null,null,null,null,null,null,null,null,null,null,null,null,null,null,null,null,null,null,null,null,null,null,null,null,null,null,null,null,null,null,null,null,null,null,null,null,null,null,null,null,null,null,null,null,null,null,null,0]
[null,null,null,null,null,null,null,null,null,null,null,null,null,null,null,null,null,null,null,null,null,null,null,null,null,null,null,null,null,null,null,null,null,null,null,null,null,null,null,null,null,null,null,null,null,null,null,null,null,null,null,null,null,null,null,null,null,null,null,null,null,null,null,null,0]
[null,null,null,null,null,null,null,null,null,null,null,null,null,null,null,null,null,null,null,null,null,null,null,null,null,null,null,null,null,null,null,null,null,null,null,null,null,null,null,null,null,null,null,null,null,null,null,null,null,null,null,null,null,null,null,null,null,null,null,null,null,null,null,null,0]
[null,null,null,null,null,null,null,null,null,null,null,null,null,null,null,null,null,null,null,null,null,null,null,null,null,null,null,null,null,null,null,null,null,null,null,null,null,null,null,null,null,null,null,null,null,null,null,null,null,null,null,null,null,null,null,null,null,null,null,null,null,null,null,null,0]
[null,null,null,null,null,null,null,null,null,null,null,null,null,null,null,null,null,null,null,null,null,null,null,null,null,null,null,null,null,null,null,null,null,null,null,null,null,null,null,null,null,null,null,null,null,null,null,null,null,null,null,null,null,null,null,null,null,null,null,null,null,null,null,null,0]
[null,null,null,null,null,null,null,null,null,null,null,null,null,null,null,null,null,null,null,null,null,null,null,null,null,null,null,null,null,null,null,null,null,null,null,null,null,null,null,null,null,null,null,null,null,null,null,null,null,null,null,null,null,null,null,null,null,null,null,null,null,null,null,null,0]
[null,null,null,null,null,null,null,null,null,null,null,null,null,null,null,null,null,null,null,null,null,null,null,null,null,null,null,null,null,null,null,null,null,null,null,null,null,null,null,null,null,null,null,null,null,null,null,null,null,null,null,null,null,null,null,null,null,null,null,null,null,null,null,null,0]
[null,null,null,null,null,null,null,null,null,null,null,null,null,null,null,null,null,null,null,null,null,null,null,null,null,null,null,null,null,null,null,null,null,null,null,null,null,null,null,null,null,null,null,null,null,null,null,null,null,null,null,null,null,null,null,null,null,null,null,null,null,null,null,null,{"$f":"COUNTA(C72:BL72)/2","v":0}]
[null,null,null,null,null,null,null,null,null,null,null,null,null,null,null,null,null,null,null,null,null,null,null,null,null,null,null,null,null,null,null,null,null,null,null,null,null,null,null,null,null,null,null,null,null,null,null,null,null,null,null,null,null,null,null,null,null,null,null,null,null,null,null,null,0]
[null,null,null,null,null,null,null,null,null,null,null,null,null,null,null,null,null,null,null,null,null,null,null,null,null,null,null,null,null,null,null,null,null,null,null,null,null,null,null,null,null,null,null,null,null,null,null,null,null,null,null,null,null,null,null,null,null,null,null,null,null,null,null,null,0]
[null,null,null,null,null,null,null,null,null,null,null,null,null,null,null,null,null,null,null,null,null,null,null,null,null,null,null,null,null,null,null,null,null,null,null,null,null,null,null,null,null,null,null,null,null,null,null,null,null,null,null,null,null,null,null,null,null,null,null,null,null,null,null,null,0]
[null,null,null,null,null,null,null,null,null,null,null,null,null,null,null,null,null,null,null,null,null,null,null,null,null,null,null,null,null,null,null,null,null,null,null,null,null,null,null,null,null,null,null,null,null,null,null,null,null,null,null,null,null,null,null,null,null,null,null,null,null,null,null,null,0]
[null,null,null,null,null,null,null,null,null,null,null,null,null,null,null,null,null,null,null,null,null,null,null,null,null,null,null,null,null,null,null,null,null,null,null,null,null,null,null,null,null,null,null,null,null,null,null,null,null,null,null,null,null,null,null,null,null,null,null,null,null,null,null,null,0]
[null,null,null,null,null,null,null,null,null,null,null,null,null,null,null,null,null,null,null,null,null,null,null,null,null,null,null,null,null,null,null,null,null,null,null,null,null,null,null,null,null,null,null,null,null,null,null,null,null,null,null,null,null,null,null,null,null,null,null,null,null,null,null,null,0]
[null,null,null,null,null,null,null,null,null,null,null,null,null,null,null,null,null,null,null,null,null,null,null,null,null,null,null,null,null,null,null,null,null,null,null,null,null,null,null,null,null,null,null,null,null,null,null,null,null,null,null,null,null,null,null,null,null,null,null,null,null,null,null,null,0]
[null,null,null,null,null,null,null,null,null,null,null,null,null,null,null,null,null,null,null,null,null,null,null,null,null,null,null,null,null,null,null,null,null,null,null,null,null,null,null,null,null,null,null,null,null,null,null,null,null,null,null,null,null,null,null,null,null,null,null,null,null,null,null,null,0]
[null,null,null,null,null,null,null,null,null,null,null,null,null,null,null,null,null,null,null,null,null,null,null,null,null,null,null,null,null,null,null,null,null,null,null,null,null,null,null,null,null,null,null,null,null,null,null,null,null,null,null,null,null,null,null,null,null,null,null,null,null,null,null,null,0]
[null,null,null,null,null,null,null,null,null,null,null,null,null,null,null,null,null,null,null,null,null,null,null,null,null,null,null,null,null,null,null,null,null,null,null,null,null,null,null,null,null,null,null,null,null,null,null,null,null,null,null,null,null,null,null,null,null,null,null,null,null,null,null,null,0]
[null,null,null,null,null,null,null,null,null,null,null,null,null,null,null,null,null,null,null,null,null,null,null,null,null,null,null,null,null,null,null,null,null,null,null,null,null,null,null,null,null,null,null,null,null,null,null,null,null,null,null,null,null,null,null,null,null,null,null,null,null,null,null,null,0]
[null,null,null,null,null,null,null,null,null,null,null,null,null,null,null,null,null,null,null,null,null,null,null,null,null,null,null,null,null,null,null,null,null,null,null,null,null,null,null,null,null,null,null,null,null,null,null,null,null,null,null,null,null,null,null,null,null,null,null,null,null,null,null,null,0]
[null,null,null,null,null,null,null,null,null,null,null,null,null,null,null,null,null,null,null,null,null,null,null,null,null,null,null,null,null,null,null,null,null,null,null,null,null,null,null,null,null,null,null,null,null,null,null,null,null,null,null,null,null,null,null,null,null,null,null,null,null,null,null,null,0]
[null,null,null,null,null,null,null,null,null,null,null,null,null,null,null,null,null,null,null,null,null,null,null,null,null,null,null,null,null,null,null,null,null,null,null,null,null,null,null,null,null,null,null,null,null,null,null,null,null,null,null,null,null,null,null,null,null,null,null,null,null,null,null,null,0]
[null,null,null,null,null,null,null,null,null,null,null,null,null,null,null,null,null,null,null,null,null,null,null,null,null,null,null,null,null,null,null,null,null,null,null,null,null,null,null,null,null,null,null,null,null,null,null,null,null,null,null,null,null,null,null,null,null,null,null,null,null,null,null,null,0]
[null,null,null,null,null,null,null,null,null,null,null,null,null,null,null,null,null,null,null,null,null,null,null,null,null,null,null,null,null,null,null,null,null,null,null,null,null,null,null,null,null,null,null,null,null,null,null,null,null,null,null,null,null,null,null,null,null,null,null,null,null,null,null,null,0]
[null,null,null,null,null,null,null,null,null,null,null,null,null,null,null,null,null,null,null,null,null,null,null,null,null,null,null,null,null,null,null,null,null,null,null,null,null,null,null,null,null,null,null,null,null,null,null,null,null,null,null,null,null,null,null,null,null,null,null,null,null,null,null,null,0]
[null,null,null,null,null,null,null,null,null,null,null,null,null,null,null,null,null,null,null,null,null,null,null,null,null,null,null,null,null,null,null,null,null,null,null,null,null,null,null,null,null,null,null,null,null,null,null,null,null,null,null,null,null,null,null,null,null,null,null,null,null,null,null,null,0]
[null,null,null,null,null,null,null,null,null,null,null,null,null,null,null,null,null,null,null,null,null,null,null,null,null,null,null,null,null,null,null,null,null,null,null,null,null,null,null,null,null,null,null,null,null,null,null,null,null,null,null,null,null,null,null,null,null,null,null,null,null,null,null,null,0]
[null,null,null,null,null,null,null,null,null,null,null,null,null,null,null,null,null,null,null,null,null,null,null,null,null,null,null,null,null,null,null,null,null,null,null,null,null,null,null,null,null,null,null,null,null,null,null,null,null,null,null,null,null,null,null,null,null,null,null,null,null,null,null,null,0]
[null,null,null,null,null,null,null,null,null,null,null,null,null,null,null,null,null,null,null,null,null,null,null,null,null,null,null,null,null,null,null,null,null,null,null,null,null,null,null,null,null,null,null,null,null,null,null,null,null,null,null,null,null,null,null,null,null,null,null,null,null,null,null,null,0]
[null,null,null,null,null,null,null,null,null,null,null,null,null,null,null,null,null,null,null,null,null,null,null,null,null,null,null,null,null,null,null,null,null,null,null,null,null,null,null,null,null,null,null,null,null,null,null,null,null,null,null,null,null,null,null,null,null,null,null,null,null,null,null,null,0]
[null,null,null,null,null,null,null,null,null,null,null,null,null,null,null,null,null,null,null,null,null,null,null,null,null,null,null,null,null,null,null,null,null,null,null,null,null,null,null,null,null,null,null,null,null,null,null,null,null,null,null,null,null,null,null,null,null,null,null,null,null,null,null,null,0]
[null,null,null,null,null,null,null,null,null,null,null,null,null,null,null,null,null,null,null,null,null,null,null,null,null,null,null,null,null,null,null,null,null,null,null,null,null,null,null,null,null,null,null,null,null,null,null,null,null,null,null,null,null,null,null,null,null,null,null,null,null,null,null,null,0]
[null,null,null,null,null,null,null,null,null,null,null,null,null,null,null,null,null,null,null,null,null,null,null,null,null,null,null,null,null,null,null,null,null,null,null,null,null,null,null,null,null,null,null,null,null,null,null,null,null,null,null,null,null,null,null,null,null,null,null,null,null,null,null,null,0]
[null,null,null,null,null,null,null,null,null,null,null,null,null,null,null,null,null,null,null,null,null,null,null,null,null,null,null,null,null,null,null,null,null,null,null,null,null,null,null,null,null,null,null,null,null,null,null,null,null,null,null,null,null,null,null,null,null,null,null,null,null,null,null,null,0]
[null,null,null,null,null,null,null,null,null,null,null,null,null,null,null,null,null,null,null,null,null,null,null,null,null,null,null,null,null,null,null,null,null,null,null,null,null,null,null,null,null,null,null,null,null,null,null,null,null,null,null,null,null,null,null,null,null,null,null,null,null,null,null,null,0]
[null,null,null,null,null,null,null,null,null,null,null,null,null,null,null,null,null,null,null,null,null,null,null,null,null,null,null,null,null,null,null,null,null,null,null,null,null,null,null,null,null,null,null,null,null,null,null,null,null,null,null,null,null,null,null,null,null,null,null,null,null,null,null,null,0]

{"sheet":"Octobre","index":11,"n_rows":100,"n_cols":65,"rows_kept":100,"cut":false,"hidden":false,"merged":[[17,0,17,1],[18,0,18,1],[19,0,19,1],[20,0,20,1],[13,0,13,1],[8,0,8,1],[9,0,9,1],[12,0,12,1],[10,0,10,1],[11,0,11,1],[14,0,14,1],[15,0,15,1],[16,0,16,1],[7,0,7,1],[4,44,4,45],[4,32,4,33],[4,34,4,35],[4,36,4,37],[4,38,4,39],[4,40,4,41],[4,42,4,43],[4,20,4,21],[4,14,4,15],[4,16,4,17],[4,18,4,19],[4,2,4,3],[4,4,4,5],[4,6,4,7],[4,8,4,9],[4,62,4,63],[6,0,6,1],[4,52,4,53],[4,54,4,55],[4,30,4,31],[4,58,4,59],[4,60,4,61],[4,22,4,23],[4,24,4,25],[4,26,4,27],[4,28,4,29],[4,56,4,57],[4,46,4,47],[4,48,4,49],[4,50,4,51],[4,12,4,13],[4,10,4,11],[1,42,1,46],[3,32,3,33],[3,34,3,35],[3,36,3,37],[3,50,3,51],[3,48,3,49],[3,26,3,27],[3,28,3,29],[3,22,3,23],[3,24,3,25],[3,38,3,39],[3,40,3,41],[3,42,3,43],[3,44,3,45],[3,46,3,47],[3,30,3,31],[1,47,1,49],[1,55,1,59],[1,60,1,62],[3,2,3,3],[3,4,3,5],[3,6,3,7],[3,8,3,9],[3,10,3,11],[3,12,3,13],[1,3,1,7],[1,8,1,10],[1,16,1,20],[1,21,1,23],[1,29,1,33],[1,34,1,36],[3,14,3,15],[3,62,3,63],[3,52,3,53],[3,54,3,55],[3,56,3,57],[3,58,3,59],[3,60,3,61],[3,16,3,17],[3,18,3,19],[3,20,3,21],[26,0,26,1],[27,0,27,1],[28,0,28,1],[29,0,29,1],[30,0,30,1],[21,0,21,1],[22,0,22,1],[23,0,23,1],[24,0,24,1],[25,0,25,1],[36,0,36,1],[37,0,37,1],[38,0,38,1],[39,0,39,1],[40,0,40,1],[31,0,31,1],[32,0,32,1],[33,0,33,1],[34,0,34,1],[35,0,35,1],[46,0,46,1],[47,0,47,1],[48,0,48,1],[49,0,49,1],[50,0,50,1],[41,0,41,1],[42,0,42,1],[43,0,43,1],[44,0,44,1],[45,0,45,1],[56,0,56,1],[57,0,57,1],[58,0,58,1],[59,0,59,1],[60,0,60,1],[51,0,51,1],[52,0,52,1],[53,0,53,1],[54,0,54,1],[55,0,55,1],[66,0,66,1],[67,0,67,1],[68,0,68,1],[69,0,69,1],[70,0,70,1],[61,0,61,1],[62,0,62,1],[63,0,63,1],[64,0,64,1],[65,0,65,1],[76,0,76,1],[77,0,77,1],[78,0,78,1],[79,0,79,1],[80,0,80,1],[71,0,71,1],[72,0,72,1],[73,0,73,1],[74,0,74,1],[75,0,75,1],[86,0,86,1],[87,0,87,1],[88,0,88,1],[89,0,89,1],[90,0,90,1],[81,0,81,1],[82,0,82,1],[83,0,83,1],[84,0,84,1],[85,0,85,1],[96,0,96,1],[97,0,97,1],[98,0,98,1],[99,0,99,1],[91,0,91,1],[92,0,92,1],[93,0,93,1],[94,0,94,1],[95,0,95,1]]}
[23,{"$f":"C5","v":"2014-10-01"}]
[null,null,null,{"$f":"IF(An!$Q$4=\"\",\"\",An!$Q$4)","v":""},null,null,null,null,{"$f":"C5","v":"2014-10-01"},null,null,null,null,"ACCEUIL",null,null,{"$f":"IF(An!$Q$4=\"\",\"\",An!$Q$4)","v":""},null,null,null,null,{"$f":"C5","v":"2014-10-01"},null,null,null,null,"ACCEUIL",null,null,{"$f":"IF(An!$Q$4=\"\",\"\",An!$Q$4)","v":""},null,null,null,null,{"$f":"C5","v":"2014-10-01"},null,null,null,null,"ACCEUIL",null,null,{"$f":"IF(An!$Q$4=\"\",\"\",An!$Q$4)","v":""},null,null,null,null,{"$f":"C5","v":"2014-10-01"},null,null,null,null,"ACCEUIL",null,null,{"$f":"IF(An!$Q$4=\"\",\"\",An!$Q$4)","v":""},null,null,null,null,{"$f":"C5","v":"2014-10-01"},null,null,"ACCEUIL"]
[]
[null,null,{"$f":"IF(C5=\"\",\"\",IF(LOOKUP(C5,Fériés)=C5,\"\",CHOOSE(WEEKDAY(C5,1),\"Dimanche\",\"Lundi\",\"Mardi\",\"Mercredi\",\"Jeudi\",\"Vendredi\",\"Samedi\")))","v":"Mercredi"},null,"Jeudi",null,"Vendredi",null,"Samedi",null,"Dimanche",null,"Lundi",null,"Mardi",null,"Mercredi",null,{"$f":"IF(S5=\"\",\"\",IF(LOOKUP(S5,Fériés)=S5,\"\",CHOOSE(WEEKDAY(S5,1),\"Dimanche\",\"Lundi\",\"Mardi\",\"Mercredi\",\"Jeudi\",\"Vendredi\",\"Samedi\")))","v":"Jeudi"},null,"Vendredi",null,"Samedi",null,"Dimanche",null,"Lundi",null,"Mardi",null,"Mercredi",null,{"$f":"IF(AG5=\"\",\"\",IF(LOOKUP(AG5,Fériés)=AG5,\"\",CHOOSE(WEEKDAY(AG5,1),\"Dimanche\",\"Lundi\",\"Mardi\",\"Mercredi\",\"Jeudi\",\"Vendredi\",\"Samedi\")))","v":"Jeudi"},null,{"$f":"IF(AI5=\"\",\"\",IF(LOOKUP(AI5,Fériés)=AI5,\"\",CHOOSE(WEEKDAY(AI5,1),\"Dimanche\",\"Lundi\",\"Mardi\",\"Mercredi\",\"Jeudi\",\"Vendredi\",\"Samedi\")))","v":"Vendredi"},null,"Samedi",null,"Dimanche",null,"Lundi",null,"Mardi",null,"Mercredi",null,"Jeudi",null,{"$f":"IF(AW5=\"\",\"\",IF(LOOKUP(AW5,Fériés)=AW5,\"\",CHOOSE(WEEKDAY(AW5,1),\"Dimanche\",\"Lundi\",\"Mardi\",\"Mercredi\",\"Jeudi\",\"Vendredi\",\"Samedi\")))","v":"Vendredi"},null,{"$f":"IF(AY5=\"\",\"\",IF(LOOKUP(AY5,Fériés)=AY5,\"\",CHOOSE(WEEKDAY(AY5,1),\"Dimanche\",\"Lundi\",\"Mardi\",\"Mercredi\",\"Jeudi\",\"Vendredi\",\"Samedi\")))","v":"Samedi"},null,"Dimanche",null,"Lundi",null,"Mardi",null,"Mercredi",null,"Jeudi",null,"Vendredi"]
[null,null,{"$f":"DATE(Année,10,1)","v":"2014-10-01"},null,{"$f":"IF(C5=\"\",\"\",IF(MONTH(C5+1)<>MONTH(C5),\"\",C5+1))","v":"2014-10-02"},null,{"$f":"IF(E5=\"\",\"\",IF(MONTH(E5+1)<>MONTH(E5),\"\",E5+1))","v":"2014-10-03"},null,{"$f":"IF(G5=\"\",\"\",IF(MONTH(G5+1)<>MONTH(G5),\"\",G5+1))","v":"2014-10-04"},null,{"$f":"IF(I5=\"\",\"\",IF(MONTH(I5+1)<>MONTH(I5),\"\",I5+1))","v":"2014-10-05"},null,{"$f":"IF(K5=\"\",\"\",IF(MONTH(K5+1)<>MONTH(K5),\"\",K5+1))","v":"2014-10-06"},null,{"$f":"IF(M5=\"\",\"\",IF(MONTH(M5+1)<>MONTH(M5),\"\",M5+1))","v":"2014-10-07"},null,{"$f":"IF(O5=\"\",\"\",IF(MONTH(O5+1)<>MONTH(O5),\"\",O5+1))","v":"2014-10-08"},null,{"$f":"IF(Q5=\"\",\"\",IF(MONTH(Q5+1)<>MONTH(Q5),\"\",Q5+1))","v":"2014-10-09"},null,{"$f":"IF(S5=\"\",\"\",IF(MONTH(S5+1)<>MONTH(S5),\"\",S5+1))","v":"2014-10-10"},null,{"$f":"IF(U5=\"\",\"\",IF(MONTH(U5+1)<>MONTH(U5),\"\",U5+1))","v":"2014-10-11"},null,{"$f":"IF(W5=\"\",\"\",IF(MONTH(W5+1)<>MONTH(W5),\"\",W5+1))","v":"2014-10-12"},null,{"$f":"IF(Y5=\"\",\"\",IF(MONTH(Y5+1)<>MONTH(Y5),\"\",Y5+1))","v":"2014-10-13"},null,{"$f":"IF(AA5=\"\",\"\",IF(MONTH(AA5+1)<>MONTH(AA5),\"\",AA5+1))","v":"2014-10-14"},null,{"$f":"IF(AC5=\"\",\"\",IF(MONTH(AC5+1)<>MONTH(AC5),\"\",AC5+1))","v":"2014-10-15"},null,{"$f":"IF(AE5=\"\",\"\",IF(MONTH(AE5+1)<>MONTH(AE5),\"\",AE5+1))","v":"2014-10-16"},null,{"$f":"IF(AG5=\"\",\"\",IF(MONTH(AG5+1)<>MONTH(AG5),\"\",AG5+1))","v":"2014-10-17"},null,{"$f":"IF(AI5=\"\",\"\",IF(MONTH(AI5+1)<>MONTH(AI5),\"\",AI5+1))","v":"2014-10-18"},null,{"$f":"IF(AK5=\"\",\"\",IF(MONTH(AK5+1)<>MONTH(AK5),\"\",AK5+1))","v":"2014-10-19"},null,{"$f":"IF(AM5=\"\",\"\",IF(MONTH(AM5+1)<>MONTH(AM5),\"\",AM5+1))","v":"2014-10-20"},null,{"$f":"IF(AO5=\"\",\"\",IF(MONTH(AO5+1)<>MONTH(AO5),\"\",AO5+1))","v":"2014-10-21"},null,{"$f":"IF(AQ5=\"\",\"\",IF(MONTH(AQ5+1)<>MONTH(AQ5),\"\",AQ5+1))","v":"2014-10-22"},null,{"$f":"IF(AS5=\"\",\"\",IF(MONTH(AS5+1)<>MONTH(AS5),\"\",AS5+1))","v":"2014-10-23"},null,{"$f":"IF(AU5=\"\",\"\",IF(MONTH(AU5+1)<>MONTH(AU5),\"\",AU5+1))","v":"2014-10-24"},null,{"$f":"IF(AW5=\"\",\"\",IF(MONTH(AW5+1)<>MONTH(AW5),\"\",AW5+1))","v":"2014-10-25"},null,{"$f":"IF(AY5=\"\",\"\",IF(MONTH(AY5+1)<>MONTH(AY5),\"\",AY5+1))","v":"2014-10-26"},null,{"$f":"IF(BA5=\"\",\"\",IF(MONTH(BA5+1)<>MONTH(BA5),\"\",BA5+1))","v":"2014-10-27"},null,{"$f":"IF(BC5=\"\",\"\",IF(MONTH(BC5+1)<>MONTH(BC5),\"\",BC5+1))","v":"2014-10-28"},null,{"$f":"IF(BE5=\"\",\"\",IF(MONTH(BE5+1)<>MONTH(BE5),\"\",BE5+1))","v":"2014-10-29"},null,{"$f":"IF(BG5=\"\",\"\",IF(MONTH(BG5+1)<>MONTH(BG5),\"\",BG5+1))","v":"2014-10-30"},null,{"$f":"IF(BI5=\"\",\"\",IF(MONTH(BI5+1)<>MONTH(BI5),\"\",BI5+1))","v":"2014-10-31"}]
[null,null,"Matin","Après midi","Matin","Après midi","Matin","Après midi","Matin","Après midi","Matin","Après midi","Matin","Après midi","Matin","Après midi","Matin","Après midi","Matin","Après midi","Matin","Après midi","Matin","Après midi","Matin","Après midi","Matin","Après midi","Matin","Après midi","Matin","Après midi","Matin","Après midi","Matin","Après midi","Matin","Après midi","Matin","Après midi","Matin","Après midi","Matin","Après midi","Matin","Après midi","Matin","Après midi","Matin","Après midi","Matin","Après midi","Matin","Après midi","Matin","Après midi","Matin","Après midi",{"$f":"IF(BG5=\"\",\"\",\"Matin\")","v":"Matin"},{"$f":"IF(BG5=\"\",\"\",\"Apres midi\")","v":"Apres midi"},{"$f":"IF(BI5=\"\",\"\",\"Matin\")","v":"Matin"},{"$f":"IF(BI5=\"\",\"\",\"Apres midi\")","v":"Apres midi"},{"$f":"IF(BK5=\"\",\"\",\"Matin\")","v":"Matin"},{"$f":"IF(BK5=\"\",\"\",\"Apres midi\")","v":"Apres midi"}]
[null,null,null,null,null,null,null,null,null,null,null,null,null,null,null,null,null,null,null,null,null,null,null,null,null,null,null,null,null,null,null,null,null,null,null,null,null,null,null,null,null,null,null,null,null,null,null,null,null,null,null,null,null,null,null,null,null,null,null,null,null,null,null,null,{"$f":"COUNTA(C7:BL7)/2","v":0}]
[null,null,null,null,null,null,null,null,null,null,null,null,null,null,null,null,null,null,null,null,null,null,null,null,null,null,null,null,null,null,null,null,null,null,null,null,null,null,null,null,null,null,null,null,null,null,null,null,null,null,null,null,null,null,null,null,null,null,null,null,null,null,null,null,{"$f":"COUNTA(C8:BL8)/2","v":0}]
[null,null,null,null,null,null,null,null,null,null,null,null,null,null,null,null,null,null,null,null,null,null,null,null,null,null,null,null,null,null,null,null,null,null,null,null,null,null,null,null,null,null,null,null,null,null,null,null,null,null,null,null,null,null,null,null,null,null,null,null,null,null,null,null,0]
[null,null,null,null,null,null,null,null,null,null,null,null,null,null,null,null,null,null,null,null,null,null,null,null,null,null,null,null,null,null,null,null,null,null,null,null,null,null,null,null,null,null,null,null,null,null,null,null,null,null,null,null,null,null,null,null,null,null,null,null,null,null,null,null,0]
[null,null,null,null,null,null,null,null,null,null,null,null,null,null,null,null,null,null,null,null,null,null,null,null,null,null,null,null,null,null,null,null,null,null,null,null,null,null,null,null,null,null,null,null,null,null,null,null,null,null,null,null,null,null,null,null,null,null,null,null,null,null,null,null,0]
[null,null,null,null,null,null,null,null,null,null,null,null,null,null,null,null,null,null,null,null,null,null,null,null,null,null,null,null,null,null,null,null,null,null,null,null,null,null,null,null,null,null,null,null,null,null,null,null,null,null,null,null,null,null,null,null,null,null,null,null,null,null,null,null,0]
[null,null,null,null,null,null,null,null,null,null,null,null,null,null,null,null,null,null,null,null,null,null,null,null,null,null,null,null,null,null,null,null,null,null,null,null,null,null,null,null,null,null,null,null,null,null,null,null,null,null,null,null,null,null,null,null,null,null,null,null,null,null,null,null,0]
[null,null,null,null,null,null,null,null,null,null,null,null,null,null,null,null,null,null,null,null,null,null,null,null,null,null,null,null,null,null,null,null,null,null,null,null,null,null,null,null,null,null,null,null,null,null,null,null,null,null,null,null,null,null,null,null,null,null,null,null,null,null,null,null,0]
[null,null,null,null,null,null,null,null,null,null,null,null,null,null,null,null,null,null,null,null,null,null,null,null,null,null,null,null,null,null,null,null,null,null,null,null,null,null,null,null,null,null,null,null,null,null,null,null,null,null,null,null,null,null,null,null,null,null,null,null,null,null,null,null,0]
[null,null,null,null,null,null,null,null,null,null,null,null,null,null,null,null,null,null,null,null,null,null,null,null,null,null,null,null,null,null,null,null,null,null,null,null,null,null,null,null,null,null,null,null,null,null,null,null,null,null,null,null,null,null,null,null,null,null,null,null,null,null,null,null,0]
[null,null,null,null,null,null,null,null,null,null,null,null,null,null,null,null,null,null,null,null,null,null,null,null,null,null,null,null,null,null,null,null,null,null,null,null,null,null,null,null,null,null,null,null,null,null,null,null,null,null,null,null,null,null,null,null,null,null,null,null,null,null,null,null,0]
[null,null,null,null,null,null,null,null,null,null,null,null,null,null,null,null,null,null,null,null,null,null,null,null,null,null,null,null,null,null,null,null,null,null,null,null,null,null,null,null,null,null,null,null,null,null,null,null,null,null,null,null,null,null,null,null,null,null,null,null,null,null,null,null,0]
[null,null,null,null,null,null,null,null,null,null,null,null,null,null,null,null,null,null,null,null,null,null,null,null,null,null,null,null,null,null,null,null,null,null,null,null,null,null,null,null,null,null,null,null,null,null,null,null,null,null,null,null,null,null,null,null,null,null,null,null,null,null,null,null,0]
[null,null,null,null,null,null,null,null,null,null,null,null,null,null,null,null,null,null,null,null,null,null,null,null,null,null,null,null,null,null,null,null,null,null,null,null,null,null,null,null,null,null,null,null,null,null,null,null,null,null,null,null,null,null,null,null,null,null,null,null,null,null,null,null,0]
[null,null,null,null,null,null,null,null,null,null,null,null,null,null,null,null,null,null,null,null,null,null,null,null,null,null,null,null,null,null,null,null,null,null,null,null,null,null,null,null,null,null,null,null,null,null,null,null,null,null,null,null,null,null,null,null,null,null,null,null,null,null,null,null,0]
[null,null,null,null,null,null,null,null,null,null,null,null,null,null,null,null,null,null,null,null,null,null,null,null,null,null,null,null,null,null,null,null,null,null,null,null,null,null,null,null,null,null,null,null,null,null,null,null,null,null,null,null,null,null,null,null,null,null,null,null,null,null,null,null,0]
[null,null,null,null,null,null,null,null,null,null,null,null,null,null,null,null,null,null,null,null,null,null,null,null,null,null,null,null,null,null,null,null,null,null,null,null,null,null,null,null,null,null,null,null,null,null,null,null,null,null,null,null,null,null,null,null,null,null,null,null,null,null,null,null,0]
[null,null,null,null,null,null,null,null,null,null,null,null,null,null,null,null,null,null,null,null,null,null,null,null,null,null,null,null,null,null,null,null,null,null,null,null,null,null,null,null,null,null,null,null,null,null,null,null,null,null,null,null,null,null,null,null,null,null,null,null,null,null,null,null,0]
[null,null,null,null,null,null,null,null,null,null,null,null,null,null,null,null,null,null,null,null,null,null,null,null,null,null,null,null,null,null,null,null,null,null,null,null,null,null,null,null,null,null,null,null,null,null,null,null,null,null,null,null,null,null,null,null,null,null,null,null,null,null,null,null,0]
[null,null,null,null,null,null,null,null,null,null,null,null,null,null,null,null,null,null,null,null,null,null,null,null,null,null,null,null,null,null,null,null,null,null,null,null,null,null,null,null,null,null,null,null,null,null,null,null,null,null,null,null,null,null,null,null,null,null,null,null,null,null,null,null,0]
[null,null,null,null,null,null,null,null,null,null,null,null,null,null,null,null,null,null,null,null,null,null,null,null,null,null,null,null,null,null,null,null,null,null,null,null,null,null,null,null,null,null,null,null,null,null,null,null,null,null,null,null,null,null,null,null,null,null,null,null,null,null,null,null,0]
[null,null,null,null,null,null,null,null,null,null,null,null,null,null,null,null,null,null,null,null,null,null,null,null,null,null,null,null,null,null,null,null,null,null,null,null,null,null,null,null,null,null,null,null,null,null,null,null,null,null,null,null,null,null,null,null,null,null,null,null,null,null,null,null,0]
[null,null,null,null,null,null,null,null,null,null,null,null,null,null,null,null,null,null,null,null,null,null,null,null,null,null,null,null,null,null,null,null,null,null,null,null,null,null,null,null,null,null,null,null,null,null,null,null,null,null,null,null,null,null,null,null,null,null,null,null,null,null,null,null,0]
[null,null,null,null,null,null,null,null,null,null,null,null,null,null,null,null,null,null,null,null,null,null,null,null,null,null,null,null,null,null,null,null,null,null,null,null,null,null,null,null,null,null,null,null,null,null,null,null,null,null,null,null,null,null,null,null,null,null,null,null,null,null,null,null,0]
[null,null,null,null,null,null,null,null,null,null,null,null,null,null,null,null,null,null,null,null,null,null,null,null,null,null,null,null,null,null,null,null,null,null,null,null,null,null,null,null,null,null,null,null,null,null,null,null,null,null,null,null,null,null,null,null,null,null,null,null,null,null,null,null,0]
[null,null,null,null,null,null,null,null,null,null,null,null,null,null,null,null,null,null,null,null,null,null,null,null,null,null,null,null,null,null,null,null,null,null,null,null,null,null,null,null,null,null,null,null,null,null,null,null,null,null,null,null,null,null,null,null,null,null,null,null,null,null,null,null,0]
[null,null,null,null,null,null,null,null,null,null,null,null,null,null,null,null,null,null,null,null,null,null,null,null,null,null,null,null,null,null,null,null,null,null,null,null,null,null,null,null,null,null,null,null,null,null,null,null,null,null,null,null,null,null,null,null,null,null,null,null,null,null,null,null,0]
[null,null,null,null,null,null,null,null,null,null,null,null,null,null,null,null,null,null,null,null,null,null,null,null,null,null,null,null,null,null,null,null,null,null,null,null,null,null,null,null,null,null,null,null,null,null,null,null,null,null,null,null,null,null,null,null,null,null,null,null,null,null,null,null,0]
[null,null,null,null,null,null,null,null,null,null,null,null,null,null,null,null,null,null,null,null,null,null,null,null,null,null,null,null,null,null,null,null,null,null,null,null,null,null,null,null,null,null,null,null,null,null,null,null,null,null,null,null,null,null,null,null,null,null,null,null,null,null,null,null,0]
[null,null,null,null,null,null,null,null,null,null,null,null,null,null,null,null,null,null,null,null,null,null,null,null,null,null,null,null,null,null,null,null,null,null,null,null,null,null,null,null,null,null,null,null,null,null,null,null,null,null,null,null,null,null,null,null,null,null,null,null,null,null,null,null,0]
[null,null,null,null,null,null,null,null,null,null,null,null,null,null,null,null,null,null,null,null,null,null,null,null,null,null,null,null,null,null,null,null,null,null,null,null,null,null,null,null,null,null,null,null,null,null,null,null,null,null,null,null,null,null,null,null,null,null,null,null,null,null,null,null,0]
[null,null,null,null,null,null,null,null,null,null,null,null,null,null,null,null,null,null,null,null,null,null,null,null,null,null,null,null,null,null,null,null,null,null,null,null,null,null,null,null,null,null,null,null,null,null,null,null,null,null,null,null,null,null,null,null,null,null,null,null,null,null,null,null,0]
[null,null,null,null,null,null,null,null,null,null,null,null,null,null,null,null,null,null,null,null,null,null,null,null,null,null,null,null,null,null,null,null,null,null,null,null,null,null,null,null,null,null,null,null,null,null,null,null,null,null,null,null,null,null,null,null,null,null,null,null,null,null,null,null,0]
[null,null,null,null,null,null,null,null,null,null,null,null,null,null,null,null,null,null,null,null,null,null,null,null,null,null,null,null,null,null,null,null,null,null,null,null,null,null,null,null,null,null,null,null,null,null,null,null,null,null,null,null,null,null,null,null,null,null,null,null,null,null,null,null,0]
[null,null,null,null,null,null,null,null,null,null,null,null,null,null,null,null,null,null,null,null,null,null,null,null,null,null,null,null,null,null,null,null,null,null,null,null,null,null,null,null,null,null,null,null,null,null,null,null,null,null,null,null,null,null,null,null,null,null,null,null,null,null,null,null,0]
[null,null,null,null,null,null,null,null,null,null,null,null,null,null,null,null,null,null,null,null,null,null,null,null,null,null,null,null,null,null,null,null,null,null,null,null,null,null,null,null,null,null,null,null,null,null,null,null,null,null,null,null,null,null,null,null,null,null,null,null,null,null,null,null,0]
[null,null,null,null,null,null,null,null,null,null,null,null,null,null,null,null,null,null,null,null,null,null,null,null,null,null,null,null,null,null,null,null,null,null,null,null,null,null,null,null,null,null,null,null,null,null,null,null,null,null,null,null,null,null,null,null,null,null,null,null,null,null,null,null,0]
[null,null,null,null,null,null,null,null,null,null,null,null,null,null,null,null,null,null,null,null,null,null,null,null,null,null,null,null,null,null,null,null,null,null,null,null,null,null,null,null,null,null,null,null,null,null,null,null,null,null,null,null,null,null,null,null,null,null,null,null,null,null,null,null,0]
[null,null,null,null,null,null,null,null,null,null,null,null,null,null,null,null,null,null,null,null,null,null,null,null,null,null,null,null,null,null,null,null,null,null,null,null,null,null,null,null,null,null,null,null,null,null,null,null,null,null,null,null,null,null,null,null,null,null,null,null,null,null,null,null,0]
[null,null,null,null,null,null,null,null,null,null,null,null,null,null,null,null,null,null,null,null,null,null,null,null,null,null,null,null,null,null,null,null,null,null,null,null,null,null,null,null,null,null,null,null,null,null,null,null,null,null,null,null,null,null,null,null,null,null,null,null,null,null,null,null,0]
[null,null,null,null,null,null,null,null,null,null,null,null,null,null,null,null,null,null,null,null,null,null,null,null,null,null,null,null,null,null,null,null,null,null,null,null,null,null,null,null,null,null,null,null,null,null,null,null,null,null,null,null,null,null,null,null,null,null,null,null,null,null,null,null,0]
[null,null,null,null,null,null,null,null,null,null,null,null,null,null,null,null,null,null,null,null,null,null,null,null,null,null,null,null,null,null,null,null,null,null,null,null,null,null,null,null,null,null,null,null,null,null,null,null,null,null,null,null,null,null,null,null,null,null,null,null,null,null,null,null,0]
[null,null,null,null,null,null,null,null,null,null,null,null,null,null,null,null,null,null,null,null,null,null,null,null,null,null,null,null,null,null,null,null,null,null,null,null,null,null,null,null,null,null,null,null,null,null,null,null,null,null,null,null,null,null,null,null,null,null,null,null,null,null,null,null,0]
[null,null,null,null,null,null,null,null,null,null,null,null,null,null,null,null,null,null,null,null,null,null,null,null,null,null,null,null,null,null,null,null,null,null,null,null,null,null,null,null,null,null,null,null,null,null,null,null,null,null,null,null,null,null,null,null,null,null,null,null,null,null,null,null,0]
[null,null,null,null,null,null,null,null,null,null,null,null,null,null,null,null,null,null,null,null,null,null,null,null,null,null,null,null,null,null,null,null,null,null,null,null,null,null,null,null,null,null,null,null,null,null,null,null,null,null,null,null,null,null,null,null,null,null,null,null,null,null,null,null,0]
[null,null,null,null,null,null,null,null,null,null,null,null,null,null,null,null,null,null,null,null,null,null,null,null,null,null,null,null,null,null,null,null,null,null,null,null,null,null,null,null,null,null,null,null,null,null,null,null,null,null,null,null,null,null,null,null,null,null,null,null,null,null,null,null,0]
[null,null,null,null,null,null,null,null,null,null,null,null,null,null,null,null,null,null,null,null,null,null,null,null,null,null,null,null,null,null,null,null,null,null,null,null,null,null,null,null,null,null,null,null,null,null,null,null,null,null,null,null,null,null,null,null,null,null,null,null,null,null,null,null,0]
[null,null,null,null,null,null,null,null,null,null,null,null,null,null,null,null,null,null,null,null,null,null,null,null,null,null,null,null,null,null,null,null,null,null,null,null,null,null,null,null,null,null,null,null,null,null,null,null,null,null,null,null,null,null,null,null,null,null,null,null,null,null,null,null,0]
[null,null,null,null,null,null,null,null,null,null,null,null,null,null,null,null,null,null,null,null,null,null,null,null,null,null,null,null,null,null,null,null,null,null,null,null,null,null,null,null,null,null,null,null,null,null,null,null,null,null,null,null,null,null,null,null,null,null,null,null,null,null,null,null,0]
[null,null,null,null,null,null,null,null,null,null,null,null,null,null,null,null,null,null,null,null,null,null,null,null,null,null,null,null,null,null,null,null,null,null,null,null,null,null,null,null,null,null,null,null,null,null,null,null,null,null,null,null,null,null,null,null,null,null,null,null,null,null,null,null,0]
[null,null,null,null,null,null,null,null,null,null,null,null,null,null,null,null,null,null,null,null,null,null,null,null,null,null,null,null,null,null,null,null,null,null,null,null,null,null,null,null,null,null,null,null,null,null,null,null,null,null,null,null,null,null,null,null,null,null,null,null,null,null,null,null,0]
[null,null,null,null,null,null,null,null,null,null,null,null,null,null,null,null,null,null,null,null,null,null,null,null,null,null,null,null,null,null,null,null,null,null,null,null,null,null,null,null,null,null,null,null,null,null,null,null,null,null,null,null,null,null,null,null,null,null,null,null,null,null,null,null,0]
[null,null,null,null,null,null,null,null,null,null,null,null,null,null,null,null,null,null,null,null,null,null,null,null,null,null,null,null,null,null,null,null,null,null,null,null,null,null,null,null,null,null,null,null,null,null,null,null,null,null,null,null,null,null,null,null,null,null,null,null,null,null,null,null,0]
[null,null,null,null,null,null,null,null,null,null,null,null,null,null,null,null,null,null,null,null,null,null,null,null,null,null,null,null,null,null,null,null,null,null,null,null,null,null,null,null,null,null,null,null,null,null,null,null,null,null,null,null,null,null,null,null,null,null,null,null,null,null,null,null,0]
[null,null,null,null,null,null,null,null,null,null,null,null,null,null,null,null,null,null,null,null,null,null,null,null,null,null,null,null,null,null,null,null,null,null,null,null,null,null,null,null,null,null,null,null,null,null,null,null,null,null,null,null,null,null,null,null,null,null,null,null,null,null,null,null,0]
[null,null,null,null,null,null,null,null,null,null,null,null,null,null,null,null,null,null,null,null,null,null,null,null,null,null,null,null,null,null,null,null,null,null,null,null,null,null,null,null,null,null,null,null,null,null,null,null,null,null,null,null,null,null,null,null,null,null,null,null,null,null,null,null,0]
[null,null,null,null,null,null,null,null,null,null,null,null,null,null,null,null,null,null,null,null,null,null,null,null,null,null,null,null,null,null,null,null,null,null,null,null,null,null,null,null,null,null,null,null,null,null,null,null,null,null,null,null,null,null,null,null,null,null,null,null,null,null,null,null,0]
[null,null,null,null,null,null,null,null,null,null,null,null,null,null,null,null,null,null,null,null,null,null,null,null,null,null,null,null,null,null,null,null,null,null,null,null,null,null,null,null,null,null,null,null,null,null,null,null,null,null,null,null,null,null,null,null,null,null,null,null,null,null,null,null,0]
[null,null,null,null,null,null,null,null,null,null,null,null,null,null,null,null,null,null,null,null,null,null,null,null,null,null,null,null,null,null,null,null,null,null,null,null,null,null,null,null,null,null,null,null,null,null,null,null,null,null,null,null,null,null,null,null,null,null,null,null,null,null,null,null,0]
[null,null,null,null,null,null,null,null,null,null,null,null,null,null,null,null,null,null,null,null,null,null,null,null,null,null,null,null,null,null,null,null,null,null,null,null,null,null,null,null,null,null,null,null,null,null,null,null,null,null,null,null,null,null,null,null,null,null,null,null,null,null,null,null,0]
[null,null,null,null,null,null,null,null,null,null,null,null,null,null,null,null,null,null,null,null,null,null,null,null,null,null,null,null,null,null,null,null,null,null,null,null,null,null,null,null,null,null,null,null,null,null,null,null,null,null,null,null,null,null,null,null,null,null,null,null,null,null,null,null,0]
[null,null,null,null,null,null,null,null,null,null,null,null,null,null,null,null,null,null,null,null,null,null,null,null,null,null,null,null,null,null,null,null,null,null,null,null,null,null,null,null,null,null,null,null,null,null,null,null,null,null,null,null,null,null,null,null,null,null,null,null,null,null,null,null,0]
[null,null,null,null,null,null,null,null,null,null,null,null,null,null,null,null,null,null,null,null,null,null,null,null,null,null,null,null,null,null,null,null,null,null,null,null,null,null,null,null,null,null,null,null,null,null,null,null,null,null,null,null,null,null,null,null,null,null,null,null,null,null,null,null,0]
[null,null,null,null,null,null,null,null,null,null,null,null,null,null,null,null,null,null,null,null,null,null,null,null,null,null,null,null,null,null,null,null,null,null,null,null,null,null,null,null,null,null,null,null,null,null,null,null,null,null,null,null,null,null,null,null,null,null,null,null,null,null,null,null,0]
[null,null,null,null,null,null,null,null,null,null,null,null,null,null,null,null,null,null,null,null,null,null,null,null,null,null,null,null,null,null,null,null,null,null,null,null,null,null,null,null,null,null,null,null,null,null,null,null,null,null,null,null,null,null,null,null,null,null,null,null,null,null,null,null,0]
[null,null,null,null,null,null,null,null,null,null,null,null,null,null,null,null,null,null,null,null,null,null,null,null,null,null,null,null,null,null,null,null,null,null,null,null,null,null,null,null,null,null,null,null,null,null,null,null,null,null,null,null,null,null,null,null,null,null,null,null,null,null,null,null,{"$f":"COUNTA(C72:BL72)/2","v":0}]
[null,null,null,null,null,null,null,null,null,null,null,null,null,null,null,null,null,null,null,null,null,null,null,null,null,null,null,null,null,null,null,null,null,null,null,null,null,null,null,null,null,null,null,null,null,null,null,null,null,null,null,null,null,null,null,null,null,null,null,null,null,null,null,null,0]
[null,null,null,null,null,null,null,null,null,null,null,null,null,null,null,null,null,null,null,null,null,null,null,null,null,null,null,null,null,null,null,null,null,null,null,null,null,null,null,null,null,null,null,null,null,null,null,null,null,null,null,null,null,null,null,null,null,null,null,null,null,null,null,null,0]
[null,null,null,null,null,null,null,null,null,null,null,null,null,null,null,null,null,null,null,null,null,null,null,null,null,null,null,null,null,null,null,null,null,null,null,null,null,null,null,null,null,null,null,null,null,null,null,null,null,null,null,null,null,null,null,null,null,null,null,null,null,null,null,null,0]
[null,null,null,null,null,null,null,null,null,null,null,null,null,null,null,null,null,null,null,null,null,null,null,null,null,null,null,null,null,null,null,null,null,null,null,null,null,null,null,null,null,null,null,null,null,null,null,null,null,null,null,null,null,null,null,null,null,null,null,null,null,null,null,null,0]
[null,null,null,null,null,null,null,null,null,null,null,null,null,null,null,null,null,null,null,null,null,null,null,null,null,null,null,null,null,null,null,null,null,null,null,null,null,null,null,null,null,null,null,null,null,null,null,null,null,null,null,null,null,null,null,null,null,null,null,null,null,null,null,null,0]
[null,null,null,null,null,null,null,null,null,null,null,null,null,null,null,null,null,null,null,null,null,null,null,null,null,null,null,null,null,null,null,null,null,null,null,null,null,null,null,null,null,null,null,null,null,null,null,null,null,null,null,null,null,null,null,null,null,null,null,null,null,null,null,null,0]
[null,null,null,null,null,null,null,null,null,null,null,null,null,null,null,null,null,null,null,null,null,null,null,null,null,null,null,null,null,null,null,null,null,null,null,null,null,null,null,null,null,null,null,null,null,null,null,null,null,null,null,null,null,null,null,null,null,null,null,null,null,null,null,null,0]
[null,null,null,null,null,null,null,null,null,null,null,null,null,null,null,null,null,null,null,null,null,null,null,null,null,null,null,null,null,null,null,null,null,null,null,null,null,null,null,null,null,null,null,null,null,null,null,null,null,null,null,null,null,null,null,null,null,null,null,null,null,null,null,null,0]
[null,null,null,null,null,null,null,null,null,null,null,null,null,null,null,null,null,null,null,null,null,null,null,null,null,null,null,null,null,null,null,null,null,null,null,null,null,null,null,null,null,null,null,null,null,null,null,null,null,null,null,null,null,null,null,null,null,null,null,null,null,null,null,null,0]
[null,null,null,null,null,null,null,null,null,null,null,null,null,null,null,null,null,null,null,null,null,null,null,null,null,null,null,null,null,null,null,null,null,null,null,null,null,null,null,null,null,null,null,null,null,null,null,null,null,null,null,null,null,null,null,null,null,null,null,null,null,null,null,null,0]
[null,null,null,null,null,null,null,null,null,null,null,null,null,null,null,null,null,null,null,null,null,null,null,null,null,null,null,null,null,null,null,null,null,null,null,null,null,null,null,null,null,null,null,null,null,null,null,null,null,null,null,null,null,null,null,null,null,null,null,null,null,null,null,null,0]
[null,null,null,null,null,null,null,null,null,null,null,null,null,null,null,null,null,null,null,null,null,null,null,null,null,null,null,null,null,null,null,null,null,null,null,null,null,null,null,null,null,null,null,null,null,null,null,null,null,null,null,null,null,null,null,null,null,null,null,null,null,null,null,null,0]
[null,null,null,null,null,null,null,null,null,null,null,null,null,null,null,null,null,null,null,null,null,null,null,null,null,null,null,null,null,null,null,null,null,null,null,null,null,null,null,null,null,null,null,null,null,null,null,null,null,null,null,null,null,null,null,null,null,null,null,null,null,null,null,null,0]
[null,null,null,null,null,null,null,null,null,null,null,null,null,null,null,null,null,null,null,null,null,null,null,null,null,null,null,null,null,null,null,null,null,null,null,null,null,null,null,null,null,null,null,null,null,null,null,null,null,null,null,null,null,null,null,null,null,null,null,null,null,null,null,null,0]
[null,null,null,null,null,null,null,null,null,null,null,null,null,null,null,null,null,null,null,null,null,null,null,null,null,null,null,null,null,null,null,null,null,null,null,null,null,null,null,null,null,null,null,null,null,null,null,null,null,null,null,null,null,null,null,null,null,null,null,null,null,null,null,null,0]
[null,null,null,null,null,null,null,null,null,null,null,null,null,null,null,null,null,null,null,null,null,null,null,null,null,null,null,null,null,null,null,null,null,null,null,null,null,null,null,null,null,null,null,null,null,null,null,null,null,null,null,null,null,null,null,null,null,null,null,null,null,null,null,null,0]
[null,null,null,null,null,null,null,null,null,null,null,null,null,null,null,null,null,null,null,null,null,null,null,null,null,null,null,null,null,null,null,null,null,null,null,null,null,null,null,null,null,null,null,null,null,null,null,null,null,null,null,null,null,null,null,null,null,null,null,null,null,null,null,null,0]
[null,null,null,null,null,null,null,null,null,null,null,null,null,null,null,null,null,null,null,null,null,null,null,null,null,null,null,null,null,null,null,null,null,null,null,null,null,null,null,null,null,null,null,null,null,null,null,null,null,null,null,null,null,null,null,null,null,null,null,null,null,null,null,null,0]
[null,null,null,null,null,null,null,null,null,null,null,null,null,null,null,null,null,null,null,null,null,null,null,null,null,null,null,null,null,null,null,null,null,null,null,null,null,null,null,null,null,null,null,null,null,null,null,null,null,null,null,null,null,null,null,null,null,null,null,null,null,null,null,null,0]
[null,null,null,null,null,null,null,null,null,null,null,null,null,null,null,null,null,null,null,null,null,null,null,null,null,null,null,null,null,null,null,null,null,null,null,null,null,null,null,null,null,null,null,null,null,null,null,null,null,null,null,null,null,null,null,null,null,null,null,null,null,null,null,null,0]
[null,null,null,null,null,null,null,null,null,null,null,null,null,null,null,null,null,null,null,null,null,null,null,null,null,null,null,null,null,null,null,null,null,null,null,null,null,null,null,null,null,null,null,null,null,null,null,null,null,null,null,null,null,null,null,null,null,null,null,null,null,null,null,null,0]
[null,null,null,null,null,null,null,null,null,null,null,null,null,null,null,null,null,null,null,null,null,null,null,null,null,null,null,null,null,null,null,null,null,null,null,null,null,null,null,null,null,null,null,null,null,null,null,null,null,null,null,null,null,null,null,null,null,null,null,null,null,null,null,null,0]
[null,null,null,null,null,null,null,null,null,null,null,null,null,null,null,null,null,null,null,null,null,null,null,null,null,null,null,null,null,null,null,null,null,null,null,null,null,null,null,null,null,null,null,null,null,null,null,null,null,null,null,null,null,null,null,null,null,null,null,null,null,null,null,null,0]
[null,null,null,null,null,null,null,null,null,null,null,null,null,null,null,null,null,null,null,null,null,null,null,null,null,null,null,null,null,null,null,null,null,null,null,null,null,null,null,null,null,null,null,null,null,null,null,null,null,null,null,null,null,null,null,null,null,null,null,null,null,null,null,null,0]
[null,null,null,null,null,null,null,null,null,null,null,null,null,null,null,null,null,null,null,null,null,null,null,null,null,null,null,null,null,null,null,null,null,null,null,null,null,null,null,null,null,null,null,null,null,null,null,null,null,null,null,null,null,null,null,null,null,null,null,null,null,null,null,null,0]
[null,null,null,null,null,null,null,null,null,null,null,null,null,null,null,null,null,null,null,null,null,null,null,null,null,null,null,null,null,null,null,null,null,null,null,null,null,null,null,null,null,null,null,null,null,null,null,null,null,null,null,null,null,null,null,null,null,null,null,null,null,null,null,null,0]
[null,null,null,null,null,null,null,null,null,null,null,null,null,null,null,null,null,null,null,null,null,null,null,null,null,null,null,null,null,null,null,null,null,null,null,null,null,null,null,null,null,null,null,null,null,null,null,null,null,null,null,null,null,null,null,null,null,null,null,null,null,null,null,null,0]
[null,null,null,null,null,null,null,null,null,null,null,null,null,null,null,null,null,null,null,null,null,null,null,null,null,null,null,null,null,null,null,null,null,null,null,null,null,null,null,null,null,null,null,null,null,null,null,null,null,null,null,null,null,null,null,null,null,null,null,null,null,null,null,null,0]

{"sheet":"Novembre","index":12,"n_rows":100,"n_cols":65,"rows_kept":100,"cut":false,"hidden":false,"merged":[[17,0,17,1],[18,0,18,1],[19,0,19,1],[20,0,20,1],[13,0,13,1],[1,21,1,24],[12,0,12,1],[10,0,10,1],[11,0,11,1],[9,0,9,1],[14,0,14,1],[15,0,15,1],[16,0,16,1],[3,16,3,17],[3,18,3,19],[3,20,3,21],[3,22,3,23],[4,2,4,3],[4,4,4,5],[4,6,4,7],[4,8,4,9],[4,10,4,11],[4,12,4,13],[4,14,4,15],[1,54,1,58],[1,59,1,62],[8,0,8,1],[3,26,3,27],[4,62,4,63],[6,0,6,1],[7,0,7,1],[4,44,4,45],[4,46,4,47],[4,48,4,49],[4,50,4,51],[4,52,4,53],[4,54,4,55],[4,32,4,33],[4,56,4,57],[4,58,4,59],[4,60,4,61],[4,42,4,43],[4,20,4,21],[4,22,4,23],[4,24,4,25],[4,26,4,27],[4,28,4,29],[3,62,3,63],[4,16,4,17],[4,18,4,19],[3,50,3,51],[3,52,3,53],[3,54,3,55],[3,56,3,57],[3,38,3,39],[3,40,3,41],[3,60,3,61],[4,30,4,31],[4,34,4,35],[4,36,4,37],[4,38,4,39],[4,40,4,41],[3,58,3,59],[3,14,3,15],[3,48,3,49],[3,24,3,25],[3,42,3,43],[3,44,3,45],[3,46,3,47],[3,28,3,29],[1,42,1,46],[3,2,3,3],[3,4,3,5],[3,6,3,7],[3,8,3,9],[3,10,3,11],[3,12,3,13],[1,3,1,7],[1,8,1,10],[1,16,1,20],[1,29,1,33],[1,34,1,37],[3,30,3,31],[3,32,3,33],[3,34,3,35],[3,36,3,37],[1,47,1,50],[26,0,26,1],[27,0,27,1],[28,0,28,1],[29,0,29,1],[30,0,30,1],[21,0,21,1],[22,0,22,1],[23,0,23,1],[24,0,24,1],[25,0,25,1],[36,0,36,1],[37,0,37,1],[38,0,38,1],[39,0,39,1],[40,0,40,1],[31,0,31,1],[32,0,32,1],[33,0,33,1],[34,0,34,1],[35,0,35,1],[46,0,46,1],[47,0,47,1],[48,0,48,1],[49,0,49,1],[50,0,50,1],[41,0,41,1],[42,0,42,1],[43,0,43,1],[44,0,44,1],[45,0,45,1],[56,0,56,1],[57,0,57,1],[58,0,58,1],[59,0,59,1],[60,0,60,1],[51,0,51,1],[52,0,52,1],[53,0,53,1],[54,0,54,1],[55,0,55,1],[66,0,66,1],[67,0,67,1],[68,0,68,1],[69,0,69,1],[70,0,70,1],[61,0,61,1],[62,0,62,1],[63,0,63,1],[64,0,64,1],[65,0,65,1],[76,0,76,1],[77,0,77,1],[78,0,78,1],[79,0,79,1],[80,0,80,1],[71,0,71,1],[72,0,72,1],[73,0,73,1],[74,0,74,1],[75,0,75,1],[86,0,86,1],[87,0,87,1],[88,0,88,1],[89,0,89,1],[90,0,90,1],[81,0,81,1],[82,0,82,1],[83,0,83,1],[84,0,84,1],[85,0,85,1],[96,0,96,1],[97,0,97,1],[98,0,98,1],[99,0,99,1],[91,0,91,1],[92,0,92,1],[93,0,93,1],[94,0,94,1],[95,0,95,1]]}
[20,{"$f":"C5","v":"2014-11-01"}]
[null,null,null,{"$f":"IF(An!$Q$4=\"\",\"\",An!$Q$4)","v":""},null,null,null,null,{"$f":"C5","v":"2014-11-01"},null,null,null,null,"ACCEUIL",null,null,{"$f":"IF(An!$Q$4=\"\",\"\",An!$Q$4)","v":""},null,null,null,null,{"$f":"C5","v":"2014-11-01"},null,null,null,null,"ACCEUIL",null,null,{"$f":"IF(An!$Q$4=\"\",\"\",An!$Q$4)","v":""},null,null,null,null,{"$f":"C5","v":"2014-11-01"},null,null,null,null,"ACCEUIL",null,null,{"$f":"IF(An!$Q$4=\"\",\"\",An!$Q$4)","v":""},null,null,null,null,{"$f":"C5","v":"2014-11-01"},null,null,null,null,"ACCEUIL",null,{"$f":"IF(An!$Q$4=\"\",\"\",An!$Q$4)","v":""},null,null,null,null,{"$f":"C5","v":"2014-11-01"},null,null,null,"ACCEUIL"]
[]
[null,null,{"$f":"IF(C5=\"\",\"\",IF(LOOKUP(C5,Fériés)=C5,CHOOSE(WEEKDAY(C5,1),\"Dimanche\",\"Lundi\",\"Mardi\",\"Mercredi\",\"Jeudi\",\"Vendredi\",\"Samedi\",\"\")))","v":"Samedi"},null,{"$f":"IF(E5=\"\",\"\",IF(LOOKUP(E5,Fériés)=E5,\"\",CHOOSE(WEEKDAY(E5,1),\"Dimanche\",\"Lundi\",\"Mardi\",\"Mercredi\",\"Jeudi\",\"Vendredi\",\"Samedi\")))","v":"Dimanche"},null,"Lundi",null,"Mardi",null,"Mercredi",null,"Jeudi",null,"Vendredi",null,"Samedi",null,{"$f":"IF(S5=\"\",\"\",IF(LOOKUP(S5,Fériés)=S5,\"\",CHOOSE(WEEKDAY(S5,1),\"Dimanche\",\"Lundi\",\"Mardi\",\"Mercredi\",\"Jeudi\",\"Vendredi\",\"Samedi\")))","v":"Dimanche"},null,"Lundi",null,{"$f":"IF(W5=\"\",\"\",IF(LOOKUP(W5,Fériés)=W5,CHOOSE(WEEKDAY(W5,1),\"Dimanche\",\"Lundi\",\"Mardi\",\"Mercredi\",\"Jeudi\",\"Vendredi\",\"Samedi\",\"\")))","v":"Mardi"},null,"Mercredi",null,"Jeudi",null,"Vendredi",null,"Samedi",null,{"$f":"IF(AG5=\"\",\"\",IF(LOOKUP(AG5,Fériés)=AG5,\"\",CHOOSE(WEEKDAY(AG5,1),\"Dimanche\",\"Lundi\",\"Mardi\",\"Mercredi\",\"Jeudi\",\"Vendredi\",\"Samedi\")))","v":"Dimanche"},null,{"$f":"IF(AI5=\"\",\"\",IF(LOOKUP(AI5,Fériés)=AI5,\"\",CHOOSE(WEEKDAY(AI5,1),\"Dimanche\",\"Lundi\",\"Mardi\",\"Mercredi\",\"Jeudi\",\"Vendredi\",\"Samedi\")))","v":"Lundi"},null,"Mardi",null,"Mercredi",null,"Jeudi",null,"Vendredi",null,"Samedi",null,"Dimanche",null,{"$f":"IF(AW5=\"\",\"\",IF(LOOKUP(AW5,Fériés)=AW5,\"\",CHOOSE(WEEKDAY(AW5,1),\"Dimanche\",\"Lundi\",\"Mardi\",\"Mercredi\",\"Jeudi\",\"Vendredi\",\"Samedi\")))","v":"Lundi"},null,{"$f":"IF(AY5=\"\",\"\",IF(LOOKUP(AY5,Fériés)=AY5,\"\",CHOOSE(WEEKDAY(AY5,1),\"Dimanche\",\"Lundi\",\"Mardi\",\"Mercredi\",\"Jeudi\",\"Vendredi\",\"Samedi\")))","v":"Mardi"},null,"Mercredi",null,"Jeudi",null,"Vendredi",null,"Samedi",null,"Dimanche",null,""]
[null,null,{"$f":"DATE(Année,11,1)","v":"2014-11-01"},null,{"$f":"IF(C5=\"\",\"\",IF(MONTH(C5+1)<>MONTH(C5),\"\",C5+1))","v":"2014-11-02"},null,{"$f":"IF(E5=\"\",\"\",IF(MONTH(E5+1)<>MONTH(E5),\"\",E5+1))","v":"2014-11-03"},null,{"$f":"IF(G5=\"\",\"\",IF(MONTH(G5+1)<>MONTH(G5),\"\",G5+1))","v":"2014-11-04"},null,{"$f":"IF(I5=\"\",\"\",IF(MONTH(I5+1)<>MONTH(I5),\"\",I5+1))","v":"2014-11-05"},null,{"$f":"IF(K5=\"\",\"\",IF(MONTH(K5+1)<>MONTH(K5),\"\",K5+1))","v":"2014-11-06"},null,{"$f":"IF(M5=\"\",\"\",IF(MONTH(M5+1)<>MONTH(M5),\"\",M5+1))","v":"2014-11-07"},null,{"$f":"IF(O5=\"\",\"\",IF(MONTH(O5+1)<>MONTH(O5),\"\",O5+1))","v":"2014-11-08"},null,{"$f":"IF(Q5=\"\",\"\",IF(MONTH(Q5+1)<>MONTH(Q5),\"\",Q5+1))","v":"2014-11-09"},null,{"$f":"IF(S5=\"\",\"\",IF(MONTH(S5+1)<>MONTH(S5),\"\",S5+1))","v":"2014-11-10"},null,{"$f":"IF(U5=\"\",\"\",IF(MONTH(U5+1)<>MONTH(U5),\"\",U5+1))","v":"2014-11-11"},null,{"$f":"IF(W5=\"\",\"\",IF(MONTH(W5+1)<>MONTH(W5),\"\",W5+1))","v":"2014-11-12"},null,{"$f":"IF(Y5=\"\",\"\",IF(MONTH(Y5+1)<>MONTH(Y5),\"\",Y5+1))","v":"2014-11-13"},null,{"$f":"IF(AA5=\"\",\"\",IF(MONTH(AA5+1)<>MONTH(AA5),\"\",AA5+1))","v":"2014-11-14"},null,{"$f":"IF(AC5=\"\",\"\",IF(MONTH(AC5+1)<>MONTH(AC5),\"\",AC5+1))","v":"2014-11-15"},null,{"$f":"IF(AE5=\"\",\"\",IF(MONTH(AE5+1)<>MONTH(AE5),\"\",AE5+1))","v":"2014-11-16"},null,{"$f":"IF(AG5=\"\",\"\",IF(MONTH(AG5+1)<>MONTH(AG5),\"\",AG5+1))","v":"2014-11-17"},null,{"$f":"IF(AI5=\"\",\"\",IF(MONTH(AI5+1)<>MONTH(AI5),\"\",AI5+1))","v":"2014-11-18"},null,{"$f":"IF(AK5=\"\",\"\",IF(MONTH(AK5+1)<>MONTH(AK5),\"\",AK5+1))","v":"2014-11-19"},null,{"$f":"IF(AM5=\"\",\"\",IF(MONTH(AM5+1)<>MONTH(AM5),\"\",AM5+1))","v":"2014-11-20"},null,{"$f":"IF(AO5=\"\",\"\",IF(MONTH(AO5+1)<>MONTH(AO5),\"\",AO5+1))","v":"2014-11-21"},null,{"$f":"IF(AQ5=\"\",\"\",IF(MONTH(AQ5+1)<>MONTH(AQ5),\"\",AQ5+1))","v":"2014-11-22"},null,{"$f":"IF(AS5=\"\",\"\",IF(MONTH(AS5+1)<>MONTH(AS5),\"\",AS5+1))","v":"2014-11-23"},null,{"$f":"IF(AU5=\"\",\"\",IF(MONTH(AU5+1)<>MONTH(AU5),\"\",AU5+1))","v":"2014-11-24"},null,{"$f":"IF(AW5=\"\",\"\",IF(MONTH(AW5+1)<>MONTH(AW5),\"\",AW5+1))","v":"2014-11-25"},null,{"$f":"IF(AY5=\"\",\"\",IF(MONTH(AY5+1)<>MONTH(AY5),\"\",AY5+1))","v":"2014-11-26"},null,{"$f":"IF(BA5=\"\",\"\",IF(MONTH(BA5+1)<>MONTH(BA5),\"\",BA5+1))","v":"2014-11-27"},null,{"$f":"IF(BC5=\"\",\"\",IF(MONTH(BC5+1)<>MONTH(BC5),\"\",BC5+1))","v":"2014-11-28"},null,{"$f":"IF(BE5=\"\",\"\",IF(MONTH(BE5+1)<>MONTH(BE5),\"\",BE5+1))","v":"2014-11-29"},null,{"$f":"IF(BG5=\"\",\"\",IF(MONTH(BG5+1)<>MONTH(BG5),\"\",BG5+1))","v":"2014-11-30"},null,{"$f":"IF(BI5=\"\",\"\",IF(MONTH(BI5+1)<>MONTH(BI5),\"\",BI5+1))","v":""}]
[null,null,"Matin","Après midi","Matin","Après midi","Matin","Après midi","Matin","Après midi","Matin","Après midi","Matin","Après midi","Matin","Après midi","Matin","Après midi","Matin","Après midi","Matin","Après midi","Matin","Après midi","Matin","Après midi","Matin","Après midi","Matin","Après midi","Matin","Après midi","Matin","Après midi","Matin","Après midi","Matin","Après midi","Matin","Après midi","Matin","Après midi","Matin","Après midi","Matin","Après midi","Matin","Après midi","Matin","Après midi","Matin","Après midi","Matin","Après midi","Matin","Après midi","Matin","Après midi",{"$f":"IF(BG5=\"\",\"\",\"Matin\")","v":"Matin"},{"$f":"IF(BG5=\"\",\"\",\"Apres midi\")","v":"Apres midi"},{"$f":"IF(BI5=\"\",\"\",\"Matin\")","v":"Matin"},{"$f":"IF(BI5=\"\",\"\",\"Apres midi\")","v":"Apres midi"},{"$f":"IF(BK5=\"\",\"\",\"Matin\")","v":""},{"$f":"IF(BK5=\"\",\"\",\"Apres midi\")","v":""}]
[null,null,null,null,null,null,null,null,null,null,null,null,null,null,null,null,null,null,null,null,null,null,null,null,null,null,null,null,null,null,null,null,null,null,null,null,null,null,null,null,null,null,null,null,null,null,null,null,null,null,null,null,null,null,null,null,null,null,null,null,null,null,null,null,{"$f":"COUNTA(C7:BL7)/2","v":0}]
[null,null,null,null,null,null,null,null,null,null,null,null,null,null,null,null,null,null,null,null,null,null,null,null,null,null,null,null,null,null,null,null,null,null,null,null,null,null,null,null,null,null,null,null,null,null,null,null,null,null,null,null,null,null,null,null,null,null,null,null,null,null,null,null,{"$f":"COUNTA(C8:BL8)/2","v":0}]
[null,null,null,null,null,null,null,null,null,null,null,null,null,null,null,null,null,null,null,null,null,null,null,null,null,null,null,null,null,null,null,null,null,null,null,null,null,null,null,null,null,null,null,null,null,null,null,null,null,null,null,null,null,null,null,null,null,null,null,null,null,null,null,null,0]
[null,null,null,null,null,null,null,null,null,null,null,null,null,null,null,null,null,null,null,null,null,null,null,null,null,null,null,null,null,null,null,null,null,null,null,null,null,null,null,null,null,null,null,null,null,null,null,null,null,null,null,null,null,null,null,null,null,null,null,null,null,null,null,null,0]
[null,null,null,null,null,null,null,null,null,null,null,null,null,null,null,null,null,null,null,null,null,null,null,null,null,null,null,null,null,null,null,null,null,null,null,null,null,null,null,null,null,null,null,null,null,null,null,null,null,null,null,null,null,null,null,null,null,null,null,null,null,null,null,null,0]
[null,null,null,null,null,null,null,null,null,null,null,null,null,null,null,null,null,null,null,null,null,null,null,null,null,null,null,null,null,null,null,null,null,null,null,null,null,null,null,null,null,null,null,null,null,null,null,null,null,null,null,null,null,null,null,null,null,null,null,null,null,null,null,null,0]
[null,null,null,null,null,null,null,null,null,null,null,null,null,null,null,null,null,null,null,null,null,null,null,null,null,null,null,null,null,null,null,null,null,null,null,null,null,null,null,null,null,null,null,null,null,null,null,null,null,null,null,null,null,null,null,null,null,null,null,null,null,null,null,null,0]
[null,null,null,null,null,null,null,null,null,null,null,null,null,null,null,null,null,null,null,null,null,null,null,null,null,null,null,null,null,null,null,null,null,null,null,null,null,null,null,null,null,null,null,null,null,null,null,null,null,null,null,null,null,null,null,null,null,null,null,null,null,null,null,null,0]
[null,null,null,null,null,null,null,null,null,null,null,null,null,null,null,null,null,null,null,null,null,null,null,null,null,null,null,null,null,null,null,null,null,null,null,null,null,null,null,null,null,null,null,null,null,null,null,null,null,null,null,null,null,null,null,null,null,null,null,null,null,null,null,null,0]
[null,null,null,null,null,null,null,null,null,null,null,null,null,null,null,null,null,null,null,null,null,null,null,null,null,null,null,null,null,null,null,null,null,null,null,null,null,null,null,null,null,null,null,null,null,null,null,null,null,null,null,null,null,null,null,null,null,null,null,null,null,null,null,null,0]
[null,null,null,null,null,null,null,null,null,null,null,null,null,null,null,null,null,null,null,null,null,null,null,null,null,null,null,null,null,null,null,null,null,null,null,null,null,null,null,null,null,null,null,null,null,null,null,null,null,null,null,null,null,null,null,null,null,null,null,null,null,null,null,null,0]
[null,null,null,null,null,null,null,null,null,null,null,null,null,null,null,null,null,null,null,null,null,null,null,null,null,null,null,null,null,null,null,null,null,null,null,null,null,null,null,null,null,null,null,null,null,null,null,null,null,null,null,null,null,null,null,null,null,null,null,null,null,null,null,null,0]
[null,null,null,null,null,null,null,null,null,null,null,null,null,null,null,null,null,null,null,null,null,null,null,null,null,null,null,null,null,null,null,null,null,null,null,null,null,null,null,null,null,null,null,null,null,null,null,null,null,null,null,null,null,null,null,null,null,null,null,null,null,null,null,null,0]
[null,null,null,null,null,null,null,null,null,null,null,null,null,null,null,null,null,null,null,null,null,null,null,null,null,null,null,null,null,null,null,null,null,null,null,null,null,null,null,null,null,null,null,null,null,null,null,null,null,null,null,null,null,null,null,null,null,null,null,null,null,null,null,null,0]
[null,null,null,null,null,null,null,null,null,null,null,null,null,null,null,null,null,null,null,null,null,null,null,null,null,null,null,null,null,null,null,null,null,null,null,null,null,null,null,null,null,null,null,null,null,null,null,null,null,null,null,null,null,null,null,null,null,null,null,null,null,null,null,null,0]
[null,null,null,null,null,null,null,null,null,null,null,null,null,null,null,null,null,null,null,null,null,null,null,null,null,null,null,null,null,null,null,null,null,null,null,null,null,null,null,null,null,null,null,null,null,null,null,null,null,null,null,null,null,null,null,null,null,null,null,null,null,null,null,null,0]
[null,null,null,null,null,null,null,null,null,null,null,null,null,null,null,null,null,null,null,null,null,null,null,null,null,null,null,null,null,null,null,null,null,null,null,null,null,null,null,null,null,null,null,null,null,null,null,null,null,null,null,null,null,null,null,null,null,null,null,null,null,null,null,null,0]
[null,null,null,null,null,null,null,null,null,null,null,null,null,null,null,null,null,null,null,null,null,null,null,null,null,null,null,null,null,null,null,null,null,null,null,null,null,null,null,null,null,null,null,null,null,null,null,null,null,null,null,null,null,null,null,null,null,null,null,null,null,null,null,null,0]
[null,null,null,null,null,null,null,null,null,null,null,null,null,null,null,null,null,null,null,null,null,null,null,null,null,null,null,null,null,null,null,null,null,null,null,null,null,null,null,null,null,null,null,null,null,null,null,null,null,null,null,null,null,null,null,null,null,null,null,null,null,null,null,null,0]
[null,null,null,null,null,null,null,null,null,null,null,null,null,null,null,null,null,null,null,null,null,null,null,null,null,null,null,null,null,null,null,null,null,null,null,null,null,null,null,null,null,null,null,null,null,null,null,null,null,null,null,null,null,null,null,null,null,null,null,null,null,null,null,null,0]
[null,null,null,null,null,null,null,null,null,null,null,null,null,null,null,null,null,null,null,null,null,null,null,null,null,null,null,null,null,null,null,null,null,null,null,null,null,null,null,null,null,null,null,null,null,null,null,null,null,null,null,null,null,null,null,null,null,null,null,null,null,null,null,null,0]
[null,null,null,null,null,null,null,null,null,null,null,null,null,null,null,null,null,null,null,null,null,null,null,null,null,null,null,null,null,null,null,null,null,null,null,null,null,null,null,null,null,null,null,null,null,null,null,null,null,null,null,null,null,null,null,null,null,null,null,null,null,null,null,null,0]
[null,null,null,null,null,null,null,null,null,null,null,null,null,null,null,null,null,null,null,null,null,null,null,null,null,null,null,null,null,null,null,null,null,null,null,null,null,null,null,null,null,null,null,null,null,null,null,null,null,null,null,null,null,null,null,null,null,null,null,null,null,null,null,null,0]
[null,null,null,null,null,null,null,null,null,null,null,null,null,null,null,null,null,null,null,null,null,null,null,null,null,null,null,null,null,null,null,null,null,null,null,null,null,null,null,null,null,null,null,null,null,null,null,null,null,null,null,null,null,null,null,null,null,null,null,null,null,null,null,null,0]
[null,null,null,null,null,null,null,null,null,null,null,null,null,null,null,null,null,null,null,null,null,null,null,null,null,null,null,null,null,null,null,null,null,null,null,null,null,null,null,null,null,null,null,null,null,null,null,null,null,null,null,null,null,null,null,null,null,null,null,null,null,null,null,null,0]
[null,null,null,null,null,null,null,null,null,null,null,null,null,null,null,null,null,null,null,null,null,null,null,null,null,null,null,null,null,null,null,null,null,null,null,null,null,null,null,null,null,null,null,null,null,null,null,null,null,null,null,null,null,null,null,null,null,null,null,null,null,null,null,null,0]
[null,null,null,null,null,null,null,null,null,null,null,null,null,null,null,null,null,null,null,null,null,null,null,null,null,null,null,null,null,null,null,null,null,null,null,null,null,null,null,null,null,null,null,null,null,null,null,null,null,null,null,null,null,null,null,null,null,null,null,null,null,null,null,null,0]
[null,null,null,null,null,null,null,null,null,null,null,null,null,null,null,null,null,null,null,null,null,null,null,null,null,null,null,null,null,null,null,null,null,null,null,null,null,null,null,null,null,null,null,null,null,null,null,null,null,null,null,null,null,null,null,null,null,null,null,null,null,null,null,null,0]
[null,null,null,null,null,null,null,null,null,null,null,null,null,null,null,null,null,null,null,null,null,null,null,null,null,null,null,null,null,null,null,null,null,null,null,null,null,null,null,null,null,null,null,null,null,null,null,null,null,null,null,null,null,null,null,null,null,null,null,null,null,null,null,null,0]
[null,null,null,null,null,null,null,null,null,null,null,null,null,null,null,null,null,null,null,null,null,null,null,null,null,null,null,null,null,null,null,null,null,null,null,null,null,null,null,null,null,null,null,null,null,null,null,null,null,null,null,null,null,null,null,null,null,null,null,null,null,null,null,null,0]
[null,null,null,null,null,null,null,null,null,null,null,null,null,null,null,null,null,null,null,null,null,null,null,null,null,null,null,null,null,null,null,null,null,null,null,null,null,null,null,null,null,null,null,null,null,null,null,null,null,null,null,null,null,null,null,null,null,null,null,null,null,null,null,null,0]
[null,null,null,null,null,null,null,null,null,null,null,null,null,null,null,null,null,null,null,null,null,null,null,null,null,null,null,null,null,null,null,null,null,null,null,null,null,null,null,null,null,null,null,null,null,null,null,null,null,null,null,null,null,null,null,null,null,null,null,null,null,null,null,null,0]
[null,null,null,null,null,null,null,null,null,null,null,null,null,null,null,null,null,null,null,null,null,null,null,null,null,null,null,null,null,null,null,null,null,null,null,null,null,null,null,null,null,null,null,null,null,null,null,null,null,null,null,null,null,null,null,null,null,null,null,null,null,null,null,null,0]
[null,null,null,null,null,null,null,null,null,null,null,null,null,null,null,null,null,null,null,null,null,null,null,null,null,null,null,null,null,null,null,null,null,null,null,null,null,null,null,null,null,null,null,null,null,null,null,null,null,null,null,null,null,null,null,null,null,null,null,null,null,null,null,null,0]
[null,null,null,null,null,null,null,null,null,null,null,null,null,null,null,null,null,null,null,null,null,null,null,null,null,null,null,null,null,null,null,null,null,null,null,null,null,null,null,null,null,null,null,null,null,null,null,null,null,null,null,null,null,null,null,null,null,null,null,null,null,null,null,null,0]
[null,null,null,null,null,null,null,null,null,null,null,null,null,null,null,null,null,null,null,null,null,null,null,null,null,null,null,null,null,null,null,null,null,null,null,null,null,null,null,null,null,null,null,null,null,null,null,null,null,null,null,null,null,null,null,null,null,null,null,null,null,null,null,null,0]
[null,null,null,null,null,null,null,null,null,null,null,null,null,null,null,null,null,null,null,null,null,null,null,null,null,null,null,null,null,null,null,null,null,null,null,null,null,null,null,null,null,null,null,null,null,null,null,null,null,null,null,null,null,null,null,null,null,null,null,null,null,null,null,null,0]
[null,null,null,null,null,null,null,null,null,null,null,null,null,null,null,null,null,null,null,null,null,null,null,null,null,null,null,null,null,null,null,null,null,null,null,null,null,null,null,null,null,null,null,null,null,null,null,null,null,null,null,null,null,null,null,null,null,null,null,null,null,null,null,null,0]
[null,null,null,null,null,null,null,null,null,null,null,null,null,null,null,null,null,null,null,null,null,null,null,null,null,null,null,null,null,null,null,null,null,null,null,null,null,null,null,null,null,null,null,null,null,null,null,null,null,null,null,null,null,null,null,null,null,null,null,null,null,null,null,null,0]
[null,null,null,null,null,null,null,null,null,null,null,null,null,null,null,null,null,null,null,null,null,null,null,null,null,null,null,null,null,null,null,null,null,null,null,null,null,null,null,null,null,null,null,null,null,null,null,null,null,null,null,null,null,null,null,null,null,null,null,null,null,null,null,null,0]
[null,null,null,null,null,null,null,null,null,null,null,null,null,null,null,null,null,null,null,null,null,null,null,null,null,null,null,null,null,null,null,null,null,null,null,null,null,null,null,null,null,null,null,null,null,null,null,null,null,null,null,null,null,null,null,null,null,null,null,null,null,null,null,null,0]
[null,null,null,null,null,null,null,null,null,null,null,null,null,null,null,null,null,null,null,null,null,null,null,null,null,null,null,null,null,null,null,null,null,null,null,null,null,null,null,null,null,null,null,null,null,null,null,null,null,null,null,null,null,null,null,null,null,null,null,null,null,null,null,null,0]
[null,null,null,null,null,null,null,null,null,null,null,null,null,null,null,null,null,null,null,null,null,null,null,null,null,null,null,null,null,null,null,null,null,null,null,null,null,null,null,null,null,null,null,null,null,null,null,null,null,null,null,null,null,null,null,null,null,null,null,null,null,null,null,null,0]
[null,null,null,null,null,null,null,null,null,null,null,null,null,null,null,null,null,null,null,null,null,null,null,null,null,null,null,null,null,null,null,null,null,null,null,null,null,null,null,null,null,null,null,null,null,null,null,null,null,null,null,null,null,null,null,null,null,null,null,null,null,null,null,null,0]
[null,null,null,null,null,null,null,null,null,null,null,null,null,null,null,null,null,null,null,null,null,null,null,null,null,null,null,null,null,null,null,null,null,null,null,null,null,null,null,null,null,null,null,null,null,null,null,null,null,null,null,null,null,null,null,null,null,null,null,null,null,null,null,null,0]
[null,null,null,null,null,null,null,null,null,null,null,null,null,null,null,null,null,null,null,null,null,null,null,null,null,null,null,null,null,null,null,null,null,null,null,null,null,null,null,null,null,null,null,null,null,null,null,null,null,null,null,null,null,null,null,null,null,null,null,null,null,null,null,null,0]
[null,null,null,null,null,null,null,null,null,null,null,null,null,null,null,null,null,null,null,null,null,null,null,null,null,null,null,null,null,null,null,null,null,null,null,null,null,null,null,null,null,null,null,null,null,null,null,null,null,null,null,null,null,null,null,null,null,null,null,null,null,null,null,null,0]
[null,null,null,null,null,null,null,null,null,null,null,null,null,null,null,null,null,null,null,null,null,null,null,null,null,null,null,null,null,null,null,null,null,null,null,null,null,null,null,null,null,null,null,null,null,null,null,null,null,null,null,null,null,null,null,null,null,null,null,null,null,null,null,null,0]
[null,null,null,null,null,null,null,null,null,null,null,null,null,null,null,null,null,null,null,null,null,null,null,null,null,null,null,null,null,null,null,null,null,null,null,null,null,null,null,null,null,null,null,null,null,null,null,null,null,null,null,null,null,null,null,null,null,null,null,null,null,null,null,null,0]
[null,null,null,null,null,null,null,null,null,null,null,null,null,null,null,null,null,null,null,null,null,null,null,null,null,null,null,null,null,null,null,null,null,null,null,null,null,null,null,null,null,null,null,null,null,null,null,null,null,null,null,null,null,null,null,null,null,null,null,null,null,null,null,null,0]
[null,null,null,null,null,null,null,null,null,null,null,null,null,null,null,null,null,null,null,null,null,null,null,null,null,null,null,null,null,null,null,null,null,null,null,null,null,null,null,null,null,null,null,null,null,null,null,null,null,null,null,null,null,null,null,null,null,null,null,null,null,null,null,null,0]
[null,null,null,null,null,null,null,null,null,null,null,null,null,null,null,null,null,null,null,null,null,null,null,null,null,null,null,null,null,null,null,null,null,null,null,null,null,null,null,null,null,null,null,null,null,null,null,null,null,null,null,null,null,null,null,null,null,null,null,null,null,null,null,null,0]
[null,null,null,null,null,null,null,null,null,null,null,null,null,null,null,null,null,null,null,null,null,null,null,null,null,null,null,null,null,null,null,null,null,null,null,null,null,null,null,null,null,null,null,null,null,null,null,null,null,null,null,null,null,null,null,null,null,null,null,null,null,null,null,null,0]
[null,null,null,null,null,null,null,null,null,null,null,null,null,null,null,null,null,null,null,null,null,null,null,null,null,null,null,null,null,null,null,null,null,null,null,null,null,null,null,null,null,null,null,null,null,null,null,null,null,null,null,null,null,null,null,null,null,null,null,null,null,null,null,null,0]
[null,null,null,null,null,null,null,null,null,null,null,null,null,null,null,null,null,null,null,null,null,null,null,null,null,null,null,null,null,null,null,null,null,null,null,null,null,null,null,null,null,null,null,null,null,null,null,null,null,null,null,null,null,null,null,null,null,null,null,null,null,null,null,null,0]
[null,null,null,null,null,null,null,null,null,null,null,null,null,null,null,null,null,null,null,null,null,null,null,null,null,null,null,null,null,null,null,null,null,null,null,null,null,null,null,null,null,null,null,null,null,null,null,null,null,null,null,null,null,null,null,null,null,null,null,null,null,null,null,null,0]
[null,null,null,null,null,null,null,null,null,null,null,null,null,null,null,null,null,null,null,null,null,null,null,null,null,null,null,null,null,null,null,null,null,null,null,null,null,null,null,null,null,null,null,null,null,null,null,null,null,null,null,null,null,null,null,null,null,null,null,null,null,null,null,null,0]
[null,null,null,null,null,null,null,null,null,null,null,null,null,null,null,null,null,null,null,null,null,null,null,null,null,null,null,null,null,null,null,null,null,null,null,null,null,null,null,null,null,null,null,null,null,null,null,null,null,null,null,null,null,null,null,null,null,null,null,null,null,null,null,null,0]
[null,null,null,null,null,null,null,null,null,null,null,null,null,null,null,null,null,null,null,null,null,null,null,null,null,null,null,null,null,null,null,null,null,null,null,null,null,null,null,null,null,null,null,null,null,null,null,null,null,null,null,null,null,null,null,null,null,null,null,null,null,null,null,null,0]
[null,null,null,null,null,null,null,null,null,null,null,null,null,null,null,null,null,null,null,null,null,null,null,null,null,null,null,null,null,null,null,null,null,null,null,null,null,null,null,null,null,null,null,null,null,null,null,null,null,null,null,null,null,null,null,null,null,null,null,null,null,null,null,null,0]
[null,null,null,null,null,null,null,null,null,null,null,null,null,null,null,null,null,null,null,null,null,null,null,null,null,null,null,null,null,null,null,null,null,null,null,null,null,null,null,null,null,null,null,null,null,null,null,null,null,null,null,null,null,null,null,null,null,null,null,null,null,null,null,null,0]
[null,null,null,null,null,null,null,null,null,null,null,null,null,null,null,null,null,null,null,null,null,null,null,null,null,null,null,null,null,null,null,null,null,null,null,null,null,null,null,null,null,null,null,null,null,null,null,null,null,null,null,null,null,null,null,null,null,null,null,null,null,null,null,null,0]
[null,null,null,null,null,null,null,null,null,null,null,null,null,null,null,null,null,null,null,null,null,null,null,null,null,null,null,null,null,null,null,null,null,null,null,null,null,null,null,null,null,null,null,null,null,null,null,null,null,null,null,null,null,null,null,null,null,null,null,null,null,null,null,null,0]
[null,null,null,null,null,null,null,null,null,null,null,null,null,null,null,null,null,null,null,null,null,null,null,null,null,null,null,null,null,null,null,null,null,null,null,null,null,null,null,null,null,null,null,null,null,null,null,null,null,null,null,null,null,null,null,null,null,null,null,null,null,null,null,null,0]
[null,null,null,null,null,null,null,null,null,null,null,null,null,null,null,null,null,null,null,null,null,null,null,null,null,null,null,null,null,null,null,null,null,null,null,null,null,null,null,null,null,null,null,null,null,null,null,null,null,null,null,null,null,null,null,null,null,null,null,null,null,null,null,null,0]
[null,null,null,null,null,null,null,null,null,null,null,null,null,null,null,null,null,null,null,null,null,null,null,null,null,null,null,null,null,null,null,null,null,null,null,null,null,null,null,null,null,null,null,null,null,null,null,null,null,null,null,null,null,null,null,null,null,null,null,null,null,null,null,null,{"$f":"COUNTA(C72:BL72)/2","v":0}]
[null,null,null,null,null,null,null,null,null,null,null,null,null,null,null,null,null,null,null,null,null,null,null,null,null,null,null,null,null,null,null,null,null,null,null,null,null,null,null,null,null,null,null,null,null,null,null,null,null,null,null,null,null,null,null,null,null,null,null,null,null,null,null,null,0]
[null,null,null,null,null,null,null,null,null,null,null,null,null,null,null,null,null,null,null,null,null,null,null,null,null,null,null,null,null,null,null,null,null,null,null,null,null,null,null,null,null,null,null,null,null,null,null,null,null,null,null,null,null,null,null,null,null,null,null,null,null,null,null,null,0]
[null,null,null,null,null,null,null,null,null,null,null,null,null,null,null,null,null,null,null,null,null,null,null,null,null,null,null,null,null,null,null,null,null,null,null,null,null,null,null,null,null,null,null,null,null,null,null,null,null,null,null,null,null,null,null,null,null,null,null,null,null,null,null,null,0]
[null,null,null,null,null,null,null,null,null,null,null,null,null,null,null,null,null,null,null,null,null,null,null,null,null,null,null,null,null,null,null,null,null,null,null,null,null,null,null,null,null,null,null,null,null,null,null,null,null,null,null,null,null,null,null,null,null,null,null,null,null,null,null,null,0]
[null,null,null,null,null,null,null,null,null,null,null,null,null,null,null,null,null,null,null,null,null,null,null,null,null,null,null,null,null,null,null,null,null,null,null,null,null,null,null,null,null,null,null,null,null,null,null,null,null,null,null,null,null,null,null,null,null,null,null,null,null,null,null,null,0]
[null,null,null,null,null,null,null,null,null,null,null,null,null,null,null,null,null,null,null,null,null,null,null,null,null,null,null,null,null,null,null,null,null,null,null,null,null,null,null,null,null,null,null,null,null,null,null,null,null,null,null,null,null,null,null,null,null,null,null,null,null,null,null,null,0]
[null,null,null,null,null,null,null,null,null,null,null,null,null,null,null,null,null,null,null,null,null,null,null,null,null,null,null,null,null,null,null,null,null,null,null,null,null,null,null,null,null,null,null,null,null,null,null,null,null,null,null,null,null,null,null,null,null,null,null,null,null,null,null,null,0]
[null,null,null,null,null,null,null,null,null,null,null,null,null,null,null,null,null,null,null,null,null,null,null,null,null,null,null,null,null,null,null,null,null,null,null,null,null,null,null,null,null,null,null,null,null,null,null,null,null,null,null,null,null,null,null,null,null,null,null,null,null,null,null,null,0]
[null,null,null,null,null,null,null,null,null,null,null,null,null,null,null,null,null,null,null,null,null,null,null,null,null,null,null,null,null,null,null,null,null,null,null,null,null,null,null,null,null,null,null,null,null,null,null,null,null,null,null,null,null,null,null,null,null,null,null,null,null,null,null,null,0]
[null,null,null,null,null,null,null,null,null,null,null,null,null,null,null,null,null,null,null,null,null,null,null,null,null,null,null,null,null,null,null,null,null,null,null,null,null,null,null,null,null,null,null,null,null,null,null,null,null,null,null,null,null,null,null,null,null,null,null,null,null,null,null,null,0]
[null,null,null,null,null,null,null,null,null,null,null,null,null,null,null,null,null,null,null,null,null,null,null,null,null,null,null,null,null,null,null,null,null,null,null,null,null,null,null,null,null,null,null,null,null,null,null,null,null,null,null,null,null,null,null,null,null,null,null,null,null,null,null,null,0]
[null,null,null,null,null,null,null,null,null,null,null,null,null,null,null,null,null,null,null,null,null,null,null,null,null,null,null,null,null,null,null,null,null,null,null,null,null,null,null,null,null,null,null,null,null,null,null,null,null,null,null,null,null,null,null,null,null,null,null,null,null,null,null,null,0]
[null,null,null,null,null,null,null,null,null,null,null,null,null,null,null,null,null,null,null,null,null,null,null,null,null,null,null,null,null,null,null,null,null,null,null,null,null,null,null,null,null,null,null,null,null,null,null,null,null,null,null,null,null,null,null,null,null,null,null,null,null,null,null,null,0]
[null,null,null,null,null,null,null,null,null,null,null,null,null,null,null,null,null,null,null,null,null,null,null,null,null,null,null,null,null,null,null,null,null,null,null,null,null,null,null,null,null,null,null,null,null,null,null,null,null,null,null,null,null,null,null,null,null,null,null,null,null,null,null,null,0]
[null,null,null,null,null,null,null,null,null,null,null,null,null,null,null,null,null,null,null,null,null,null,null,null,null,null,null,null,null,null,null,null,null,null,null,null,null,null,null,null,null,null,null,null,null,null,null,null,null,null,null,null,null,null,null,null,null,null,null,null,null,null,null,null,0]
[null,null,null,null,null,null,null,null,null,null,null,null,null,null,null,null,null,null,null,null,null,null,null,null,null,null,null,null,null,null,null,null,null,null,null,null,null,null,null,null,null,null,null,null,null,null,null,null,null,null,null,null,null,null,null,null,null,null,null,null,null,null,null,null,0]
[null,null,null,null,null,null,null,null,null,null,null,null,null,null,null,null,null,null,null,null,null,null,null,null,null,null,null,null,null,null,null,null,null,null,null,null,null,null,null,null,null,null,null,null,null,null,null,null,null,null,null,null,null,null,null,null,null,null,null,null,null,null,null,null,0]
[null,null,null,null,null,null,null,null,null,null,null,null,null,null,null,null,null,null,null,null,null,null,null,null,null,null,null,null,null,null,null,null,null,null,null,null,null,null,null,null,null,null,null,null,null,null,null,null,null,null,null,null,null,null,null,null,null,null,null,null,null,null,null,null,0]
[null,null,null,null,null,null,null,null,null,null,null,null,null,null,null,null,null,null,null,null,null,null,null,null,null,null,null,null,null,null,null,null,null,null,null,null,null,null,null,null,null,null,null,null,null,null,null,null,null,null,null,null,null,null,null,null,null,null,null,null,null,null,null,null,0]
[null,null,null,null,null,null,null,null,null,null,null,null,null,null,null,null,null,null,null,null,null,null,null,null,null,null,null,null,null,null,null,null,null,null,null,null,null,null,null,null,null,null,null,null,null,null,null,null,null,null,null,null,null,null,null,null,null,null,null,null,null,null,null,null,0]
[null,null,null,null,null,null,null,null,null,null,null,null,null,null,null,null,null,null,null,null,null,null,null,null,null,null,null,null,null,null,null,null,null,null,null,null,null,null,null,null,null,null,null,null,null,null,null,null,null,null,null,null,null,null,null,null,null,null,null,null,null,null,null,null,0]
[null,null,null,null,null,null,null,null,null,null,null,null,null,null,null,null,null,null,null,null,null,null,null,null,null,null,null,null,null,null,null,null,null,null,null,null,null,null,null,null,null,null,null,null,null,null,null,null,null,null,null,null,null,null,null,null,null,null,null,null,null,null,null,null,0]
[null,null,null,null,null,null,null,null,null,null,null,null,null,null,null,null,null,null,null,null,null,null,null,null,null,null,null,null,null,null,null,null,null,null,null,null,null,null,null,null,null,null,null,null,null,null,null,null,null,null,null,null,null,null,null,null,null,null,null,null,null,null,null,null,0]
[null,null,null,null,null,null,null,null,null,null,null,null,null,null,null,null,null,null,null,null,null,null,null,null,null,null,null,null,null,null,null,null,null,null,null,null,null,null,null,null,null,null,null,null,null,null,null,null,null,null,null,null,null,null,null,null,null,null,null,null,null,null,null,null,0]
[null,null,null,null,null,null,null,null,null,null,null,null,null,null,null,null,null,null,null,null,null,null,null,null,null,null,null,null,null,null,null,null,null,null,null,null,null,null,null,null,null,null,null,null,null,null,null,null,null,null,null,null,null,null,null,null,null,null,null,null,null,null,null,null,0]
[null,null,null,null,null,null,null,null,null,null,null,null,null,null,null,null,null,null,null,null,null,null,null,null,null,null,null,null,null,null,null,null,null,null,null,null,null,null,null,null,null,null,null,null,null,null,null,null,null,null,null,null,null,null,null,null,null,null,null,null,null,null,null,null,0]
[null,null,null,null,null,null,null,null,null,null,null,null,null,null,null,null,null,null,null,null,null,null,null,null,null,null,null,null,null,null,null,null,null,null,null,null,null,null,null,null,null,null,null,null,null,null,null,null,null,null,null,null,null,null,null,null,null,null,null,null,null,null,null,null,0]
[null,null,null,null,null,null,null,null,null,null,null,null,null,null,null,null,null,null,null,null,null,null,null,null,null,null,null,null,null,null,null,null,null,null,null,null,null,null,null,null,null,null,null,null,null,null,null,null,null,null,null,null,null,null,null,null,null,null,null,null,null,null,null,null,0]

{"sheet":"Décembre","index":13,"n_rows":100,"n_cols":65,"rows_kept":100,"cut":false,"hidden":false,"merged":[[17,0,17,1],[18,0,18,1],[19,0,19,1],[20,0,20,1],[13,0,13,1],[1,21,1,24],[12,0,12,1],[10,0,10,1],[11,0,11,1],[9,0,9,1],[14,0,14,1],[15,0,15,1],[16,0,16,1],[3,16,3,17],[3,18,3,19],[3,20,3,21],[3,22,3,23],[4,2,4,3],[4,4,4,5],[4,6,4,7],[4,8,4,9],[4,10,4,11],[4,12,4,13],[4,14,4,15],[1,54,1,58],[1,59,1,62],[8,0,8,1],[3,26,3,27],[4,62,4,63],[6,0,6,1],[7,0,7,1],[4,44,4,45],[4,46,4,47],[4,48,4,49],[4,50,4,51],[4,52,4,53],[4,54,4,55],[4,32,4,33],[4,56,4,57],[4,58,4,59],[4,60,4,61],[4,42,4,43],[4,20,4,21],[4,22,4,23],[4,24,4,25],[4,26,4,27],[4,28,4,29],[3,62,3,63],[4,16,4,17],[4,18,4,19],[3,50,3,51],[3,52,3,53],[3,54,3,55],[3,56,3,57],[3,38,3,39],[3,40,3,41],[3,60,3,61],[4,30,4,31],[4,34,4,35],[4,36,4,37],[4,38,4,39],[4,40,4,41],[3,58,3,59],[3,14,3,15],[3,48,3,49],[3,24,3,25],[3,42,3,43],[3,44,3,45],[3,46,3,47],[3,28,3,29],[1,42,1,46],[3,2,3,3],[3,4,3,5],[3,6,3,7],[3,8,3,9],[3,10,3,11],[3,12,3,13],[1,3,1,7],[1,8,1,10],[1,16,1,20],[1,29,1,33],[1,34,1,37],[3,30,3,31],[3,32,3,33],[3,34,3,35],[3,36,3,37],[1,47,1,50],[26,0,26,1],[27,0,27,1],[28,0,28,1],[29,0,29,1],[30,0,30,1],[21,0,21,1],[22,0,22,1],[23,0,23,1],[24,0,24,1],[25,0,25,1],[36,0,36,1],[37,0,37,1],[38,0,38,1],[39,0,39,1],[40,0,40,1],[31,0,31,1],[32,0,32,1],[33,0,33,1],[34,0,34,1],[35,0,35,1],[46,0,46,1],[47,0,47,1],[48,0,48,1],[49,0,49,1],[50,0,50,1],[41,0,41,1],[42,0,42,1],[43,0,43,1],[44,0,44,1],[45,0,45,1],[56,0,56,1],[57,0,57,1],[58,0,58,1],[59,0,59,1],[60,0,60,1],[51,0,51,1],[52,0,52,1],[53,0,53,1],[54,0,54,1],[55,0,55,1],[66,0,66,1],[67,0,67,1],[68,0,68,1],[69,0,69,1],[70,0,70,1],[61,0,61,1],[62,0,62,1],[63,0,63,1],[64,0,64,1],[65,0,65,1],[76,0,76,1],[77,0,77,1],[78,0,78,1],[79,0,79,1],[80,0,80,1],[71,0,71,1],[72,0,72,1],[73,0,73,1],[74,0,74,1],[75,0,75,1],[86,0,86,1],[87,0,87,1],[88,0,88,1],[89,0,89,1],[90,0,90,1],[81,0,81,1],[82,0,82,1],[83,0,83,1],[84,0,84,1],[85,0,85,1],[96,0,96,1],[97,0,97,1],[98,0,98,1],[99,0,99,1],[91,0,91,1],[92,0,92,1],[93,0,93,1],[94,0,94,1],[95,0,95,1]]}
[11,{"$f":"C5","v":"2014-12-01"}]
[null,null,null,{"$f":"IF(An!$Q$4=\"\",\"\",An!$Q$4)","v":""},null,null,null,null,{"$f":"C5","v":"2014-12-01"},null,null,null,null,"ACCEUIL",null,null,{"$f":"IF(An!$Q$4=\"\",\"\",An!$Q$4)","v":""},null,null,null,null,{"$f":"C5","v":"2014-12-01"},null,null,null,null,"ACCEUIL",null,null,{"$f":"IF(An!$Q$4=\"\",\"\",An!$Q$4)","v":""},null,null,null,null,{"$f":"C5","v":"2014-12-01"},null,null,null,null,"ACCEUIL",null,null,{"$f":"IF(An!$Q$4=\"\",\"\",An!$Q$4)","v":""},null,null,null,null,{"$f":"C5","v":"2014-12-01"},null,null,null,null,"ACCEUIL",null,{"$f":"IF(An!$Q$4=\"\",\"\",An!$Q$4)","v":""},null,null,null,null,{"$f":"C5","v":"2014-12-01"},null,null,null,"ACCEUIL"]
[]
[null,null,{"$f":"IF(C5=\"\",\"\",IF(LOOKUP(C5,Fériés)=C5,\"\",CHOOSE(WEEKDAY(C5,1),\"Dimanche\",\"Lundi\",\"Mardi\",\"Mercredi\",\"Jeudi\",\"Vendredi\",\"Samedi\")))","v":"Lundi"},null,"Mardi",null,"Mercredi",null,"Jeudi",null,"Vendredi",null,"Samedi",null,"Dimanche",null,"Lundi",null,{"$f":"IF(S5=\"\",\"\",IF(LOOKUP(S5,Fériés)=S5,\"\",CHOOSE(WEEKDAY(S5,1),\"Dimanche\",\"Lundi\",\"Mardi\",\"Mercredi\",\"Jeudi\",\"Vendredi\",\"Samedi\")))","v":"Mardi"},null,"Mercredi",null,"Jeudi",null,"Vendredi",null,"Samedi",null,"Dimanche",null,"Lundi",null,{"$f":"IF(AG5=\"\",\"\",IF(LOOKUP(AG5,Fériés)=AG5,\"\",CHOOSE(WEEKDAY(AG5,1),\"Dimanche\",\"Lundi\",\"Mardi\",\"Mercredi\",\"Jeudi\",\"Vendredi\",\"Samedi\")))","v":"Mardi"},null,{"$f":"IF(AI5=\"\",\"\",IF(LOOKUP(AI5,Fériés)=AI5,\"\",CHOOSE(WEEKDAY(AI5,1),\"Dimanche\",\"Lundi\",\"Mardi\",\"Mercredi\",\"Jeudi\",\"Vendredi\",\"Samedi\")))","v":"Mercredi"},null,"Jeudi",null,"Vendredi",null,"Samedi",null,"Dimanche",null,"Lundi",null,"Mardi",null,{"$f":"IF(AW5=\"\",\"\",IF(LOOKUP(AW5,Fériés)=AW5,\"\",CHOOSE(WEEKDAY(AW5,1),\"Dimanche\",\"Lundi\",\"Mardi\",\"Mercredi\",\"Jeudi\",\"Vendredi\",\"Samedi\")))","v":"Mercredi"},null,{"$f":"IF(AY5=\"\",\"\",IF(LOOKUP(AY5,Fériés)=AY5,CHOOSE(WEEKDAY(AY5,1),\"Dimanche\",\"Lundi\",\"Mardi\",\"Mercredi\",\"Jeudi\",\"Vendredi\",\"Samedi\",\"\")))","v":"Jeudi"},null,{"$f":"IF(BA5=\"\",\"\",IF(LOOKUP(BA5,Fériés)=BA5,\"\",CHOOSE(WEEKDAY(BA5,1),\"Dimanche\",\"Lundi\",\"Mardi\",\"Mercredi\",\"Jeudi\",\"Vendredi\",\"Samedi\")))","v":"Vendredi"},null,"Samedi",null,"Dimanche",null,"Lundi",null,"Mardi",null,"Mercredi"]
[null,null,{"$f":"DATE(Année,12,1)","v":"2014-12-01"},null,{"$f":"IF(C5=\"\",\"\",IF(MONTH(C5+1)<>MONTH(C5),\"\",C5+1))","v":"2014-12-02"},null,{"$f":"IF(E5=\"\",\"\",IF(MONTH(E5+1)<>MONTH(E5),\"\",E5+1))","v":"2014-12-03"},null,{"$f":"IF(G5=\"\",\"\",IF(MONTH(G5+1)<>MONTH(G5),\"\",G5+1))","v":"2014-12-04"},null,{"$f":"IF(I5=\"\",\"\",IF(MONTH(I5+1)<>MONTH(I5),\"\",I5+1))","v":"2014-12-05"},null,{"$f":"IF(K5=\"\",\"\",IF(MONTH(K5+1)<>MONTH(K5),\"\",K5+1))","v":"2014-12-06"},null,{"$f":"IF(M5=\"\",\"\",IF(MONTH(M5+1)<>MONTH(M5),\"\",M5+1))","v":"2014-12-07"},null,{"$f":"IF(O5=\"\",\"\",IF(MONTH(O5+1)<>MONTH(O5),\"\",O5+1))","v":"2014-12-08"},null,{"$f":"IF(Q5=\"\",\"\",IF(MONTH(Q5+1)<>MONTH(Q5),\"\",Q5+1))","v":"2014-12-09"},null,{"$f":"IF(S5=\"\",\"\",IF(MONTH(S5+1)<>MONTH(S5),\"\",S5+1))","v":"2014-12-10"},null,{"$f":"IF(U5=\"\",\"\",IF(MONTH(U5+1)<>MONTH(U5),\"\",U5+1))","v":"2014-12-11"},null,{"$f":"IF(W5=\"\",\"\",IF(MONTH(W5+1)<>MONTH(W5),\"\",W5+1))","v":"2014-12-12"},null,{"$f":"IF(Y5=\"\",\"\",IF(MONTH(Y5+1)<>MONTH(Y5),\"\",Y5+1))","v":"2014-12-13"},null,{"$f":"IF(AA5=\"\",\"\",IF(MONTH(AA5+1)<>MONTH(AA5),\"\",AA5+1))","v":"2014-12-14"},null,{"$f":"IF(AC5=\"\",\"\",IF(MONTH(AC5+1)<>MONTH(AC5),\"\",AC5+1))","v":"2014-12-15"},null,{"$f":"IF(AE5=\"\",\"\",IF(MONTH(AE5+1)<>MONTH(AE5),\"\",AE5+1))","v":"2014-12-16"},null,{"$f":"IF(AG5=\"\",\"\",IF(MONTH(AG5+1)<>MONTH(AG5),\"\",AG5+1))","v":"2014-12-17"},null,{"$f":"IF(AI5=\"\",\"\",IF(MONTH(AI5+1)<>MONTH(AI5),\"\",AI5+1))","v":"2014-12-18"},null,{"$f":"IF(AK5=\"\",\"\",IF(MONTH(AK5+1)<>MONTH(AK5),\"\",AK5+1))","v":"2014-12-19"},null,{"$f":"IF(AM5=\"\",\"\",IF(MONTH(AM5+1)<>MONTH(AM5),\"\",AM5+1))","v":"2014-12-20"},null,{"$f":"IF(AO5=\"\",\"\",IF(MONTH(AO5+1)<>MONTH(AO5),\"\",AO5+1))","v":"2014-12-21"},null,{"$f":"IF(AQ5=\"\",\"\",IF(MONTH(AQ5+1)<>MONTH(AQ5),\"\",AQ5+1))","v":"2014-12-22"},null,{"$f":"IF(AS5=\"\",\"\",IF(MONTH(AS5+1)<>MONTH(AS5),\"\",AS5+1))","v":"2014-12-23"},null,{"$f":"IF(AU5=\"\",\"\",IF(MONTH(AU5+1)<>MONTH(AU5),\"\",AU5+1))","v":"2014-12-24"},null,{"$f":"IF(AW5=\"\",\"\",IF(MONTH(AW5+1)<>MONTH(AW5),\"\",AW5+1))","v":"2014-12-25"},null,{"$f":"IF(AY5=\"\",\"\",IF(MONTH(AY5+1)<>MONTH(AY5),\"\",AY5+1))","v":"2014-12-26"},null,{"$f":"IF(BA5=\"\",\"\",IF(MONTH(BA5+1)<>MONTH(BA5),\"\",BA5+1))","v":"2014-12-27"},null,{"$f":"IF(BC5=\"\",\"\",IF(MONTH(BC5+1)<>MONTH(BC5),\"\",BC5+1))","v":"2014-12-28"},null,{"$f":"IF(BE5=\"\",\"\",IF(MONTH(BE5+1)<>MONTH(BE5),\"\",BE5+1))","v":"2014-12-29"},null,{"$f":"IF(BG5=\"\",\"\",IF(MONTH(BG5+1)<>MONTH(BG5),\"\",BG5+1))","v":"2014-12-30"},null,{"$f":"IF(BI5=\"\",\"\",IF(MONTH(BI5+1)<>MONTH(BI5),\"\",BI5+1))","v":"2014-12-31"}]
[null,null,"Matin","Après midi","Matin","Après midi","Matin","Après midi","Matin","Après midi","Matin","Après midi","Matin","Après midi","Matin","Après midi","Matin","Après midi","Matin","Après midi","Matin","Après midi","Matin","Après midi","Matin","Après midi","Matin","Après midi","Matin","Après midi","Matin","Après midi","Matin","Après midi","Matin","Après midi","Matin","Après midi","Matin","Après midi","Matin","Après midi","Matin","Après midi","Matin","Après midi","Matin","Après midi","Matin","Après midi","Matin","Après midi","Matin","Après midi","Matin","Après midi","Matin","Après midi",{"$f":"IF(BG5=\"\",\"\",\"Matin\")","v":"Matin"},{"$f":"IF(BG5=\"\",\"\",\"Apres midi\")","v":"Apres midi"},{"$f":"IF(BI5=\"\",\"\",\"Matin\")","v":"Matin"},{"$f":"IF(BI5=\"\",\"\",\"Apres midi\")","v":"Apres midi"},{"$f":"IF(BK5=\"\",\"\",\"Matin\")","v":"Matin"},{"$f":"IF(BK5=\"\",\"\",\"Apres midi\")","v":"Apres midi"}]
[null,null,null,null,null,null,null,null,null,null,null,null,null,null,null,null,null,null,null,null,null,null,null,null,null,null,null,null,null,null,null,null,null,null,null,null,null,null,null,null,null,null,null,null,null,null,null,null,null,null,null,null,null,null,null,null,null,null,null,null,null,null,null,null,{"$f":"COUNTA(C7:BL7)/2","v":0}]
[null,null,null,null,null,null,null,null,null,null,null,null,null,null,null,null,null,null,null,null,null,null,null,null,null,null,null,null,null,null,null,null,null,null,null,null,null,null,null,null,null,null,null,null,null,null,null,null,null,null,null,null,null,null,null,null,null,null,null,null,null,null,null,null,{"$f":"COUNTA(C8:BL8)/2","v":0}]
[null,null,null,null,null,null,null,null,null,null,null,null,null,null,null,null,null,null,null,null,null,null,null,null,null,null,null,null,null,null,null,null,null,null,null,null,null,null,null,null,null,null,null,null,null,null,null,null,null,null,null,null,null,null,null,null,null,null,null,null,null,null,null,null,0]
[null,null,null,null,null,null,null,null,null,null,null,null,null,null,null,null,null,null,null,null,null,null,null,null,null,null,null,null,null,null,null,null,null,null,null,null,null,null,null,null,null,null,null,null,null,null,null,null,null,null,null,null,null,null,null,null,null,null,null,null,null,null,null,null,0]
[null,null,null,null,null,null,null,null,null,null,null,null,null,null,null,null,null,null,null,null,null,null,null,null,null,null,null,null,null,null,null,null,null,null,null,null,null,null,null,null,null,null,null,null,null,null,null,null,null,null,null,null,null,null,null,null,null,null,null,null,null,null,null,null,0]
[null,null,null,null,null,null,null,null,null,null,null,null,null,null,null,null,null,null,null,null,null,null,null,null,null,null,null,null,null,null,null,null,null,null,null,null,null,null,null,null,null,null,null,null,null,null,null,null,null,null,null,null,null,null,null,null,null,null,null,null,null,null,null,null,0]
[null,null,null,null,null,null,null,null,null,null,null,null,null,null,null,null,null,null,null,null,null,null,null,null,null,null,null,null,null,null,null,null,null,null,null,null,null,null,null,null,null,null,null,null,null,null,null,null,null,null,null,null,null,null,null,null,null,null,null,null,null,null,null,null,0]
[null,null,null,null,null,null,null,null,null,null,null,null,null,null,null,null,null,null,null,null,null,null,null,null,null,null,null,null,null,null,null,null,null,null,null,null,null,null,null,null,null,null,null,null,null,null,null,null,null,null,null,null,null,null,null,null,null,null,null,null,null,null,null,null,0]
[null,null,null,null,null,null,null,null,null,null,null,null,null,null,null,null,null,null,null,null,null,null,null,null,null,null,null,null,null,null,null,null,null,null,null,null,null,null,null,null,null,null,null,null,null,null,null,null,null,null,null,null,null,null,null,null,null,null,null,null,null,null,null,null,0]
[null,null,null,null,null,null,null,null,null,null,null,null,null,null,null,null,null,null,null,null,null,null,null,null,null,null,null,null,null,null,null,null,null,null,null,null,null,null,null,null,null,null,null,null,null,null,null,null,null,null,null,null,null,null,null,null,null,null,null,null,null,null,null,null,0]
[null,null,null,null,null,null,null,null,null,null,null,null,null,null,null,null,null,null,null,null,null,null,null,null,null,null,null,null,null,null,null,null,null,null,null,null,null,null,null,null,null,null,null,null,null,null,null,null,null,null,null,null,null,null,null,null,null,null,null,null,null,null,null,null,0]
[null,null,null,null,null,null,null,null,null,null,null,null,null,null,null,null,null,null,null,null,null,null,null,null,null,null,null,null,null,null,null,null,null,null,null,null,null,null,null,null,null,null,null,null,null,null,null,null,null,null,null,null,null,null,null,null,null,null,null,null,null,null,null,null,0]
[null,null,null,null,null,null,null,null,null,null,null,null,null,null,null,null,null,null,null,null,null,null,null,null,null,null,null,null,null,null,null,null,null,null,null,null,null,null,null,null,null,null,null,null,null,null,null,null,null,null,null,null,null,null,null,null,null,null,null,null,null,null,null,null,0]
[null,null,null,null,null,null,null,null,null,null,null,null,null,null,null,null,null,null,null,null,null,null,null,null,null,null,null,null,null,null,null,null,null,null,null,null,null,null,null,null,null,null,null,null,null,null,null,null,null,null,null,null,null,null,null,null,null,null,null,null,null,null,null,null,0]
[null,null,null,null,null,null,null,null,null,null,null,null,null,null,null,null,null,null,null,null,null,null,null,null,null,null,null,null,null,null,null,null,null,null,null,null,null,null,null,null,null,null,null,null,null,null,null,null,null,null,null,null,null,null,null,null,null,null,null,null,null,null,null,null,0]
[null,null,null,null,null,null,null,null,null,null,null,null,null,null,null,null,null,null,null,null,null,null,null,null,null,null,null,null,null,null,null,null,null,null,null,null,null,null,null,null,null,null,null,null,null,null,null,null,null,null,null,null,null,null,null,null,null,null,null,null,null,null,null,null,0]
[null,null,null,null,null,null,null,null,null,null,null,null,null,null,null,null,null,null,null,null,null,null,null,null,null,null,null,null,null,null,null,null,null,null,null,null,null,null,null,null,null,null,null,null,null,null,null,null,null,null,null,null,null,null,null,null,null,null,null,null,null,null,null,null,0]
[null,null,null,null,null,null,null,null,null,null,null,null,null,null,null,null,null,null,null,null,null,null,null,null,null,null,null,null,null,null,null,null,null,null,null,null,null,null,null,null,null,null,null,null,null,null,null,null,null,null,null,null,null,null,null,null,null,null,null,null,null,null,null,null,0]
[null,null,null,null,null,null,null,null,null,null,null,null,null,null,null,null,null,null,null,null,null,null,null,null,null,null,null,null,null,null,null,null,null,null,null,null,null,null,null,null,null,null,null,null,null,null,null,null,null,null,null,null,null,null,null,null,null,null,null,null,null,null,null,null,0]
[null,null,null,null,null,null,null,null,null,null,null,null,null,null,null,null,null,null,null,null,null,null,null,null,null,null,null,null,null,null,null,null,null,null,null,null,null,null,null,null,null,null,null,null,null,null,null,null,null,null,null,null,null,null,null,null,null,null,null,null,null,null,null,null,0]
[null,null,null,null,null,null,null,null,null,null,null,null,null,null,null,null,null,null,null,null,null,null,null,null,null,null,null,null,null,null,null,null,null,null,null,null,null,null,null,null,null,null,null,null,null,null,null,null,null,null,null,null,null,null,null,null,null,null,null,null,null,null,null,null,0]
[null,null,null,null,null,null,null,null,null,null,null,null,null,null,null,null,null,null,null,null,null,null,null,null,null,null,null,null,null,null,null,null,null,null,null,null,null,null,null,null,null,null,null,null,null,null,null,null,null,null,null,null,null,null,null,null,null,null,null,null,null,null,null,null,0]
[null,null,null,null,null,null,null,null,null,null,null,null,null,null,null,null,null,null,null,null,null,null,null,null,null,null,null,null,null,null,null,null,null,null,null,null,null,null,null,null,null,null,null,null,null,null,null,null,null,null,null,null,null,null,null,null,null,null,null,null,null,null,null,null,0]
[null,null,null,null,null,null,null,null,null,null,null,null,null,null,null,null,null,null,null,null,null,null,null,null,null,null,null,null,null,null,null,null,null,null,null,null,null,null,null,null,null,null,null,null,null,null,null,null,null,null,null,null,null,null,null,null,null,null,null,null,null,null,null,null,0]
[null,null,null,null,null,null,null,null,null,null,null,null,null,null,null,null,null,null,null,null,null,null,null,null,null,null,null,null,null,null,null,null,null,null,null,null,null,null,null,null,null,null,null,null,null,null,null,null,null,null,null,null,null,null,null,null,null,null,null,null,null,null,null,null,0]
[null,null,null,null,null,null,null,null,null,null,null,null,null,null,null,null,null,null,null,null,null,null,null,null,null,null,null,null,null,null,null,null,null,null,null,null,null,null,null,null,null,null,null,null,null,null,null,null,null,null,null,null,null,null,null,null,null,null,null,null,null,null,null,null,0]
[null,null,null,null,null,null,null,null,null,null,null,null,null,null,null,null,null,null,null,null,null,null,null,null,null,null,null,null,null,null,null,null,null,null,null,null,null,null,null,null,null,null,null,null,null,null,null,null,null,null,null,null,null,null,null,null,null,null,null,null,null,null,null,null,0]
[null,null,null,null,null,null,null,null,null,null,null,null,null,null,null,null,null,null,null,null,null,null,null,null,null,null,null,null,null,null,null,null,null,null,null,null,null,null,null,null,null,null,null,null,null,null,null,null,null,null,null,null,null,null,null,null,null,null,null,null,null,null,null,null,0]
[null,null,null,null,null,null,null,null,null,null,null,null,null,null,null,null,null,null,null,null,null,null,null,null,null,null,null,null,null,null,null,null,null,null,null,null,null,null,null,null,null,null,null,null,null,null,null,null,null,null,null,null,null,null,null,null,null,null,null,null,null,null,null,null,0]
[null,null,null,null,null,null,null,null,null,null,null,null,null,null,null,null,null,null,null,null,null,null,null,null,null,null,null,null,null,null,null,null,null,null,null,null,null,null,null,null,null,null,null,null,null,null,null,null,null,null,null,null,null,null,null,null,null,null,null,null,null,null,null,null,0]
[null,null,null,null,null,null,null,null,null,null,null,null,null,null,null,null,null,null,null,null,null,null,null,null,null,null,null,null,null,null,null,null,null,null,null,null,null,null,null,null,null,null,null,null,null,null,null,null,null,null,null,null,null,null,null,null,null,null,null,null,null,null,null,null,0]
[null,null,null,null,null,null,null,null,null,null,null,null,null,null,null,null,null,null,null,null,null,null,null,null,null,null,null,null,null,null,null,null,null,null,null,null,null,null,null,null,null,null,null,null,null,null,null,null,null,null,null,null,null,null,null,null,null,null,null,null,null,null,null,null,0]
[null,null,null,null,null,null,null,null,null,null,null,null,null,null,null,null,null,null,null,null,null,null,null,null,null,null,null,null,null,null,null,null,null,null,null,null,null,null,null,null,null,null,null,null,null,null,null,null,null,null,null,null,null,null,null,null,null,null,null,null,null,null,null,null,0]
[null,null,null,null,null,null,null,null,null,null,null,null,null,null,null,null,null,null,null,null,null,null,null,null,null,null,null,null,null,null,null,null,null,null,null,null,null,null,null,null,null,null,null,null,null,null,null,null,null,null,null,null,null,null,null,null,null,null,null,null,null,null,null,null,0]
[null,null,null,null,null,null,null,null,null,null,null,null,null,null,null,null,null,null,null,null,null,null,null,null,null,null,null,null,null,null,null,null,null,null,null,null,null,null,null,null,null,null,null,null,null,null,null,null,null,null,null,null,null,null,null,null,null,null,null,null,null,null,null,null,0]
[null,null,null,null,null,null,null,null,null,null,null,null,null,null,null,null,null,null,null,null,null,null,null,null,null,null,null,null,null,null,null,null,null,null,null,null,null,null,null,null,null,null,null,null,null,null,null,null,null,null,null,null,null,null,null,null,null,null,null,null,null,null,null,null,0]
[null,null,null,null,null,null,null,null,null,null,null,null,null,null,null,null,null,null,null,null,null,null,null,null,null,null,null,null,null,null,null,null,null,null,null,null,null,null,null,null,null,null,null,null,null,null,null,null,null,null,null,null,null,null,null,null,null,null,null,null,null,null,null,null,0]
[null,null,null,null,null,null,null,null,null,null,null,null,null,null,null,null,null,null,null,null,null,null,null,null,null,null,null,null,null,null,null,null,null,null,null,null,null,null,null,null,null,null,null,null,null,null,null,null,null,null,null,null,null,null,null,null,null,null,null,null,null,null,null,null,0]
[null,null,null,null,null,null,null,null,null,null,null,null,null,null,null,null,null,null,null,null,null,null,null,null,null,null,null,null,null,null,null,null,null,null,null,null,null,null,null,null,null,null,null,null,null,null,null,null,null,null,null,null,null,null,null,null,null,null,null,null,null,null,null,null,0]
[null,null,null,null,null,null,null,null,null,null,null,null,null,null,null,null,null,null,null,null,null,null,null,null,null,null,null,null,null,null,null,null,null,null,null,null,null,null,null,null,null,null,null,null,null,null,null,null,null,null,null,null,null,null,null,null,null,null,null,null,null,null,null,null,0]
[null,null,null,null,null,null,null,null,null,null,null,null,null,null,null,null,null,null,null,null,null,null,null,null,null,null,null,null,null,null,null,null,null,null,null,null,null,null,null,null,null,null,null,null,null,null,null,null,null,null,null,null,null,null,null,null,null,null,null,null,null,null,null,null,0]
[null,null,null,null,null,null,null,null,null,null,null,null,null,null,null,null,null,null,null,null,null,null,null,null,null,null,null,null,null,null,null,null,null,null,null,null,null,null,null,null,null,null,null,null,null,null,null,null,null,null,null,null,null,null,null,null,null,null,null,null,null,null,null,null,0]
[null,null,null,null,null,null,null,null,null,null,null,null,null,null,null,null,null,null,null,null,null,null,null,null,null,null,null,null,null,null,null,null,null,null,null,null,null,null,null,null,null,null,null,null,null,null,null,null,null,null,null,null,null,null,null,null,null,null,null,null,null,null,null,null,0]
[null,null,null,null,null,null,null,null,null,null,null,null,null,null,null,null,null,null,null,null,null,null,null,null,null,null,null,null,null,null,null,null,null,null,null,null,null,null,null,null,null,null,null,null,null,null,null,null,null,null,null,null,null,null,null,null,null,null,null,null,null,null,null,null,0]
[null,null,null,null,null,null,null,null,null,null,null,null,null,null,null,null,null,null,null,null,null,null,null,null,null,null,null,null,null,null,null,null,null,null,null,null,null,null,null,null,null,null,null,null,null,null,null,null,null,null,null,null,null,null,null,null,null,null,null,null,null,null,null,null,0]
[null,null,null,null,null,null,null,null,null,null,null,null,null,null,null,null,null,null,null,null,null,null,null,null,null,null,null,null,null,null,null,null,null,null,null,null,null,null,null,null,null,null,null,null,null,null,null,null,null,null,null,null,null,null,null,null,null,null,null,null,null,null,null,null,0]
[null,null,null,null,null,null,null,null,null,null,null,null,null,null,null,null,null,null,null,null,null,null,null,null,null,null,null,null,null,null,null,null,null,null,null,null,null,null,null,null,null,null,null,null,null,null,null,null,null,null,null,null,null,null,null,null,null,null,null,null,null,null,null,null,0]
[null,null,null,null,null,null,null,null,null,null,null,null,null,null,null,null,null,null,null,null,null,null,null,null,null,null,null,null,null,null,null,null,null,null,null,null,null,null,null,null,null,null,null,null,null,null,null,null,null,null,null,null,null,null,null,null,null,null,null,null,null,null,null,null,0]
[null,null,null,null,null,null,null,null,null,null,null,null,null,null,null,null,null,null,null,null,null,null,null,null,null,null,null,null,null,null,null,null,null,null,null,null,null,null,null,null,null,null,null,null,null,null,null,null,null,null,null,null,null,null,null,null,null,null,null,null,null,null,null,null,0]
[null,null,null,null,null,null,null,null,null,null,null,null,null,null,null,null,null,null,null,null,null,null,null,null,null,null,null,null,null,null,null,null,null,null,null,null,null,null,null,null,null,null,null,null,null,null,null,null,null,null,null,null,null,null,null,null,null,null,null,null,null,null,null,null,0]
[null,null,null,null,null,null,null,null,null,null,null,null,null,null,null,null,null,null,null,null,null,null,null,null,null,null,null,null,null,null,null,null,null,null,null,null,null,null,null,null,null,null,null,null,null,null,null,null,null,null,null,null,null,null,null,null,null,null,null,null,null,null,null,null,0]
[null,null,null,null,null,null,null,null,null,null,null,null,null,null,null,null,null,null,null,null,null,null,null,null,null,null,null,null,null,null,null,null,null,null,null,null,null,null,null,null,null,null,null,null,null,null,null,null,null,null,null,null,null,null,null,null,null,null,null,null,null,null,null,null,0]
[null,null,null,null,null,null,null,null,null,null,null,null,null,null,null,null,null,null,null,null,null,null,null,null,null,null,null,null,null,null,null,null,null,null,null,null,null,null,null,null,null,null,null,null,null,null,null,null,null,null,null,null,null,null,null,null,null,null,null,null,null,null,null,null,0]
[null,null,null,null,null,null,null,null,null,null,null,null,null,null,null,null,null,null,null,null,null,null,null,null,null,null,null,null,null,null,null,null,null,null,null,null,null,null,null,null,null,null,null,null,null,null,null,null,null,null,null,null,null,null,null,null,null,null,null,null,null,null,null,null,0]
[null,null,null,null,null,null,null,null,null,null,null,null,null,null,null,null,null,null,null,null,null,null,null,null,null,null,null,null,null,null,null,null,null,null,null,null,null,null,null,null,null,null,null,null,null,null,null,null,null,null,null,null,null,null,null,null,null,null,null,null,null,null,null,null,0]
[null,null,null,null,null,null,null,null,null,null,null,null,null,null,null,null,null,null,null,null,null,null,null,null,null,null,null,null,null,null,null,null,null,null,null,null,null,null,null,null,null,null,null,null,null,null,null,null,null,null,null,null,null,null,null,null,null,null,null,null,null,null,null,null,0]
[null,null,null,null,null,null,null,null,null,null,null,null,null,null,null,null,null,null,null,null,null,null,null,null,null,null,null,null,null,null,null,null,null,null,null,null,null,null,null,null,null,null,null,null,null,null,null,null,null,null,null,null,null,null,null,null,null,null,null,null,null,null,null,null,0]
[null,null,null,null,null,null,null,null,null,null,null,null,null,null,null,null,null,null,null,null,null,null,null,null,null,null,null,null,null,null,null,null,null,null,null,null,null,null,null,null,null,null,null,null,null,null,null,null,null,null,null,null,null,null,null,null,null,null,null,null,null,null,null,null,0]
[null,null,null,null,null,null,null,null,null,null,null,null,null,null,null,null,null,null,null,null,null,null,null,null,null,null,null,null,null,null,null,null,null,null,null,null,null,null,null,null,null,null,null,null,null,null,null,null,null,null,null,null,null,null,null,null,null,null,null,null,null,null,null,null,0]
[null,null,null,null,null,null,null,null,null,null,null,null,null,null,null,null,null,null,null,null,null,null,null,null,null,null,null,null,null,null,null,null,null,null,null,null,null,null,null,null,null,null,null,null,null,null,null,null,null,null,null,null,null,null,null,null,null,null,null,null,null,null,null,null,0]
[null,null,null,null,null,null,null,null,null,null,null,null,null,null,null,null,null,null,null,null,null,null,null,null,null,null,null,null,null,null,null,null,null,null,null,null,null,null,null,null,null,null,null,null,null,null,null,null,null,null,null,null,null,null,null,null,null,null,null,null,null,null,null,null,0]
[null,null,null,null,null,null,null,null,null,null,null,null,null,null,null,null,null,null,null,null,null,null,null,null,null,null,null,null,null,null,null,null,null,null,null,null,null,null,null,null,null,null,null,null,null,null,null,null,null,null,null,null,null,null,null,null,null,null,null,null,null,null,null,null,0]
[null,null,null,null,null,null,null,null,null,null,null,null,null,null,null,null,null,null,null,null,null,null,null,null,null,null,null,null,null,null,null,null,null,null,null,null,null,null,null,null,null,null,null,null,null,null,null,null,null,null,null,null,null,null,null,null,null,null,null,null,null,null,null,null,0]
[null,null,null,null,null,null,null,null,null,null,null,null,null,null,null,null,null,null,null,null,null,null,null,null,null,null,null,null,null,null,null,null,null,null,null,null,null,null,null,null,null,null,null,null,null,null,null,null,null,null,null,null,null,null,null,null,null,null,null,null,null,null,null,null,0]
[null,null,null,null,null,null,null,null,null,null,null,null,null,null,null,null,null,null,null,null,null,null,null,null,null,null,null,null,null,null,null,null,null,null,null,null,null,null,null,null,null,null,null,null,null,null,null,null,null,null,null,null,null,null,null,null,null,null,null,null,null,null,null,null,0]
[null,null,null,null,null,null,null,null,null,null,null,null,null,null,null,null,null,null,null,null,null,null,null,null,null,null,null,null,null,null,null,null,null,null,null,null,null,null,null,null,null,null,null,null,null,null,null,null,null,null,null,null,null,null,null,null,null,null,null,null,null,null,null,null,{"$f":"COUNTA(C72:BL72)/2","v":0}]
[null,null,null,null,null,null,null,null,null,null,null,null,null,null,null,null,null,null,null,null,null,null,null,null,null,null,null,null,null,null,null,null,null,null,null,null,null,null,null,null,null,null,null,null,null,null,null,null,null,null,null,null,null,null,null,null,null,null,null,null,null,null,null,null,0]
[null,null,null,null,null,null,null,null,null,null,null,null,null,null,null,null,null,null,null,null,null,null,null,null,null,null,null,null,null,null,null,null,null,null,null,null,null,null,null,null,null,null,null,null,null,null,null,null,null,null,null,null,null,null,null,null,null,null,null,null,null,null,null,null,0]
[null,null,null,null,null,null,null,null,null,null,null,null,null,null,null,null,null,null,null,null,null,null,null,null,null,null,null,null,null,null,null,null,null,null,null,null,null,null,null,null,null,null,null,null,null,null,null,null,null,null,null,null,null,null,null,null,null,null,null,null,null,null,null,null,0]
[null,null,null,null,null,null,null,null,null,null,null,null,null,null,null,null,null,null,null,null,null,null,null,null,null,null,null,null,null,null,null,null,null,null,null,null,null,null,null,null,null,null,null,null,null,null,null,null,null,null,null,null,null,null,null,null,null,null,null,null,null,null,null,null,0]
[null,null,null,null,null,null,null,null,null,null,null,null,null,null,null,null,null,null,null,null,null,null,null,null,null,null,null,null,null,null,null,null,null,null,null,null,null,null,null,null,null,null,null,null,null,null,null,null,null,null,null,null,null,null,null,null,null,null,null,null,null,null,null,null,0]
[null,null,null,null,null,null,null,null,null,null,null,null,null,null,null,null,null,null,null,null,null,null,null,null,null,null,null,null,null,null,null,null,null,null,null,null,null,null,null,null,null,null,null,null,null,null,null,null,null,null,null,null,null,null,null,null,null,null,null,null,null,null,null,null,0]
[null,null,null,null,null,null,null,null,null,null,null,null,null,null,null,null,null,null,null,null,null,null,null,null,null,null,null,null,null,null,null,null,null,null,null,null,null,null,null,null,null,null,null,null,null,null,null,null,null,null,null,null,null,null,null,null,null,null,null,null,null,null,null,null,0]
[null,null,null,null,null,null,null,null,null,null,null,null,null,null,null,null,null,null,null,null,null,null,null,null,null,null,null,null,null,null,null,null,null,null,null,null,null,null,null,null,null,null,null,null,null,null,null,null,null,null,null,null,null,null,null,null,null,null,null,null,null,null,null,null,0]
[null,null,null,null,null,null,null,null,null,null,null,null,null,null,null,null,null,null,null,null,null,null,null,null,null,null,null,null,null,null,null,null,null,null,null,null,null,null,null,null,null,null,null,null,null,null,null,null,null,null,null,null,null,null,null,null,null,null,null,null,null,null,null,null,0]
[null,null,null,null,null,null,null,null,null,null,null,null,null,null,null,null,null,null,null,null,null,null,null,null,null,null,null,null,null,null,null,null,null,null,null,null,null,null,null,null,null,null,null,null,null,null,null,null,null,null,null,null,null,null,null,null,null,null,null,null,null,null,null,null,0]
[null,null,null,null,null,null,null,null,null,null,null,null,null,null,null,null,null,null,null,null,null,null,null,null,null,null,null,null,null,null,null,null,null,null,null,null,null,null,null,null,null,null,null,null,null,null,null,null,null,null,null,null,null,null,null,null,null,null,null,null,null,null,null,null,0]
[null,null,null,null,null,null,null,null,null,null,null,null,null,null,null,null,null,null,null,null,null,null,null,null,null,null,null,null,null,null,null,null,null,null,null,null,null,null,null,null,null,null,null,null,null,null,null,null,null,null,null,null,null,null,null,null,null,null,null,null,null,null,null,null,0]
[null,null,null,null,null,null,null,null,null,null,null,null,null,null,null,null,null,null,null,null,null,null,null,null,null,null,null,null,null,null,null,null,null,null,null,null,null,null,null,null,null,null,null,null,null,null,null,null,null,null,null,null,null,null,null,null,null,null,null,null,null,null,null,null,0]
[null,null,null,null,null,null,null,null,null,null,null,null,null,null,null,null,null,null,null,null,null,null,null,null,null,null,null,null,null,null,null,null,null,null,null,null,null,null,null,null,null,null,null,null,null,null,null,null,null,null,null,null,null,null,null,null,null,null,null,null,null,null,null,null,0]
[null,null,null,null,null,null,null,null,null,null,null,null,null,null,null,null,null,null,null,null,null,null,null,null,null,null,null,null,null,null,null,null,null,null,null,null,null,null,null,null,null,null,null,null,null,null,null,null,null,null,null,null,null,null,null,null,null,null,null,null,null,null,null,null,0]
[null,null,null,null,null,null,null,null,null,null,null,null,null,null,null,null,null,null,null,null,null,null,null,null,null,null,null,null,null,null,null,null,null,null,null,null,null,null,null,null,null,null,null,null,null,null,null,null,null,null,null,null,null,null,null,null,null,null,null,null,null,null,null,null,0]
[null,null,null,null,null,null,null,null,null,null,null,null,null,null,null,null,null,null,null,null,null,null,null,null,null,null,null,null,null,null,null,null,null,null,null,null,null,null,null,null,null,null,null,null,null,null,null,null,null,null,null,null,null,null,null,null,null,null,null,null,null,null,null,null,0]
[null,null,null,null,null,null,null,null,null,null,null,null,null,null,null,null,null,null,null,null,null,null,null,null,null,null,null,null,null,null,null,null,null,null,null,null,null,null,null,null,null,null,null,null,null,null,null,null,null,null,null,null,null,null,null,null,null,null,null,null,null,null,null,null,0]
[null,null,null,null,null,null,null,null,null,null,null,null,null,null,null,null,null,null,null,null,null,null,null,null,null,null,null,null,null,null,null,null,null,null,null,null,null,null,null,null,null,null,null,null,null,null,null,null,null,null,null,null,null,null,null,null,null,null,null,null,null,null,null,null,0]
[null,null,null,null,null,null,null,null,null,null,null,null,null,null,null,null,null,null,null,null,null,null,null,null,null,null,null,null,null,null,null,null,null,null,null,null,null,null,null,null,null,null,null,null,null,null,null,null,null,null,null,null,null,null,null,null,null,null,null,null,null,null,null,null,0]
[null,null,null,null,null,null,null,null,null,null,null,null,null,null,null,null,null,null,null,null,null,null,null,null,null,null,null,null,null,null,null,null,null,null,null,null,null,null,null,null,null,null,null,null,null,null,null,null,null,null,null,null,null,null,null,null,null,null,null,null,null,null,null,null,0]
[null,null,null,null,null,null,null,null,null,null,null,null,null,null,null,null,null,null,null,null,null,null,null,null,null,null,null,null,null,null,null,null,null,null,null,null,null,null,null,null,null,null,null,null,null,null,null,null,null,null,null,null,null,null,null,null,null,null,null,null,null,null,null,null,0]
[null,null,null,null,null,null,null,null,null,null,null,null,null,null,null,null,null,null,null,null,null,null,null,null,null,null,null,null,null,null,null,null,null,null,null,null,null,null,null,null,null,null,null,null,null,null,null,null,null,null,null,null,null,null,null,null,null,null,null,null,null,null,null,null,0]
[null,null,null,null,null,null,null,null,null,null,null,null,null,null,null,null,null,null,null,null,null,null,null,null,null,null,null,null,null,null,null,null,null,null,null,null,null,null,null,null,null,null,null,null,null,null,null,null,null,null,null,null,null,null,null,null,null,null,null,null,null,null,null,null,0]
[null,null,null,null,null,null,null,null,null,null,null,null,null,null,null,null,null,null,null,null,null,null,null,null,null,null,null,null,null,null,null,null,null,null,null,null,null,null,null,null,null,null,null,null,null,null,null,null,null,null,null,null,null,null,null,null,null,null,null,null,null,null,null,null,0]
[null,null,null,null,null,null,null,null,null,null,null,null,null,null,null,null,null,null,null,null,null,null,null,null,null,null,null,null,null,null,null,null,null,null,null,null,null,null,null,null,null,null,null,null,null,null,null,null,null,null,null,null,null,null,null,null,null,null,null,null,null,null,null,null,0]
[null,null,null,null,null,null,null,null,null,null,null,null,null,null,null,null,null,null,null,null,null,null,null,null,null,null,null,null,null,null,null,null,null,null,null,null,null,null,null,null,null,null,null,null,null,null,null,null,null,null,null,null,null,null,null,null,null,null,null,null,null,null,null,null,0]
[null,null,null,null,null,null,null,null,null,null,null,null,null,null,null,null,null,null,null,null,null,null,null,null,null,null,null,null,null,null,null,null,null,null,null,null,null,null,null,null,null,null,null,null,null,null,null,null,null,null,null,null,null,null,null,null,null,null,null,null,null,null,null,null,0]