{"text_format":"1","workbook":"xlsx","n_sheets":3,"sheets":["Trajectoire","Delta","Sheet1"],"not_rendered":{"charts":0,"images":2,"macros":1,"external_links":0,"defined_names":3,"comments":1,"pivot_tables":0},"unopened":[],"bounds":{"document_bytes":16777216,"sheet_cells":100000,"rows_first":2000,"rows_last":500,"rows_between":2000,"halvings":0,"cell_chars":16384,"cell_head_chars":4096},"cells_cut":0,"cells_raw":0,"read":"whole","date_system":"1900"}

{"sheet":"Trajectoire","index":0,"n_rows":142,"n_cols":21,"rows_kept":142,"cut":false,"hidden":false,"merged":[[3,0,3,5],[4,0,4,5],[5,0,5,5],[6,0,6,5],[7,0,7,5]]}
[]
["Trajectoire des livrables"]
[]
["Livrable nouveau (% d'avancement = 0%)"]
["Livrable terminé / validé (% d'avancement = 100%)"]
["Livrable en cours (0 % < % d'avancement < 100 %)"]
["Livrable en retard (% d'avancement < 100% et date d'échéance dépassée)"]
["Livrable abandonné (statut = \"Abandonné\")"]
[]
["ID","Chantier","Sous-Chantier","Activité","Nouvelle activité","Date d'entrée","Livrable","Périmètre et objectif du livrable","Resp. du traitement","%","Statut","Date d'échéance","Date de livraison / dernière MAJ","Livrable Critique ou Majeur","Commentaires / Point d'avancement","Delta","Date d'entrée renseignée","Périmètre et objectif du livrable renseigné","Statut renseigné","Date d'échéance renseignée","Date de livraison non renseignée"]
["PILOTAGE",null,null,null,null,null,null,null,null,null,null,null,null,null,null,{"$f":"IF(AND(TODAY()-L11>15,OR(K11=\"A valider\",K11=\"Diffusé\",K11=\"Validé\")),\"A\",IF(AND(TODAY()-L11>15,TODAY()-L11<30,K11=\"Abandonné\"),\"B\",IF(AND(TODAY()-L11,K11=\"Récurrent\"),\"C\",IF(AND(TODAY()-L11<30,OR(K11=\"En Attente\",K11=\"En cours\",K11=\"En cours de mise à jour\",K11=\"Nouveau\")),\"D\",\"E\"))))","v":"E"}]
["PILO_001","Pilotage",null,null,null,null,null,null,null,null,null,null,null,null,null,"E"]
["PILO_002","Pilotage",null,null,null,null,null,null,null,null,null,null,null,null,null,"E"]
["PILO_003","Pilotage",null,null,null,null,null,null,null,null,null,null,null,null,null,"E"]
["PILO_004","Pilotage",null,null,null,null,null,null,null,null,null,null,null,null,null,"E"]
["PILO_005","Pilotage",null,null,null,null,null,null,null,null,null,null,null,null,null,"E"]
["PILO_006","Pilotage",null,null,null,null,null,null,null,null,null,null,null,null,null,"E"]
["PILO_007","Pilotage",null,null,null,null,null,null,null,null,null,null,null,null,null,"E"]
["PILO_008","Pilotage",null,null,null,null,null,null,null,null,null,null,null,null,null,"E"]
["PILO_009","Pilotage",null,null,null,null,null,null,null,null,null,null,null,null,null,"E"]
["PILO_010","Pilotage",null,null,null,null,null,null,null,null,null,null,null,null,null,"E"]
["PILO_011","Pilotage",null,null,null,null,null,null,null,null,null,null,null,null,null,"E"]
["PILO_012","Pilotage",null,null,null,null,null,null,null,null,null,null,null,null,null,"E"]
["PILO_013","Pilotage",null,null,null,null,null,null,null,null,null,null,null,null,null,"E"]
["SECURISATION V17",null,null,null,null,null,null,null,null,null,null,null,null,null,null,"E"]
["SECU_001","Securisation",null,null,null,null,null,null,null,null,null,null,null,null,null,"E"]
["SECU_002","Securisation",null,null,null,null,null,null,null,null,null,null,null,null,null,"E"]
["SECU_003","Securisation",null,null,null,null,null,null,null,null,null,null,null,null,null,"E"]
["SECU_004","Securisation",null,null,null,null,null,null,null,null,null,null,null,null,null,"E"]
["SECU_005","Securisation",null,null,null,null,null,null,null,null,null,null,null,null,null,"E"]
["SECU_006","Securisation",null,null,null,null,null,null,null,null,null,null,null,null,null,"E"]
["SECU_007","Securisation",null,null,null,null,null,null,null,null,null,null,null,null,null,"E"]
["SECU_008","Securisation",null,null,null,null,null,null,null,null,null,null,null,null,null,"E"]
["PROFESSIONNALISATION",null,null,null,null,null,null,null,null,"x",null,null,null,null,null,"E"]
["PROF_001","Professionnalisation",{"$f":"IF(ISERROR(VLOOKUP(D35,#REF!,2,0)),\"\",VLOOKUP(D35,#REF!,2,0))","v":""},"Stratégie de professionnalisation","Stratégie de professionnalisation","2014-03-13","Stratégie de professionnalisation",null,null,1,"Validé","2014-03-12",null,"C",null,"A",{"$f":"IF(F35<>\"\",0,1)","v":0},{"$f":"IF(H35<>\"\",0,1)","v":1},{"$f":"IF(K35<>\"\",0,1)","v":0},{"$f":"IF(L35<>\"\",0,1)","v":0},{"$f":"IF(AND(J36=1,M35=\"\"),1,0)","v":0}]
["PROF_002","Professionnalisation",{"$f":"IF(ISERROR(VLOOKUP(D36,#REF!,2,0)),\"\",VLOOKUP(D36,#REF!,2,0))","v":""},"Stratégie de professionnalisation","Stratégie de professionnalisation","2014-03-13","Définition des parties prenantes","rôles et responsabilités",null,0.1,"Abandonné","2014-03-07",null,null,null,"E",0,0,0,0,1]
["PROF_003","Professionnalisation",{"$f":"IF(ISERROR(VLOOKUP(D37,#REF!,2,0)),\"\",VLOOKUP(D37,#REF!,2,0))","v":""},"Stratégie de professionnalisation","Plan de formation / Planning de déploiement","2014-03-13","Planning de formation V0",null,null,1,"Validé","2014-03-30",null,null,null,"A",0,1,0,0,0]
["PROF_004","Professionnalisation",{"$f":"IF(ISERROR(VLOOKUP(D38,#REF!,2,0)),\"\",VLOOKUP(D38,#REF!,2,0))","v":""},"Stratégie de professionnalisation","Plan de formation / Planning de déploiement","2014-03-13","Planning de formation V1",null,null,0,"Nouveau","2014-06-30",null,null,null,"E",0,1,0,0,1]
["PROF_005","Professionnalisation",{"$f":"IF(ISERROR(VLOOKUP(D39,#REF!,2,0)),\"\",VLOOKUP(D39,#REF!,2,0))","v":""},"Animation du réseau","Animation du réseau","2014-03-13","Modalités d’animation du réseau Professionnalisation en régions ","dont rôles et responsabilités",null,1,"Validé","2014-03-30",null,null,null,"A",0,0,0,0,0]
["PROF_006","Professionnalisation",{"$f":"IF(ISERROR(VLOOKUP(D40,#REF!,2,0)),\"\",VLOOKUP(D40,#REF!,2,0))","v":""},"Analyse d’écarts","Analyse d’écarts","2014-03-13","Cartographie des compétences actuelles","livrable découpé en 2 livrables (RC + Vente)",null,0.5,"Abandonné","2014-03-30",null,"C",null,"E",0,0,0,0,1]
["PROF_007","Professionnalisation",{"$f":"IF(ISERROR(VLOOKUP(D41,#REF!,2,0)),\"\",VLOOKUP(D41,#REF!,2,0))","v":""},"Analyse d’écarts","Analyse d’écarts","2014-02-25","Reprise des fichiers régionaux",null,null,1,"Validé","2014-03-30",null,null,null,"A",0,1,0,0,1]
["PROF_008","Professionnalisation",{"$f":"IF(ISERROR(VLOOKUP(D42,#REF!,2,0)),\"\",VLOOKUP(D42,#REF!,2,0))","v":""},"Analyse d’écarts","Analyse d’écarts","2014-02-26","Cartographie des compétences existantes (niveau national) Vente","Analyse Excel",null,1,"Diffusé","2014-04-09",null,null,null,"A",0,0,0,0,1]
["PROF_009","Professionnalisation",{"$f":"IF(ISERROR(VLOOKUP(D43,#REF!,2,0)),\"\",VLOOKUP(D43,#REF!,2,0))","v":""},"Analyse d’écarts","Analyse d’écarts","2014-02-27","Cartographie des compétences existantes (par région) Vente","Analyse Excel",null,1,"Diffusé","2014-04-09",null,null,null,"A",0,0,0,0,1]
["PROF_010","Professionnalisation",{"$f":"IF(ISERROR(VLOOKUP(D44,#REF!,2,0)),\"\",VLOOKUP(D44,#REF!,2,0))","v":""},"Analyse d’écarts","Analyse d’écarts","2014-02-28","Cartographie des compétences existantes (niveau national) RC","Analyse Excel",null,1,"Diffusé","2014-05-15",null,null,null,"A",0,0,0,0,{"$f":"IF(AND(J46=1,M44=\"\"),1,0)","v":1}]
["PROF_011","Professionnalisation",{"$f":"IF(ISERROR(VLOOKUP(D45,#REF!,2,0)),\"\",VLOOKUP(D45,#REF!,2,0))","v":""},"Analyse d’écarts","Analyse d’écarts","2014-03-01","Cartographie des compétences existantes (par région) RC","Analyse Excel",null,1,"Diffusé","2014-05-15",null,null,null,"A",0,0,{"$f":"IF(K45<>\"\",0,1)","v":0},{"$f":"IF(L45<>\"\",0,1)","v":0},{"$f":"IF(AND(J47=1,M45=\"\"),1,0)","v":1}]
["PROF_012","Professionnalisation",{"$f":"IF(ISERROR(VLOOKUP(D46,#REF!,2,0)),\"\",VLOOKUP(D46,#REF!,2,0))","v":""},"Analyse d’écarts","Analyse d’écarts","2014-03-02","Analyse d'écart Compétences Vente (restitution)","PPT",null,1,"Diffusé","2014-04-09",null,null,null,"A",0,0,0,{"$f":"IF(L46<>\"\",0,1)","v":0},{"$f":"IF(AND(J48=1,M46=\"\"),1,0)","v":0}]
["PROF_013","Professionnalisation",{"$f":"IF(ISERROR(VLOOKUP(D47,#REF!,2,0)),\"\",VLOOKUP(D47,#REF!,2,0))","v":""},"Analyse d’écarts","Analyse d’écarts","2014-03-03","Analyse d'écart Compétences RC (restitution)","PPT",null,1,"Diffusé","2014-05-15",null,null,null,"A",0,0,0,{"$f":"IF(L47<>\"\",0,1)","v":0},{"$f":"IF(AND(J48=1,M47=\"\"),1,0)","v":0}]
["PROF_014","Professionnalisation",{"$f":"IF(ISERROR(VLOOKUP(D48,#REF!,2,0)),\"\",VLOOKUP(D48,#REF!,2,0))","v":""},"Analyse d’écarts","Analyse d’écarts","2014-03-04","Analyse d'écart documentation de formation Gestes métier",null,null,0.1,"En cours","2014-07-15",null,null,null,"E",0,1,0,0,0]
["PROF_015","Professionnalisation",{"$f":"IF(ISERROR(VLOOKUP(D49,#REF!,2,0)),\"\",VLOOKUP(D49,#REF!,2,0))","v":""},"Analyse d’écarts","Analyse d’écarts","2014-03-05","Analyse d'écart Bases documentaires",null,null,0,"Nouveau","2014-06-30",null,null,null,"E",0,1,0,0,1]
["PROF_016","Professionnalisation",{"$f":"IF(ISERROR(VLOOKUP(D50,#REF!,2,0)),\"\",VLOOKUP(D50,#REF!,2,0))","v":""},"Evaluation de la performance de la formation","Evaluation de la performance de la formation","2014-03-06","Cahier des charges Evaluation de la performance de la formation (amont / aval)","Comprend le dispositif global d'évaluation de la performance de la formation + le dispositif d'autodiagnostic\nDéfinition des niveaux d'évaluation\nDéfinition du dispositif d'évaluation de la performance",null,1,"Diffusé","2014-03-07",null,null,null,"A",0,0,0,0,0]
["PROF_017","Professionnalisation",{"$f":"IF(ISERROR(VLOOKUP(D51,#REF!,2,0)),\"\",VLOOKUP(D51,#REF!,2,0))","v":""},"Evaluation de la performance de la formation","Evaluation de la performance de la formation","2014-03-07","Déploiement outil de suivi de la montée en compétence","à renommer outil d'éval à froid",null,0,"Abandonné","2014-07-30",null,null,null,"B",0,0,0,0,0]
["PROF_018","Professionnalisation",{"$f":"IF(ISERROR(VLOOKUP(D52,#REF!,2,0)),\"\",VLOOKUP(D52,#REF!,2,0))","v":""},"Autodiagnostic","Autodiagnostic","2014-03-08","Outil d'autodiagnostic",null,null,0,"Abandonné","2014-05-30",null,null,null,"E",0,1,0,0,0]
["PROF_019","Professionnalisation",{"$f":"IF(ISERROR(VLOOKUP(D53,#REF!,2,0)),\"\",VLOOKUP(D53,#REF!,2,0))","v":""},"Définition des offres managers","Construction des offres de formation","2014-03-09","Grands principes du parcours manager",null,null,0.75,"Abandonné","2014-03-14",null,null,null,"E",0,1,0,0,1]
["PROF_020","Professionnalisation",{"$f":"IF(ISERROR(VLOOKUP(D54,#REF!,2,0)),\"\",VLOOKUP(D54,#REF!,2,0))","v":""},"Définition des offres managers ","Construction des offres de formation","2014-03-10","Grands principes du parcours managers",null,null,1,"Validé","2014-03-11","2014-03-11",null,null,"A",0,1,0,0,0]
["PROF_021","Professionnalisation",{"$f":"IF(ISERROR(VLOOKUP(D55,#REF!,2,0)),\"\",VLOOKUP(D55,#REF!,2,0))","v":""},"Définition des offres managers","Construction des offres de formation","2014-03-11","Parcours managers","Liste des thèmes + modules + durées",null,0.25,"En cours","2014-07-15",null,null,null,"E",0,0,0,0,1]
["PROF_022","Professionnalisation",{"$f":"IF(ISERROR(VLOOKUP(D56,#REF!,2,0)),\"\",VLOOKUP(D56,#REF!,2,0))","v":""},"Définition des offres managers","Construction des offres de formation","2014-03-12","Parcours managers Vente","Liste des thèmes + modules + durées",null,1,"Validé","2014-05-16",null,null,null,"A",0,0,0,0,0]
["PROF_023","Professionnalisation",{"$f":"IF(ISERROR(VLOOKUP(D57,#REF!,2,0)),\"\",VLOOKUP(D57,#REF!,2,0))","v":""},"Définition des offres ","Construction des offres de formation","2014-03-13","Grands principes des parcours",null,null,0,"Abandonné","2014-03-30",null,null,null,"E",0,1,0,0,0]
["PROF_024","Professionnalisation",{"$f":"IF(ISERROR(VLOOKUP(D58,#REF!,2,0)),\"\",VLOOKUP(D58,#REF!,2,0))","v":""},"Définition des offres de formation Vente","Construction des offres de formation","2014-03-14","Liste de toutes les offres","Identification de tous les parcours côté",null,0.25,"En cours","2014-06-30",null,null,null,"E",0,0,0,0,0]
["PROF_025","Professionnalisation",{"$f":"IF(ISERROR(VLOOKUP(D59,#REF!,2,0)),\"\",VLOOKUP(D59,#REF!,2,0))","v":""},"Définition des offres de formation Vente","Construction des offres de formation","2014-03-15","Offre Vente","Liste des thèmes + modules + durées",null,0.95,"En cours","2014-06-25",null,null,null,"E",0,0,0,0,0]
["PROF_026","Professionnalisation",{"$f":"IF(ISERROR(VLOOKUP(D60,#REF!,2,0)),\"\",VLOOKUP(D60,#REF!,2,0))","v":""},"Définition des offres","Construction des offres de formation","2014-03-16","Grands principes des parcours",null,null,0,"Abandonné","2014-04-30",null,null,null,"E",0,1,0,0,0]
{"$rows_left_out":83}
{"sheet":"Delta","index":1,"n_rows":12,"n_cols":4,"rows_kept":12,"cut":false,"hidden":false,"merged":[]}
[null,"début",null,"fin"]
["Étiquettes de lignes"]
["A valider",-15,null,"pas de limite"]
["Abandonné","-15","today-échéance",30]
["Diffusé",-15,"today-échéance","pas de limite"]
["En attente","pas de limite","today-échéance",30]
["En cours","pas de limite","today-échéance",30]
["En cours de mise à jour","pas de limite","today-échéance",30]
["Nouveau","pas de limite","today-échéance",30]
["Récurrent","pas de limite","today-échéance"]
["Validé",-15,"today-échéance","pas de limite"]
["(vide)"]

{"sheet":"Sheet1","index":2,"n_rows":199,"n_cols":13,"rows_kept":199,"cut":false,"hidden":false,"merged":[]}
[]
[]
[]
[]
[]
[null,null,null,null,null,null,null,null,null,null,null,{"$f":"Trajectoire!K11","v":0},{"$f":"Trajectoire!B12","v":"Pilotage"}]
[null,null,null,null,null,null,null,null,null,null,null,{"$f":"Trajectoire!K12","v":0},{"$f":"Trajectoire!B13","v":"Pilotage"}]
[null,null,null,null,null,null,null,null,null,null,null,{"$f":"Trajectoire!K13","v":0},{"$f":"Trajectoire!B14","v":"Pilotage"}]
[null,null,null,null,null,null,null,null,null,null,null,{"$f":"Trajectoire!K14","v":0},{"$f":"Trajectoire!B15","v":"Pilotage"}]
[null,null,null,null,null,null,null,null,null,null,null,{"$f":"Trajectoire!K15","v":0},{"$f":"Trajectoire!B16","v":"Pilotage"}]
[null,null,null,null,null,null,null,null,null,null,null,{"$f":"Trajectoire!K16","v":0},{"$f":"Trajectoire!B17","v":"Pilotage"}]
[null,null,null,null,null,null,null,null,null,null,null,{"$f":"Trajectoire!K17","v":0},{"$f":"Trajectoire!B18","v":"Pilotage"}]
[null,null,null,null,null,null,null,null,null,null,null,{"$f":"Trajectoire!K18","v":0},{"$f":"Trajectoire!B19","v":"Pilotage"}]
[null,null,null,null,null,null,null,null,null,null,null,{"$f":"Trajectoire!K19","v":0},{"$f":"Trajectoire!B20","v":"Pilotage"}]
[null,null,null,null,null,null,null,null,null,null,null,{"$f":"Trajectoire!K20","v":0},{"$f":"Trajectoire!B21","v":"Pilotage"}]
[null,null,null,null,null,null,null,null,null,null,null,{"$f":"Trajectoire!K21","v":0},{"$f":"Trajectoire!B22","v":"Pilotage"}]
[null,null,null,null,null,null,null,null,null,null,null,{"$f":"Trajectoire!K22","v":0},{"$f":"Trajectoire!B23","v":"Pilotage"}]
[null,null,null,null,null,null,null,null,null,null,null,{"$f":"Trajectoire!K23","v":0},{"$f":"Trajectoire!B24","v":"Pilotage"}]
[null,null,null,null,null,null,null,null,null,null,null,{"$f":"Trajectoire!K24","v":0},{"$f":"Trajectoire!B25","v":0}]
[null,null,null,null,null,null,null,null,null,null,null,{"$f":"Trajectoire!K25","v":0},{"$f":"Trajectoire!B26","v":"Securisation"}]
[null,null,null,null,null,null,null,null,null,null,null,{"$f":"Trajectoire!K26","v":0},{"$f":"Trajectoire!B27","v":"Securisation"}]
[null,null,null,null,null,null,null,null,null,null,null,{"$f":"Trajectoire!K27","v":0},{"$f":"Trajectoire!B28","v":"Securisation"}]
[null,null,null,null,null,null,null,null,null,null,null,{"$f":"Trajectoire!K28","v":0},{"$f":"Trajectoire!B29","v":"Securisation"}]
[null,null,null,null,null,null,null,null,null,null,null,{"$f":"Trajectoire!K29","v":0},{"$f":"Trajectoire!B30","v":"Securisation"}]
[null,null,null,null,null,null,null,null,null,null,null,{"$f":"Trajectoire!K30","v":0},{"$f":"Trajectoire!B31","v":"Securisation"}]
[null,null,null,null,null,null,null,null,null,null,null,{"$f":"Trajectoire!K31","v":0},{"$f":"Trajectoire!B32","v":"Securisation"}]
[null,null,null,null,null,null,null,null,null,null,null,{"$f":"Trajectoire!K32","v":0},{"$f":"Trajectoire!B33","v":"Securisation"}]
[null,null,null,null,null,null,null,null,null,null,null,{"$f":"Trajectoire!K33","v":0},{"$f":"Trajectoire!B34","v":0}]
[null,null,null,null,null,null,null,null,null,null,null,{"$f":"Trajectoire!K34","v":0},{"$f":"Trajectoire!B35","v":"Professionnalisation"}]
[null,null,null,null,null,null,null,null,null,null,null,{"$f":"Trajectoire!K35","v":"Validé"},{"$f":"Trajectoire!B36","v":"Professionnalisation"}]
[null,null,null,null,null,null,null,null,null,null,null,{"$f":"Trajectoire!K36","v":"Abandonné"},{"$f":"Trajectoire!B37","v":"Professionnalisation"}]
[null,null,null,null,null,null,null,null,null,null,null,{"$f":"Trajectoire!K37","v":"Validé"},{"$f":"Trajectoire!B38","v":"Professionnalisation"}]
[null,null,null,null,null,null,null,null,null,null,null,{"$f":"Trajectoire!K38","v":"Nouveau"},{"$f":"Trajectoire!B39","v":"Professionnalisation"}]
[null,null,null,null,null,null,null,null,null,null,null,{"$f":"Trajectoire!K39","v":"Validé"},{"$f":"Trajectoire!B40","v":"Professionnalisation"}]
[null,null,null,null,null,null,null,null,null,null,null,{"$f":"Trajectoire!K40","v":"Abandonné"},{"$f":"Trajectoire!B41","v":"Professionnalisation"}]
[null,null,null,null,null,null,null,null,null,null,null,{"$f":"Trajectoire!K41","v":"Validé"},{"$f":"Trajectoire!B42","v":"Professionnalisation"}]
[null,null,null,null,null,null,null,null,null,null,null,{"$f":"Trajectoire!K42","v":"Diffusé"},{"$f":"Trajectoire!B43","v":"Professionnalisation"}]
[null,null,null,null,null,null,null,null,null,null,null,{"$f":"Trajectoire!K43","v":"Diffusé"},{"$f":"Trajectoire!B44","v":"Professionnalisation"}]
[null,null,null,null,null,null,null,null,null,null,null,{"$f":"Trajectoire!K44","v":"Diffusé"},{"$f":"Trajectoire!B45","v":"Professionnalisation"}]
[null,null,null,null,null,null,null,null,null,null,null,{"$f":"Trajectoire!K45","v":"Diffusé"},{"$f":"Trajectoire!B46","v":"Professionnalisation"}]
[null,null,null,null,null,null,null,null,null,null,null,{"$f":"Trajectoire!K46","v":"Diffusé"},{"$f":"Trajectoire!B47","v":"Professionnalisation"}]
[null,null,null,null,null,null,null,null,null,null,null,{"$f":"Trajectoire!K47","v":"Diffusé"},{"$f":"Trajectoire!B48","v":"Professionnalisation"}]
[null,null,null,null,null,null,null,null,null,null,null,{"$f":"Trajectoire!K48","v":"En cours"},{"$f":"Trajectoire!B49","v":"Professionnalisation"}]
[null,null,null,null,null,null,null,null,null,null,null,{"$f":"Trajectoire!K49","v":"Nouveau"},{"$f":"Trajectoire!B50","v":"Professionnalisation"}]
[null,null,null,null,null,null,null,null,null,null,null,{"$f":"Trajectoire!K50","v":"Diffusé"},{"$f":"Trajectoire!B51","v":"Professionnalisation"}]
[null,null,null,null,null,null,null,null,null,null,null,{"$f":"Trajectoire!K51","v":"Abandonné"},{"$f":"Trajectoire!B52","v":"Professionnalisation"}]
[null,null,null,null,null,null,null,null,null,null,null,{"$f":"Trajectoire!K52","v":"Abandonné"},{"$f":"Trajectoire!B53","v":"Professionnalisation"}]
[null,null,null,null,null,null,null,null,null,null,null,{"$f":"Trajectoire!K53","v":"Abandonné"},{"$f":"Trajectoire!B54","v":"Professionnalisation"}]
[null,null,null,null,null,null,null,null,null,null,null,{"$f":"Trajectoire!K54","v":"Validé"},{"$f":"Trajectoire!B55","v":"Professionnalisation"}]
[null,null,null,null,null,null,null,null,null,null,null,{"$f":"Trajectoire!K55","v":"En cours"},{"$f":"Trajectoire!B56","v":"Professionnalisation"}]
[null,null,null,null,null,null,null,null,null,null,null,{"$f":"Trajectoire!K56","v":"Validé"},{"$f":"Trajectoire!B57","v":"Professionnalisation"}]
[null,null,null,null,null,null,null,null,null,null,null,{"$f":"Trajectoire!K57","v":"Abandonné"},{"$f":"Trajectoire!B58","v":"Professionnalisation"}]
[null,null,null,null,null,null,null,null,null,null,null,{"$f":"Trajectoire!K58","v":"En cours"},{"$f":"Trajectoire!B59","v":"Professionnalisation"}]
[null,null,null,null,null,null,null,null,null,null,null,{"$f":"Trajectoire!K59","v":"En cours"},{"$f":"Trajectoire!B60","v":"Professionnalisation"}]
[null,null,null,null,null,null,null,null,null,null,null,{"$f":"Trajectoire!K60","v":"Abandonné"},{"$f":"Trajectoire!B61","v":"Professionnalisation"}]
[null,null,null,null,null,null,null,null,null,null,null,{"$f":"Trajectoire!K61","v":"En cours"},{"$f":"Trajectoire!B62","v":"Professionnalisation"}]
[null,null,null,null,null,null,null,null,null,null,null,{"$f":"Trajectoire!K62","v":"En cours"},{"$f":"Trajectoire!B63","v":"Professionnalisation"}]
[null,null,null,null,null,null,null,null,null,null,null,{"$f":"Trajectoire!K63","v":"Abandonné"},{"$f":"Trajectoire!B64","v":"Professionnalisation"}]
[null,null,null,null,null,null,null,null,null,null,null,{"$f":"Trajectoire!K64","v":"Récurrent"},{"$f":"Trajectoire!B65","v":"Professionnalisation"}]
[null,null,null,null,null,null,null,null,null,null,null,{"$f":"Trajectoire!K65","v":"Récurrent"},{"$f":"Trajectoire!B66","v":"Professionnalisation"}]
{"$rows_left_out":139}