{"text_format":"1","workbook":"xlsx","n_sheets":2,"sheets":["Feuil2","Feuil1"],"not_rendered":{"charts":0,"images":0,"macros":0,"external_links":0,"defined_names":0,"comments":0,"pivot_tables":0},"unopened":[],"bounds":{"document_bytes":16777216,"sheet_cells":100000,"rows_first":2000,"rows_last":500,"rows_between":2000,"halvings":0,"cell_chars":16384,"cell_head_chars":4096},"cells_cut":0,"cells_raw":0,"read":"whole","date_system":"1900"}

{"sheet":"Feuil2","index":0,"n_rows":2,"n_cols":13,"rows_kept":2,"cut":false,"hidden":false,"merged":[]}
["2013-02-09","2013-02-10","2013-02-11","2013-02-12","2013-02-13","2013-02-14","2013-02-15","2013-02-16","2013-02-17","2013-02-18","2013-02-19","2013-02-20","2013-02-21"]
["Roger","Paul","Marcel","André","Kevin","Simone","Léa","Lucas","Eric","Gilles","Jacqueline","Monique","Claude"]

{"sheet":"Feuil1","index":1,"n_rows":18,"n_cols":4,"rows_kept":18,"cut":false,"hidden":false,"merged":[]}
[null,null,"2013-02-09",{"$f":"IF(COUNTIF(Feuil2!$A$1:$M$1,C1),HLOOKUP(C1,Feuil2!$A$1:$M$2,2,0),\"\")","v":"Roger"}]
[null,null,"2013-03-03",{"$f":"IF(COUNTIF(Feuil2!$A$1:$M$1,C2),HLOOKUP(C2,Feuil2!$A$1:$M$2,2,0),\"\")","v":""}]
[null,null,"2013-02-12",{"$f":"IF(COUNTIF(Feuil2!$A$1:$M$1,C3),HLOOKUP(C3,Feuil2!$A$1:$M$2,2,0),\"\")","v":"André"}]
[null,null,"2013-01-04",{"$f":"IF(COUNTIF(Feuil2!$A$1:$M$1,C4),HLOOKUP(C4,Feuil2!$A$1:$M$2,2,0),\"\")","v":""}]
[null,null,"2013-02-15",{"$f":"IF(COUNTIF(Feuil2!$A$1:$M$1,C5),HLOOKUP(C5,Feuil2!$A$1:$M$2,2,0),\"\")","v":"Léa"}]
[null,null,null,{"$f":"IF(COUNTIF(Feuil2!$A$1:$M$1,C6),HLOOKUP(C6,Feuil2!$A$1:$M$2,2,0),\"\")","v":""}]
[null,null,null,{"$f":"IF(COUNTIF(Feuil2!$A$1:$M$1,C7),HLOOKUP(C7,Feuil2!$A$1:$M$2,2,0),\"\")","v":""}]
[null,null,null,{"$f":"IF(COUNTIF(Feuil2!$A$1:$M$1,C8),HLOOKUP(C8,Feuil2!$A$1:$M$2,2,0),\"\")","v":""}]
[null,null,null,{"$f":"IF(COUNTIF(Feuil2!$A$1:$M$1,C9),HLOOKUP(C9,Feuil2!$A$1:$M$2,2,0),\"\")","v":""}]
[null,null,null,{"$f":"IF(COUNTIF(Feuil2!$A$1:$M$1,C10),HLOOKUP(C10,Feuil2!$A$1:$M$2,2,0),\"\")","v":""}]
[null,null,null,{"$f":"IF(COUNTIF(Feuil2!$A$1:$M$1,C11),HLOOKUP(C11,Feuil2!$A$1:$M$2,2,0),\"\")","v":""}]
[null,null,null,{"$f":"IF(COUNTIF(Feuil2!$A$1:$M$1,C12),HLOOKUP(C12,Feuil2!$A$1:$M$2,2,0),\"\")","v":""}]
[null,null,null,{"$f":"IF(COUNTIF(Feuil2!$A$1:$M$1,C13),HLOOKUP(C13,Feuil2!$A$1:$M$2,2,0),\"\")","v":""}]
[null,null,null,{"$f":"IF(COUNTIF(Feuil2!$A$1:$M$1,C14),HLOOKUP(C14,Feuil2!$A$1:$M$2,2,0),\"\")","v":""}]
[null,null,null,{"$f":"IF(COUNTIF(Feuil2!$A$1:$M$1,C15),HLOOKUP(C15,Feuil2!$A$1:$M$2,2,0),\"\")","v":""}]
[null,null,null,{"$f":"IF(COUNTIF(Feuil2!$A$1:$M$1,C16),HLOOKUP(C16,Feuil2!$A$1:$M$2,2,0),\"\")","v":""}]
[null,null,null,{"$f":"IF(COUNTIF(Feuil2!$A$1:$M$1,C17),HLOOKUP(C17,Feuil2!$A$1:$M$2,2,0),\"\")","v":""}]
[null,null,null,{"$f":"IF(COUNTIF(Feuil2!$A$1:$M$1,C18),HLOOKUP(C18,Feuil2!$A$1:$M$2,2,0),\"\")","v":""}]